[INFO] Scanning for projects...
[INFO]                                                                         
[INFO] ------------------------------------------------------------------------
[INFO] Building Joda-Time 2.8.1
[INFO] ------------------------------------------------------------------------
[INFO] 
[INFO] --- maven-resources-plugin:2.7:resources (default-resources) @ joda-time ---
[INFO] Using 'UTF-8' encoding to copy filtered resources.
[INFO] Copying 2 resources to META-INF
[INFO] Copying 10 resources
[INFO] 
[INFO] --- maven-compiler-plugin:3.3:compile (default-compile) @ joda-time ---
[INFO] Changes detected - recompiling the module!
[INFO] Compiling 166 source files to /home/perham/Study/LittleDarwin/Cases/joda-time-2.8.1/target/classes
[INFO] 
[INFO] --- exec-maven-plugin:1.4.0:java (compile-tzdb) @ joda-time ---
Writing zoneinfo files
Writing ZoneInfoMap
[INFO] 
[INFO] --- maven-resources-plugin:2.7:testResources (default-testResources) @ joda-time ---
[INFO] Using 'UTF-8' encoding to copy filtered resources.
[INFO] Copying 34 resources
[INFO] 
[INFO] --- maven-compiler-plugin:3.3:testCompile (default-testCompile) @ joda-time ---
[INFO] Nothing to compile - all classes are up to date
[INFO] 
[INFO] --- maven-surefire-plugin:2.18.1:test (default-test) @ joda-time ---
[INFO] Surefire report directory: /home/perham/Study/LittleDarwin/Cases/joda-time-2.8.1/target/surefire-reports

-------------------------------------------------------
 T E S T S
-------------------------------------------------------
Running org.joda.time.TestAllPackages

TestBuddhistChronology.testCalendar

TestCopticChronology.testCalendar

TestEthiopicChronology.testCalendar

TestIslamicChronology.testCalendar

Testing Gregorian chronology over 1000 iterations
100% complete (i=1000)

Testing Julian chronology over 1000 iterations
100% complete (i=1000)
Writing zoneinfo files
Writing ZoneInfoMap
Tests run: 4157, Failures: 44, Errors: 190, Skipped: 0, Time elapsed: 5.372 sec <<< FAILURE! - in org.joda.time.TestAllPackages
testConstructor_Object_DateTimeZone(org.joda.time.TestDateTime_Constructors)  Time elapsed: 0.005 sec  <<< ERROR!
java.lang.ClassCastException: java.util.Date cannot be cast to java.lang.String
	at org.joda.time.convert.StringConverter.getInstantMillis(StringConverter.java:63)
	at org.joda.time.base.BaseDateTime.<init>(BaseDateTime.java:154)
	at org.joda.time.DateTime.<init>(DateTime.java:281)
	at org.joda.time.TestDateTime_Constructors.testConstructor_Object_DateTimeZone(TestDateTime_Constructors.java:482)

testConstructor_Object_nullDateTimeZone(org.joda.time.TestDateTime_Constructors)  Time elapsed: 0.001 sec  <<< ERROR!
java.lang.ClassCastException: java.util.Date cannot be cast to java.lang.String
	at org.joda.time.convert.StringConverter.getInstantMillis(StringConverter.java:63)
	at org.joda.time.base.BaseDateTime.<init>(BaseDateTime.java:154)
	at org.joda.time.DateTime.<init>(DateTime.java:281)
	at org.joda.time.TestDateTime_Constructors.testConstructor_Object_nullDateTimeZone(TestDateTime_Constructors.java:511)

testConstructor_nullObject_nullDateTimeZone(org.joda.time.TestDateTime_Constructors)  Time elapsed: 0.001 sec  <<< ERROR!
java.lang.IllegalArgumentException: No instant converter found for type: null
	at org.joda.time.convert.ConverterManager.getInstantConverter(ConverterManager.java:165)
	at org.joda.time.base.BaseDateTime.<init>(BaseDateTime.java:151)
	at org.joda.time.DateTime.<init>(DateTime.java:281)
	at org.joda.time.TestDateTime_Constructors.testConstructor_nullObject_nullDateTimeZone(TestDateTime_Constructors.java:520)

testConstructor_nullObject_nullChronology(org.joda.time.TestDateTime_Constructors)  Time elapsed: 0.001 sec  <<< ERROR!
java.lang.IllegalArgumentException: No instant converter found for type: null
	at org.joda.time.convert.ConverterManager.getInstantConverter(ConverterManager.java:165)
	at org.joda.time.base.BaseDateTime.<init>(BaseDateTime.java:173)
	at org.joda.time.DateTime.<init>(DateTime.java:302)
	at org.joda.time.TestDateTime_Constructors.testConstructor_nullObject_nullChronology(TestDateTime_Constructors.java:582)

testConstructor_nullObject(org.joda.time.TestMutableDateTime_Constructors)  Time elapsed: 0 sec  <<< ERROR!
java.lang.NullPointerException
	at org.joda.time.convert.ReadableInstantConverter.getChronology(ReadableInstantConverter.java:84)
	at org.joda.time.base.BaseDateTime.<init>(BaseDateTime.java:174)
	at org.joda.time.MutableDateTime.<init>(MutableDateTime.java:256)
	at org.joda.time.TestMutableDateTime_Constructors.testConstructor_nullObject(TestMutableDateTime_Constructors.java:310)

testConstructor_nullObject_nullDateTimeZone(org.joda.time.TestMutableDateTime_Constructors)  Time elapsed: 0.001 sec  <<< ERROR!
java.lang.IllegalArgumentException: No instant converter found for type: null
	at org.joda.time.convert.ConverterManager.getInstantConverter(ConverterManager.java:165)
	at org.joda.time.base.BaseDateTime.<init>(BaseDateTime.java:151)
	at org.joda.time.MutableDateTime.<init>(MutableDateTime.java:279)
	at org.joda.time.TestMutableDateTime_Constructors.testConstructor_nullObject_nullDateTimeZone(TestMutableDateTime_Constructors.java:372)

testConstructor_nullObject_nullChronology(org.joda.time.TestMutableDateTime_Constructors)  Time elapsed: 0 sec  <<< ERROR!
java.lang.IllegalArgumentException: No instant converter found for type: null
	at org.joda.time.convert.ConverterManager.getInstantConverter(ConverterManager.java:165)
	at org.joda.time.base.BaseDateTime.<init>(BaseDateTime.java:173)
	at org.joda.time.MutableDateTime.<init>(MutableDateTime.java:299)
	at org.joda.time.TestMutableDateTime_Constructors.testConstructor_nullObject_nullChronology(TestMutableDateTime_Constructors.java:434)

testConstructor_nullObject_nullDateTimeZone(org.joda.time.TestDateMidnight_Constructors)  Time elapsed: 0.001 sec  <<< ERROR!
java.lang.IllegalArgumentException: No instant converter found for type: null
	at org.joda.time.convert.ConverterManager.getInstantConverter(ConverterManager.java:165)
	at org.joda.time.base.BaseDateTime.<init>(BaseDateTime.java:151)
	at org.joda.time.DateMidnight.<init>(DateMidnight.java:281)
	at org.joda.time.TestDateMidnight_Constructors.testConstructor_nullObject_nullDateTimeZone(TestDateMidnight_Constructors.java:391)

testConstructor_nullObject_nullChronology(org.joda.time.TestDateMidnight_Constructors)  Time elapsed: 0.001 sec  <<< ERROR!
java.lang.IllegalArgumentException: No instant converter found for type: null
	at org.joda.time.convert.ConverterManager.getInstantConverter(ConverterManager.java:165)
	at org.joda.time.base.BaseDateTime.<init>(BaseDateTime.java:173)
	at org.joda.time.DateMidnight.<init>(DateMidnight.java:303)
	at org.joda.time.TestDateMidnight_Constructors.testConstructor_nullObject_nullChronology(TestDateMidnight_Constructors.java:453)

testConstructor_Object3(org.joda.time.TestDuration_Constructors)  Time elapsed: 0 sec  <<< ERROR!
java.lang.ClassCastException: java.lang.Long cannot be cast to java.lang.String
	at org.joda.time.convert.StringConverter.getDurationMillis(StringConverter.java:102)
	at org.joda.time.base.BaseDuration.<init>(BaseDuration.java:105)
	at org.joda.time.Duration.<init>(Duration.java:210)
	at org.joda.time.TestDuration_Constructors.testConstructor_Object3(TestDuration_Constructors.java:239)

testConstructor_Object5(org.joda.time.TestDuration_Constructors)  Time elapsed: 0 sec  <<< ERROR!
java.lang.ClassCastException: org.joda.time.Interval cannot be cast to java.lang.String
	at org.joda.time.convert.StringConverter.getDurationMillis(StringConverter.java:102)
	at org.joda.time.base.BaseDuration.<init>(BaseDuration.java:105)
	at org.joda.time.Duration.<init>(Duration.java:210)
	at org.joda.time.TestDuration_Constructors.testConstructor_Object5(TestDuration_Constructors.java:255)

testConstructor_Object_Chronology1(org.joda.time.TestInterval_Constructors)  Time elapsed: 0.001 sec  <<< FAILURE!
junit.framework.AssertionFailedError: expected:<1086732000000> but was:<1234>
	at junit.framework.Assert.fail(Assert.java:47)
	at junit.framework.Assert.failNotEquals(Assert.java:280)
	at junit.framework.Assert.assertEquals(Assert.java:64)
	at junit.framework.Assert.assertEquals(Assert.java:133)
	at junit.framework.Assert.assertEquals(Assert.java:139)
	at org.joda.time.TestInterval_Constructors.testConstructor_Object_Chronology1(TestInterval_Constructors.java:688)

testConstructor_Object_Chronology2(org.joda.time.TestInterval_Constructors)  Time elapsed: 0.001 sec  <<< FAILURE!
junit.framework.AssertionFailedError: expected:<1086732000000> but was:<1234>
	at junit.framework.Assert.fail(Assert.java:47)
	at junit.framework.Assert.failNotEquals(Assert.java:280)
	at junit.framework.Assert.assertEquals(Assert.java:64)
	at junit.framework.Assert.assertEquals(Assert.java:133)
	at junit.framework.Assert.assertEquals(Assert.java:139)
	at org.joda.time.TestInterval_Constructors.testConstructor_Object_Chronology2(TestInterval_Constructors.java:699)

testConstructor_Object1(org.joda.time.TestInterval_Constructors)  Time elapsed: 0.001 sec  <<< FAILURE!
junit.framework.AssertionFailedError: expected:<1086732000000> but was:<1234>
	at junit.framework.Assert.fail(Assert.java:47)
	at junit.framework.Assert.failNotEquals(Assert.java:280)
	at junit.framework.Assert.assertEquals(Assert.java:64)
	at junit.framework.Assert.assertEquals(Assert.java:133)
	at junit.framework.Assert.assertEquals(Assert.java:139)
	at org.joda.time.TestInterval_Constructors.testConstructor_Object1(TestInterval_Constructors.java:536)

testConstructor_Object2(org.joda.time.TestInterval_Constructors)  Time elapsed: 0.001 sec  <<< FAILURE!
junit.framework.AssertionFailedError: expected:<1086732000000> but was:<1234>
	at junit.framework.Assert.fail(Assert.java:47)
	at junit.framework.Assert.failNotEquals(Assert.java:280)
	at junit.framework.Assert.assertEquals(Assert.java:64)
	at junit.framework.Assert.assertEquals(Assert.java:133)
	at junit.framework.Assert.assertEquals(Assert.java:139)
	at org.joda.time.TestInterval_Constructors.testConstructor_Object2(TestInterval_Constructors.java:546)

testConstructor_Object3(org.joda.time.TestInterval_Constructors)  Time elapsed: 0.001 sec  <<< FAILURE!
junit.framework.AssertionFailedError: expected:<1086732000000> but was:<1234>
	at junit.framework.Assert.fail(Assert.java:47)
	at junit.framework.Assert.failNotEquals(Assert.java:280)
	at junit.framework.Assert.assertEquals(Assert.java:64)
	at junit.framework.Assert.assertEquals(Assert.java:133)
	at junit.framework.Assert.assertEquals(Assert.java:139)
	at org.joda.time.TestInterval_Constructors.testConstructor_Object3(TestInterval_Constructors.java:556)

testToString_reparse(org.joda.time.TestInterval_Basics)  Time elapsed: 0 sec  <<< FAILURE!
junit.framework.AssertionFailedError: expected:<2004-06-09T07:08:09.010+02:00/2005-08-13T12:14:16.018+02:00> but was:<1970-01-01T01:00:01.234+01:00/1970-01-01T01:00:05.678+01:00>
	at junit.framework.Assert.fail(Assert.java:47)
	at junit.framework.Assert.failNotEquals(Assert.java:280)
	at junit.framework.Assert.assertEquals(Assert.java:64)
	at junit.framework.Assert.assertEquals(Assert.java:71)
	at org.joda.time.TestInterval_Basics.testToString_reparse(TestInterval_Basics.java:1053)

testConstructor_Object_nullChronology(org.joda.time.TestLocalDateTime_Constructors)  Time elapsed: 0 sec  <<< FAILURE!
junit.framework.AssertionFailedError: expected:<4> but was:<6>
	at junit.framework.Assert.fail(Assert.java:47)
	at junit.framework.Assert.failNotEquals(Assert.java:280)
	at junit.framework.Assert.assertEquals(Assert.java:64)
	at junit.framework.Assert.assertEquals(Assert.java:198)
	at junit.framework.Assert.assertEquals(Assert.java:204)
	at org.joda.time.TestLocalDateTime_Constructors.testConstructor_Object_nullChronology(TestLocalDateTime_Constructors.java:649)

testConstructor_ObjectLocalDateTime(org.joda.time.TestLocalDateTime_Constructors)  Time elapsed: 0 sec  <<< FAILURE!
junit.framework.AssertionFailedError: expected:<BuddhistChronology[UTC]> but was:<ISOChronology[UTC]>
	at junit.framework.Assert.fail(Assert.java:47)
	at junit.framework.Assert.failNotEquals(Assert.java:280)
	at junit.framework.Assert.assertEquals(Assert.java:64)
	at junit.framework.Assert.assertEquals(Assert.java:71)
	at org.joda.time.TestLocalDateTime_Constructors.testConstructor_ObjectLocalDateTime(TestLocalDateTime_Constructors.java:472)

testConstructor_ObjectLocalDate(org.joda.time.TestLocalDateTime_Constructors)  Time elapsed: 0.001 sec  <<< ERROR!
java.lang.ClassCastException: org.joda.time.LocalDate cannot be cast to java.util.Date
	at org.joda.time.convert.DateConverter.getInstantMillis(DateConverter.java:55)
	at org.joda.time.convert.AbstractConverter.getPartialValues(AbstractConverter.java:101)
	at org.joda.time.convert.AbstractConverter.getPartialValues(AbstractConverter.java:123)
	at org.joda.time.LocalDateTime.<init>(LocalDateTime.java:414)
	at org.joda.time.LocalDateTime.<init>(LocalDateTime.java:358)
	at org.joda.time.TestLocalDateTime_Constructors.testConstructor_ObjectLocalDate(TestLocalDateTime_Constructors.java:485)

testConstructor_ObjectLocalTime(org.joda.time.TestLocalDateTime_Constructors)  Time elapsed: 0.001 sec  <<< FAILURE!
junit.framework.AssertionFailedError
	at junit.framework.Assert.fail(Assert.java:47)
	at junit.framework.Assert.fail(Assert.java:53)
	at org.joda.time.TestLocalDateTime_Constructors.testConstructor_ObjectLocalTime(TestLocalDateTime_Constructors.java:494)

testConstructor_Object_Chronology_crossChronology(org.joda.time.TestLocalDateTime_Constructors)  Time elapsed: 0 sec  <<< FAILURE!
junit.framework.AssertionFailedError: expected:<1970> but was:<2513>
	at junit.framework.Assert.fail(Assert.java:47)
	at junit.framework.Assert.failNotEquals(Assert.java:280)
	at junit.framework.Assert.assertEquals(Assert.java:64)
	at junit.framework.Assert.assertEquals(Assert.java:198)
	at junit.framework.Assert.assertEquals(Assert.java:204)
	at org.joda.time.TestLocalDateTime_Constructors.testConstructor_Object_Chronology_crossChronology(TestLocalDateTime_Constructors.java:595)

testConstructor_Object_ChronologyMoscow(org.joda.time.TestLocalDateTime_Constructors)  Time elapsed: 0.003 sec  <<< ERROR!
java.lang.ClassCastException: java.lang.String cannot be cast to java.util.Date
	at org.joda.time.convert.DateConverter.getInstantMillis(DateConverter.java:55)
	at org.joda.time.convert.AbstractConverter.getPartialValues(AbstractConverter.java:101)
	at org.joda.time.convert.AbstractConverter.getPartialValues(AbstractConverter.java:123)
	at org.joda.time.LocalDateTime.<init>(LocalDateTime.java:414)
	at org.joda.time.TestLocalDateTime_Constructors.testConstructor_Object_ChronologyMoscow(TestLocalDateTime_Constructors.java:605)

testConstructor_Object_ChronologyMoscowBadDateTime(org.joda.time.TestLocalDateTime_Constructors)  Time elapsed: 0 sec  <<< ERROR!
java.lang.ClassCastException: java.lang.String cannot be cast to java.util.Date
	at org.joda.time.convert.DateConverter.getInstantMillis(DateConverter.java:55)
	at org.joda.time.convert.AbstractConverter.getPartialValues(AbstractConverter.java:101)
	at org.joda.time.convert.AbstractConverter.getPartialValues(AbstractConverter.java:123)
	at org.joda.time.LocalDateTime.<init>(LocalDateTime.java:414)
	at org.joda.time.TestLocalDateTime_Constructors.testConstructor_Object_ChronologyMoscowBadDateTime(TestLocalDateTime_Constructors.java:621)

testConstructor_ObjectStringEx3(org.joda.time.TestLocalDateTime_Constructors)  Time elapsed: 0 sec  <<< ERROR!
java.lang.ClassCastException: java.lang.String cannot be cast to java.util.Date
	at org.joda.time.convert.DateConverter.getInstantMillis(DateConverter.java:55)
	at org.joda.time.convert.AbstractConverter.getPartialValues(AbstractConverter.java:101)
	at org.joda.time.convert.AbstractConverter.getPartialValues(AbstractConverter.java:123)
	at org.joda.time.LocalDateTime.<init>(LocalDateTime.java:414)
	at org.joda.time.LocalDateTime.<init>(LocalDateTime.java:358)
	at org.joda.time.TestLocalDateTime_Constructors.testConstructor_ObjectStringEx3(TestLocalDateTime_Constructors.java:443)

testConstructor_ObjectStringEx4(org.joda.time.TestLocalDateTime_Constructors)  Time elapsed: 0.001 sec  <<< ERROR!
java.lang.ClassCastException: java.lang.String cannot be cast to java.util.Date
	at org.joda.time.convert.DateConverter.getInstantMillis(DateConverter.java:55)
	at org.joda.time.convert.AbstractConverter.getPartialValues(AbstractConverter.java:101)
	at org.joda.time.convert.AbstractConverter.getPartialValues(AbstractConverter.java:123)
	at org.joda.time.LocalDateTime.<init>(LocalDateTime.java:414)
	at org.joda.time.LocalDateTime.<init>(LocalDateTime.java:358)
	at org.joda.time.TestLocalDateTime_Constructors.testConstructor_ObjectStringEx4(TestLocalDateTime_Constructors.java:450)

testConstructor_ObjectStringEx5(org.joda.time.TestLocalDateTime_Constructors)  Time elapsed: 0 sec  <<< ERROR!
java.lang.ClassCastException: java.lang.String cannot be cast to java.util.Date
	at org.joda.time.convert.DateConverter.getInstantMillis(DateConverter.java:55)
	at org.joda.time.convert.AbstractConverter.getPartialValues(AbstractConverter.java:101)
	at org.joda.time.convert.AbstractConverter.getPartialValues(AbstractConverter.java:123)
	at org.joda.time.LocalDateTime.<init>(LocalDateTime.java:414)
	at org.joda.time.LocalDateTime.<init>(LocalDateTime.java:358)
	at org.joda.time.TestLocalDateTime_Constructors.testConstructor_ObjectStringEx5(TestLocalDateTime_Constructors.java:457)

testConstructor_ObjectStringEx6(org.joda.time.TestLocalDateTime_Constructors)  Time elapsed: 0.001 sec  <<< ERROR!
java.lang.ClassCastException: java.lang.String cannot be cast to java.util.Date
	at org.joda.time.convert.DateConverter.getInstantMillis(DateConverter.java:55)
	at org.joda.time.convert.AbstractConverter.getPartialValues(AbstractConverter.java:101)
	at org.joda.time.convert.AbstractConverter.getPartialValues(AbstractConverter.java:123)
	at org.joda.time.LocalDateTime.<init>(LocalDateTime.java:414)
	at org.joda.time.LocalDateTime.<init>(LocalDateTime.java:358)
	at org.joda.time.TestLocalDateTime_Constructors.testConstructor_ObjectStringEx6(TestLocalDateTime_Constructors.java:464)

testConstructor_nullObject(org.joda.time.TestLocalDate_Constructors)  Time elapsed: 0.001 sec  <<< ERROR!
java.lang.NullPointerException
	at org.joda.time.format.DateTimeFormatterBuilder$NumberFormatter.parseInto(DateTimeFormatterBuilder.java:1304)
	at org.joda.time.format.DateTimeFormatterBuilder$Composite.parseInto(DateTimeFormatterBuilder.java:2462)
	at org.joda.time.format.InternalParserDateTimeParser.parseInto(InternalParserDateTimeParser.java:52)
	at org.joda.time.format.DateTimeFormatterBuilder$MatchingParser.parseInto(DateTimeFormatterBuilder.java:2556)
	at org.joda.time.format.DateTimeParserBucket.doParseMillis(DateTimeParserBucket.java:179)
	at org.joda.time.format.DateTimeFormatter.parseMillis(DateTimeFormatter.java:780)
	at org.joda.time.convert.StringConverter.getPartialValues(StringConverter.java:87)
	at org.joda.time.LocalDate.<init>(LocalDate.java:419)
	at org.joda.time.LocalDate.<init>(LocalDate.java:363)
	at org.joda.time.TestLocalDate_Constructors.testConstructor_nullObject(TestLocalDate_Constructors.java:325)

testConstructor_ObjectString1(org.joda.time.TestLocalDate_Constructors)  Time elapsed: 0.001 sec  <<< ERROR!
java.lang.ClassCastException: java.lang.String cannot be cast to java.util.Date
	at org.joda.time.convert.DateConverter.getInstantMillis(DateConverter.java:55)
	at org.joda.time.convert.AbstractConverter.getPartialValues(AbstractConverter.java:101)
	at org.joda.time.convert.AbstractConverter.getPartialValues(AbstractConverter.java:123)
	at org.joda.time.LocalDate.<init>(LocalDate.java:419)
	at org.joda.time.LocalDate.<init>(LocalDate.java:363)
	at org.joda.time.TestLocalDate_Constructors.testConstructor_ObjectString1(TestLocalDate_Constructors.java:333)

testConstructor_ObjectString2(org.joda.time.TestLocalDate_Constructors)  Time elapsed: 0 sec  <<< ERROR!
java.lang.ClassCastException: java.lang.String cannot be cast to java.util.Date
	at org.joda.time.convert.DateConverter.getInstantMillis(DateConverter.java:55)
	at org.joda.time.convert.AbstractConverter.getPartialValues(AbstractConverter.java:101)
	at org.joda.time.convert.AbstractConverter.getPartialValues(AbstractConverter.java:123)
	at org.joda.time.LocalDate.<init>(LocalDate.java:419)
	at org.joda.time.LocalDate.<init>(LocalDate.java:363)
	at org.joda.time.TestLocalDate_Constructors.testConstructor_ObjectString2(TestLocalDate_Constructors.java:341)

testConstructor_ObjectString3(org.joda.time.TestLocalDate_Constructors)  Time elapsed: 0.001 sec  <<< ERROR!
java.lang.ClassCastException: java.lang.String cannot be cast to java.util.Date
	at org.joda.time.convert.DateConverter.getInstantMillis(DateConverter.java:55)
	at org.joda.time.convert.AbstractConverter.getPartialValues(AbstractConverter.java:101)
	at org.joda.time.convert.AbstractConverter.getPartialValues(AbstractConverter.java:123)
	at org.joda.time.LocalDate.<init>(LocalDate.java:419)
	at org.joda.time.LocalDate.<init>(LocalDate.java:363)
	at org.joda.time.TestLocalDate_Constructors.testConstructor_ObjectString3(TestLocalDate_Constructors.java:349)

testConstructor_ObjectStringEx1(org.joda.time.TestLocalDate_Constructors)  Time elapsed: 0 sec  <<< ERROR!
java.lang.ClassCastException: java.lang.String cannot be cast to java.util.Date
	at org.joda.time.convert.DateConverter.getInstantMillis(DateConverter.java:55)
	at org.joda.time.convert.AbstractConverter.getPartialValues(AbstractConverter.java:101)
	at org.joda.time.convert.AbstractConverter.getPartialValues(AbstractConverter.java:123)
	at org.joda.time.LocalDate.<init>(LocalDate.java:419)
	at org.joda.time.LocalDate.<init>(LocalDate.java:363)
	at org.joda.time.TestLocalDate_Constructors.testConstructor_ObjectStringEx1(TestLocalDate_Constructors.java:358)

testConstructor_ObjectStringEx2(org.joda.time.TestLocalDate_Constructors)  Time elapsed: 0.001 sec  <<< ERROR!
java.lang.ClassCastException: java.lang.String cannot be cast to java.util.Date
	at org.joda.time.convert.DateConverter.getInstantMillis(DateConverter.java:55)
	at org.joda.time.convert.AbstractConverter.getPartialValues(AbstractConverter.java:101)
	at org.joda.time.convert.AbstractConverter.getPartialValues(AbstractConverter.java:123)
	at org.joda.time.LocalDate.<init>(LocalDate.java:419)
	at org.joda.time.LocalDate.<init>(LocalDate.java:363)
	at org.joda.time.TestLocalDate_Constructors.testConstructor_ObjectStringEx2(TestLocalDate_Constructors.java:365)

testConstructor_nullObject_DateTimeZone(org.joda.time.TestLocalDate_Constructors)  Time elapsed: 0 sec  <<< ERROR!
java.lang.NullPointerException
	at org.joda.time.format.DateTimeFormatterBuilder$NumberFormatter.parseInto(DateTimeFormatterBuilder.java:1304)
	at org.joda.time.format.DateTimeFormatterBuilder$Composite.parseInto(DateTimeFormatterBuilder.java:2462)
	at org.joda.time.format.InternalParserDateTimeParser.parseInto(InternalParserDateTimeParser.java:52)
	at org.joda.time.format.DateTimeFormatterBuilder$MatchingParser.parseInto(DateTimeFormatterBuilder.java:2556)
	at org.joda.time.format.DateTimeParserBucket.doParseMillis(DateTimeParserBucket.java:179)
	at org.joda.time.format.DateTimeFormatter.parseMillis(DateTimeFormatter.java:780)
	at org.joda.time.convert.StringConverter.getPartialValues(StringConverter.java:87)
	at org.joda.time.LocalDate.<init>(LocalDate.java:389)
	at org.joda.time.TestLocalDate_Constructors.testConstructor_nullObject_DateTimeZone(TestLocalDate_Constructors.java:452)

testConstructor_nullObject_nullDateTimeZone(org.joda.time.TestLocalDate_Constructors)  Time elapsed: 0 sec  <<< ERROR!
java.lang.NullPointerException
	at org.joda.time.format.DateTimeFormatterBuilder$NumberFormatter.parseInto(DateTimeFormatterBuilder.java:1304)
	at org.joda.time.format.DateTimeFormatterBuilder$Composite.parseInto(DateTimeFormatterBuilder.java:2462)
	at org.joda.time.format.InternalParserDateTimeParser.parseInto(InternalParserDateTimeParser.java:52)
	at org.joda.time.format.DateTimeFormatterBuilder$MatchingParser.parseInto(DateTimeFormatterBuilder.java:2556)
	at org.joda.time.format.DateTimeParserBucket.doParseMillis(DateTimeParserBucket.java:179)
	at org.joda.time.format.DateTimeFormatter.parseMillis(DateTimeFormatter.java:780)
	at org.joda.time.convert.StringConverter.getPartialValues(StringConverter.java:87)
	at org.joda.time.LocalDate.<init>(LocalDate.java:389)
	at org.joda.time.TestLocalDate_Constructors.testConstructor_nullObject_nullDateTimeZone(TestLocalDate_Constructors.java:469)

testConstructor_nullObject_Chronology(org.joda.time.TestLocalDate_Constructors)  Time elapsed: 0.001 sec  <<< ERROR!
java.lang.NullPointerException
	at org.joda.time.format.DateTimeFormatterBuilder$NumberFormatter.parseInto(DateTimeFormatterBuilder.java:1304)
	at org.joda.time.format.DateTimeFormatterBuilder$Composite.parseInto(DateTimeFormatterBuilder.java:2462)
	at org.joda.time.format.InternalParserDateTimeParser.parseInto(InternalParserDateTimeParser.java:52)
	at org.joda.time.format.DateTimeFormatterBuilder$MatchingParser.parseInto(DateTimeFormatterBuilder.java:2556)
	at org.joda.time.format.DateTimeParserBucket.doParseMillis(DateTimeParserBucket.java:179)
	at org.joda.time.format.DateTimeFormatter.parseMillis(DateTimeFormatter.java:780)
	at org.joda.time.convert.StringConverter.getPartialValues(StringConverter.java:87)
	at org.joda.time.LocalDate.<init>(LocalDate.java:419)
	at org.joda.time.TestLocalDate_Constructors.testConstructor_nullObject_Chronology(TestLocalDate_Constructors.java:495)

testConstructor_nullObject_nullChronology(org.joda.time.TestLocalDate_Constructors)  Time elapsed: 0.001 sec  <<< ERROR!
java.lang.NullPointerException
	at org.joda.time.format.DateTimeFormatterBuilder$NumberFormatter.parseInto(DateTimeFormatterBuilder.java:1304)
	at org.joda.time.format.DateTimeFormatterBuilder$Composite.parseInto(DateTimeFormatterBuilder.java:2462)
	at org.joda.time.format.InternalParserDateTimeParser.parseInto(InternalParserDateTimeParser.java:52)
	at org.joda.time.format.DateTimeFormatterBuilder$MatchingParser.parseInto(DateTimeFormatterBuilder.java:2556)
	at org.joda.time.format.DateTimeParserBucket.doParseMillis(DateTimeParserBucket.java:179)
	at org.joda.time.format.DateTimeFormatter.parseMillis(DateTimeFormatter.java:780)
	at org.joda.time.convert.StringConverter.getPartialValues(StringConverter.java:87)
	at org.joda.time.LocalDate.<init>(LocalDate.java:419)
	at org.joda.time.TestLocalDate_Constructors.testConstructor_nullObject_nullChronology(TestLocalDate_Constructors.java:512)

testConstructor_ObjectLocalDateTime(org.joda.time.TestLocalDate_Constructors)  Time elapsed: 0 sec  <<< FAILURE!
junit.framework.AssertionFailedError: expected:<BuddhistChronology[UTC]> but was:<ISOChronology[UTC]>
	at junit.framework.Assert.fail(Assert.java:47)
	at junit.framework.Assert.failNotEquals(Assert.java:280)
	at junit.framework.Assert.assertEquals(Assert.java:64)
	at junit.framework.Assert.assertEquals(Assert.java:71)
	at org.joda.time.TestLocalDate_Constructors.testConstructor_ObjectLocalDateTime(TestLocalDate_Constructors.java:425)

testConstructor_ObjectLocalTime(org.joda.time.TestLocalDate_Constructors)  Time elapsed: 0 sec  <<< FAILURE!
junit.framework.AssertionFailedError
	at junit.framework.Assert.fail(Assert.java:47)
	at junit.framework.Assert.fail(Assert.java:53)
	at org.joda.time.TestLocalDate_Constructors.testConstructor_ObjectLocalTime(TestLocalDate_Constructors.java:418)

testConstructor_ObjectStringEx7(org.joda.time.TestLocalDate_Constructors)  Time elapsed: 0.001 sec  <<< ERROR!
java.lang.ClassCastException: java.lang.String cannot be cast to java.util.Date
	at org.joda.time.convert.DateConverter.getInstantMillis(DateConverter.java:55)
	at org.joda.time.convert.AbstractConverter.getPartialValues(AbstractConverter.java:101)
	at org.joda.time.convert.AbstractConverter.getPartialValues(AbstractConverter.java:123)
	at org.joda.time.LocalDate.<init>(LocalDate.java:419)
	at org.joda.time.LocalDate.<init>(LocalDate.java:363)
	at org.joda.time.TestLocalDate_Constructors.testConstructor_ObjectStringEx7(TestLocalDate_Constructors.java:400)

testConstructor_ObjectYearMonthDay(org.joda.time.TestLocalDate_Constructors)  Time elapsed: 0 sec  <<< FAILURE!
junit.framework.AssertionFailedError: expected:<BuddhistChronology[UTC]> but was:<ISOChronology[UTC]>
	at junit.framework.Assert.fail(Assert.java:47)
	at junit.framework.Assert.failNotEquals(Assert.java:280)
	at junit.framework.Assert.assertEquals(Assert.java:64)
	at junit.framework.Assert.assertEquals(Assert.java:71)
	at org.joda.time.TestLocalDate_Constructors.testConstructor_ObjectYearMonthDay(TestLocalDate_Constructors.java:435)

testConstructor_ObjectStringEx3(org.joda.time.TestLocalDate_Constructors)  Time elapsed: 0 sec  <<< ERROR!
java.lang.ClassCastException: java.lang.String cannot be cast to java.util.Date
	at org.joda.time.convert.DateConverter.getInstantMillis(DateConverter.java:55)
	at org.joda.time.convert.AbstractConverter.getPartialValues(AbstractConverter.java:101)
	at org.joda.time.convert.AbstractConverter.getPartialValues(AbstractConverter.java:123)
	at org.joda.time.LocalDate.<init>(LocalDate.java:419)
	at org.joda.time.LocalDate.<init>(LocalDate.java:363)
	at org.joda.time.TestLocalDate_Constructors.testConstructor_ObjectStringEx3(TestLocalDate_Constructors.java:372)

testConstructor_ObjectStringEx4(org.joda.time.TestLocalDate_Constructors)  Time elapsed: 0.001 sec  <<< ERROR!
java.lang.ClassCastException: java.lang.String cannot be cast to java.util.Date
	at org.joda.time.convert.DateConverter.getInstantMillis(DateConverter.java:55)
	at org.joda.time.convert.AbstractConverter.getPartialValues(AbstractConverter.java:101)
	at org.joda.time.convert.AbstractConverter.getPartialValues(AbstractConverter.java:123)
	at org.joda.time.LocalDate.<init>(LocalDate.java:419)
	at org.joda.time.LocalDate.<init>(LocalDate.java:363)
	at org.joda.time.TestLocalDate_Constructors.testConstructor_ObjectStringEx4(TestLocalDate_Constructors.java:379)

testConstructor_ObjectStringEx5(org.joda.time.TestLocalDate_Constructors)  Time elapsed: 0 sec  <<< ERROR!
java.lang.ClassCastException: java.lang.String cannot be cast to java.util.Date
	at org.joda.time.convert.DateConverter.getInstantMillis(DateConverter.java:55)
	at org.joda.time.convert.AbstractConverter.getPartialValues(AbstractConverter.java:101)
	at org.joda.time.convert.AbstractConverter.getPartialValues(AbstractConverter.java:123)
	at org.joda.time.LocalDate.<init>(LocalDate.java:419)
	at org.joda.time.LocalDate.<init>(LocalDate.java:363)
	at org.joda.time.TestLocalDate_Constructors.testConstructor_ObjectStringEx5(TestLocalDate_Constructors.java:386)

testConstructor_ObjectStringEx6(org.joda.time.TestLocalDate_Constructors)  Time elapsed: 0.001 sec  <<< ERROR!
java.lang.ClassCastException: java.lang.String cannot be cast to java.util.Date
	at org.joda.time.convert.DateConverter.getInstantMillis(DateConverter.java:55)
	at org.joda.time.convert.AbstractConverter.getPartialValues(AbstractConverter.java:101)
	at org.joda.time.convert.AbstractConverter.getPartialValues(AbstractConverter.java:123)
	at org.joda.time.LocalDate.<init>(LocalDate.java:419)
	at org.joda.time.LocalDate.<init>(LocalDate.java:363)
	at org.joda.time.TestLocalDate_Constructors.testConstructor_ObjectStringEx6(TestLocalDate_Constructors.java:393)

testConstructor_nullObject(org.joda.time.TestLocalTime_Constructors)  Time elapsed: 0.001 sec  <<< ERROR!
java.lang.NullPointerException
	at org.joda.time.format.DateTimeFormatterBuilder$CharacterLiteral.parseInto(DateTimeFormatterBuilder.java:1224)
	at org.joda.time.format.InternalParserDateTimeParser.parseInto(InternalParserDateTimeParser.java:52)
	at org.joda.time.format.DateTimeFormatterBuilder$MatchingParser.parseInto(DateTimeFormatterBuilder.java:2556)
	at org.joda.time.format.DateTimeFormatterBuilder$Composite.parseInto(DateTimeFormatterBuilder.java:2462)
	at org.joda.time.format.DateTimeParserBucket.doParseMillis(DateTimeParserBucket.java:179)
	at org.joda.time.format.DateTimeFormatter.parseMillis(DateTimeFormatter.java:780)
	at org.joda.time.convert.StringConverter.getPartialValues(StringConverter.java:87)
	at org.joda.time.LocalTime.<init>(LocalTime.java:435)
	at org.joda.time.LocalTime.<init>(LocalTime.java:383)
	at org.joda.time.TestLocalTime_Constructors.testConstructor_nullObject(TestLocalTime_Constructors.java:354)

testConstructor_ObjectString1(org.joda.time.TestLocalTime_Constructors)  Time elapsed: 0 sec  <<< ERROR!
java.lang.ClassCastException: java.lang.String cannot be cast to java.util.Date
	at org.joda.time.convert.DateConverter.getInstantMillis(DateConverter.java:55)
	at org.joda.time.convert.AbstractConverter.getPartialValues(AbstractConverter.java:101)
	at org.joda.time.convert.AbstractConverter.getPartialValues(AbstractConverter.java:123)
	at org.joda.time.LocalTime.<init>(LocalTime.java:435)
	at org.joda.time.LocalTime.<init>(LocalTime.java:383)
	at org.joda.time.TestLocalTime_Constructors.testConstructor_ObjectString1(TestLocalTime_Constructors.java:363)

testConstructor_ObjectString2(org.joda.time.TestLocalTime_Constructors)  Time elapsed: 0 sec  <<< ERROR!
java.lang.ClassCastException: java.lang.String cannot be cast to java.util.Date
	at org.joda.time.convert.DateConverter.getInstantMillis(DateConverter.java:55)
	at org.joda.time.convert.AbstractConverter.getPartialValues(AbstractConverter.java:101)
	at org.joda.time.convert.AbstractConverter.getPartialValues(AbstractConverter.java:123)
	at org.joda.time.LocalTime.<init>(LocalTime.java:435)
	at org.joda.time.LocalTime.<init>(LocalTime.java:383)
	at org.joda.time.TestLocalTime_Constructors.testConstructor_ObjectString2(TestLocalTime_Constructors.java:392)

testConstructor_ObjectString3(org.joda.time.TestLocalTime_Constructors)  Time elapsed: 0 sec  <<< ERROR!
java.lang.ClassCastException: java.lang.String cannot be cast to java.util.Date
	at org.joda.time.convert.DateConverter.getInstantMillis(DateConverter.java:55)
	at org.joda.time.convert.AbstractConverter.getPartialValues(AbstractConverter.java:101)
	at org.joda.time.convert.AbstractConverter.getPartialValues(AbstractConverter.java:123)
	at org.joda.time.LocalTime.<init>(LocalTime.java:435)
	at org.joda.time.LocalTime.<init>(LocalTime.java:383)
	at org.joda.time.TestLocalTime_Constructors.testConstructor_ObjectString3(TestLocalTime_Constructors.java:401)

testConstructor_ObjectString4(org.joda.time.TestLocalTime_Constructors)  Time elapsed: 0.001 sec  <<< ERROR!
java.lang.ClassCastException: java.lang.String cannot be cast to java.util.Date
	at org.joda.time.convert.DateConverter.getInstantMillis(DateConverter.java:55)
	at org.joda.time.convert.AbstractConverter.getPartialValues(AbstractConverter.java:101)
	at org.joda.time.convert.AbstractConverter.getPartialValues(AbstractConverter.java:123)
	at org.joda.time.LocalTime.<init>(LocalTime.java:435)
	at org.joda.time.LocalTime.<init>(LocalTime.java:383)
	at org.joda.time.TestLocalTime_Constructors.testConstructor_ObjectString4(TestLocalTime_Constructors.java:410)

testConstructor_ObjectStringEx1(org.joda.time.TestLocalTime_Constructors)  Time elapsed: 0 sec  <<< ERROR!
java.lang.ClassCastException: java.lang.String cannot be cast to java.util.Date
	at org.joda.time.convert.DateConverter.getInstantMillis(DateConverter.java:55)
	at org.joda.time.convert.AbstractConverter.getPartialValues(AbstractConverter.java:101)
	at org.joda.time.convert.AbstractConverter.getPartialValues(AbstractConverter.java:123)
	at org.joda.time.LocalTime.<init>(LocalTime.java:435)
	at org.joda.time.LocalTime.<init>(LocalTime.java:383)
	at org.joda.time.TestLocalTime_Constructors.testConstructor_ObjectStringEx1(TestLocalTime_Constructors.java:420)

testConstructor_ObjectStringEx2(org.joda.time.TestLocalTime_Constructors)  Time elapsed: 0.001 sec  <<< ERROR!
java.lang.ClassCastException: java.lang.String cannot be cast to java.util.Date
	at org.joda.time.convert.DateConverter.getInstantMillis(DateConverter.java:55)
	at org.joda.time.convert.AbstractConverter.getPartialValues(AbstractConverter.java:101)
	at org.joda.time.convert.AbstractConverter.getPartialValues(AbstractConverter.java:123)
	at org.joda.time.LocalTime.<init>(LocalTime.java:435)
	at org.joda.time.LocalTime.<init>(LocalTime.java:383)
	at org.joda.time.TestLocalTime_Constructors.testConstructor_ObjectStringEx2(TestLocalTime_Constructors.java:427)

testConstructor_nullObject_DateTimeZone(org.joda.time.TestLocalTime_Constructors)  Time elapsed: 0 sec  <<< ERROR!
java.lang.NullPointerException
	at org.joda.time.format.DateTimeFormatterBuilder$CharacterLiteral.parseInto(DateTimeFormatterBuilder.java:1224)
	at org.joda.time.format.InternalParserDateTimeParser.parseInto(InternalParserDateTimeParser.java:52)
	at org.joda.time.format.DateTimeFormatterBuilder$MatchingParser.parseInto(DateTimeFormatterBuilder.java:2556)
	at org.joda.time.format.DateTimeFormatterBuilder$Composite.parseInto(DateTimeFormatterBuilder.java:2462)
	at org.joda.time.format.DateTimeParserBucket.doParseMillis(DateTimeParserBucket.java:179)
	at org.joda.time.format.DateTimeFormatter.parseMillis(DateTimeFormatter.java:780)
	at org.joda.time.convert.StringConverter.getPartialValues(StringConverter.java:87)
	at org.joda.time.LocalTime.<init>(LocalTime.java:409)
	at org.joda.time.TestLocalTime_Constructors.testConstructor_nullObject_DateTimeZone(TestLocalTime_Constructors.java:531)

testConstructor_nullObject_nullDateTimeZone(org.joda.time.TestLocalTime_Constructors)  Time elapsed: 0 sec  <<< ERROR!
java.lang.NullPointerException
	at org.joda.time.format.DateTimeFormatterBuilder$CharacterLiteral.parseInto(DateTimeFormatterBuilder.java:1224)
	at org.joda.time.format.InternalParserDateTimeParser.parseInto(InternalParserDateTimeParser.java:52)
	at org.joda.time.format.DateTimeFormatterBuilder$MatchingParser.parseInto(DateTimeFormatterBuilder.java:2556)
	at org.joda.time.format.DateTimeFormatterBuilder$Composite.parseInto(DateTimeFormatterBuilder.java:2462)
	at org.joda.time.format.DateTimeParserBucket.doParseMillis(DateTimeParserBucket.java:179)
	at org.joda.time.format.DateTimeFormatter.parseMillis(DateTimeFormatter.java:780)
	at org.joda.time.convert.StringConverter.getPartialValues(StringConverter.java:87)
	at org.joda.time.LocalTime.<init>(LocalTime.java:409)
	at org.joda.time.TestLocalTime_Constructors.testConstructor_nullObject_nullDateTimeZone(TestLocalTime_Constructors.java:550)

testConstructor_nullObject_Chronology(org.joda.time.TestLocalTime_Constructors)  Time elapsed: 0.001 sec  <<< ERROR!
java.lang.NullPointerException
	at org.joda.time.format.DateTimeFormatterBuilder$CharacterLiteral.parseInto(DateTimeFormatterBuilder.java:1224)
	at org.joda.time.format.InternalParserDateTimeParser.parseInto(InternalParserDateTimeParser.java:52)
	at org.joda.time.format.DateTimeFormatterBuilder$MatchingParser.parseInto(DateTimeFormatterBuilder.java:2556)
	at org.joda.time.format.DateTimeFormatterBuilder$Composite.parseInto(DateTimeFormatterBuilder.java:2462)
	at org.joda.time.format.DateTimeParserBucket.doParseMillis(DateTimeParserBucket.java:179)
	at org.joda.time.format.DateTimeFormatter.parseMillis(DateTimeFormatter.java:780)
	at org.joda.time.convert.StringConverter.getPartialValues(StringConverter.java:87)
	at org.joda.time.LocalTime.<init>(LocalTime.java:435)
	at org.joda.time.TestLocalTime_Constructors.testConstructor_nullObject_Chronology(TestLocalTime_Constructors.java:583)

testConstructor_nullObject_nullChronology(org.joda.time.TestLocalTime_Constructors)  Time elapsed: 0.001 sec  <<< ERROR!
java.lang.NullPointerException
	at org.joda.time.format.DateTimeFormatterBuilder$CharacterLiteral.parseInto(DateTimeFormatterBuilder.java:1224)
	at org.joda.time.format.InternalParserDateTimeParser.parseInto(InternalParserDateTimeParser.java:52)
	at org.joda.time.format.DateTimeFormatterBuilder$MatchingParser.parseInto(DateTimeFormatterBuilder.java:2556)
	at org.joda.time.format.DateTimeFormatterBuilder$Composite.parseInto(DateTimeFormatterBuilder.java:2462)
	at org.joda.time.format.DateTimeParserBucket.doParseMillis(DateTimeParserBucket.java:179)
	at org.joda.time.format.DateTimeFormatter.parseMillis(DateTimeFormatter.java:780)
	at org.joda.time.convert.StringConverter.getPartialValues(StringConverter.java:87)
	at org.joda.time.LocalTime.<init>(LocalTime.java:435)
	at org.joda.time.TestLocalTime_Constructors.testConstructor_nullObject_nullChronology(TestLocalTime_Constructors.java:602)

testConstructor_ObjectString1Tokyo(org.joda.time.TestLocalTime_Constructors)  Time elapsed: 0.001 sec  <<< ERROR!
java.lang.ClassCastException: java.lang.String cannot be cast to java.util.Date
	at org.joda.time.convert.DateConverter.getInstantMillis(DateConverter.java:55)
	at org.joda.time.convert.AbstractConverter.getPartialValues(AbstractConverter.java:101)
	at org.joda.time.convert.AbstractConverter.getPartialValues(AbstractConverter.java:123)
	at org.joda.time.LocalTime.<init>(LocalTime.java:435)
	at org.joda.time.LocalTime.<init>(LocalTime.java:383)
	at org.joda.time.TestLocalTime_Constructors.testConstructor_ObjectString1Tokyo(TestLocalTime_Constructors.java:373)

testConstructor_ObjectString1NewYork(org.joda.time.TestLocalTime_Constructors)  Time elapsed: 0 sec  <<< ERROR!
java.lang.ClassCastException: java.lang.String cannot be cast to java.util.Date
	at org.joda.time.convert.DateConverter.getInstantMillis(DateConverter.java:55)
	at org.joda.time.convert.AbstractConverter.getPartialValues(AbstractConverter.java:101)
	at org.joda.time.convert.AbstractConverter.getPartialValues(AbstractConverter.java:123)
	at org.joda.time.LocalTime.<init>(LocalTime.java:435)
	at org.joda.time.LocalTime.<init>(LocalTime.java:383)
	at org.joda.time.TestLocalTime_Constructors.testConstructor_ObjectString1NewYork(TestLocalTime_Constructors.java:383)

testConstructor_ObjectTimeOfDay(org.joda.time.TestLocalTime_Constructors)  Time elapsed: 0.001 sec  <<< FAILURE!
junit.framework.AssertionFailedError: expected:<BuddhistChronology[UTC]> but was:<ISOChronology[UTC]>
	at junit.framework.Assert.fail(Assert.java:47)
	at junit.framework.Assert.failNotEquals(Assert.java:280)
	at junit.framework.Assert.assertEquals(Assert.java:64)
	at junit.framework.Assert.assertEquals(Assert.java:71)
	at org.joda.time.TestLocalTime_Constructors.testConstructor_ObjectTimeOfDay(TestLocalTime_Constructors.java:492)

testConstructor_ObjectString_DateTimeZoneLondon(org.joda.time.TestLocalTime_Constructors)  Time elapsed: 0 sec  <<< ERROR!
java.lang.ClassCastException: java.lang.String cannot be cast to java.util.Date
	at org.joda.time.convert.DateConverter.getInstantMillis(DateConverter.java:55)
	at org.joda.time.convert.AbstractConverter.getPartialValues(AbstractConverter.java:101)
	at org.joda.time.convert.AbstractConverter.getPartialValues(AbstractConverter.java:123)
	at org.joda.time.LocalTime.<init>(LocalTime.java:409)
	at org.joda.time.TestLocalTime_Constructors.testConstructor_ObjectString_DateTimeZoneLondon(TestLocalTime_Constructors.java:511)

testConstructor_ObjectString_DateTimeZoneTokyo(org.joda.time.TestLocalTime_Constructors)  Time elapsed: 0.001 sec  <<< ERROR!
java.lang.ClassCastException: java.lang.String cannot be cast to java.util.Date
	at org.joda.time.convert.DateConverter.getInstantMillis(DateConverter.java:55)
	at org.joda.time.convert.AbstractConverter.getPartialValues(AbstractConverter.java:101)
	at org.joda.time.convert.AbstractConverter.getPartialValues(AbstractConverter.java:123)
	at org.joda.time.LocalTime.<init>(LocalTime.java:409)
	at org.joda.time.TestLocalTime_Constructors.testConstructor_ObjectString_DateTimeZoneTokyo(TestLocalTime_Constructors.java:517)

testConstructor_ObjectString_DateTimeZoneNewYork(org.joda.time.TestLocalTime_Constructors)  Time elapsed: 0 sec  <<< ERROR!
java.lang.ClassCastException: java.lang.String cannot be cast to java.util.Date
	at org.joda.time.convert.DateConverter.getInstantMillis(DateConverter.java:55)
	at org.joda.time.convert.AbstractConverter.getPartialValues(AbstractConverter.java:101)
	at org.joda.time.convert.AbstractConverter.getPartialValues(AbstractConverter.java:123)
	at org.joda.time.LocalTime.<init>(LocalTime.java:409)
	at org.joda.time.TestLocalTime_Constructors.testConstructor_ObjectString_DateTimeZoneNewYork(TestLocalTime_Constructors.java:524)

testConstructor_Object2_Chronology(org.joda.time.TestLocalTime_Constructors)  Time elapsed: 0.001 sec  <<< ERROR!
java.lang.ClassCastException: java.lang.String cannot be cast to java.util.Date
	at org.joda.time.convert.DateConverter.getInstantMillis(DateConverter.java:55)
	at org.joda.time.convert.AbstractConverter.getPartialValues(AbstractConverter.java:101)
	at org.joda.time.convert.AbstractConverter.getPartialValues(AbstractConverter.java:123)
	at org.joda.time.LocalTime.<init>(LocalTime.java:435)
	at org.joda.time.LocalTime.<init>(LocalTime.java:383)
	at org.joda.time.TestLocalTime_Constructors.testConstructor_Object2_Chronology(TestLocalTime_Constructors.java:570)

testConstructor_ObjectLocalDateTime(org.joda.time.TestLocalTime_Constructors)  Time elapsed: 0 sec  <<< FAILURE!
junit.framework.AssertionFailedError: expected:<BuddhistChronology[UTC]> but was:<ISOChronology[UTC]>
	at junit.framework.Assert.fail(Assert.java:47)
	at junit.framework.Assert.failNotEquals(Assert.java:280)
	at junit.framework.Assert.assertEquals(Assert.java:64)
	at junit.framework.Assert.assertEquals(Assert.java:71)
	at org.joda.time.TestLocalTime_Constructors.testConstructor_ObjectLocalDateTime(TestLocalTime_Constructors.java:481)

testConstructor_ObjectLocalTime(org.joda.time.TestLocalTime_Constructors)  Time elapsed: 0.001 sec  <<< FAILURE!
junit.framework.AssertionFailedError: expected:<BuddhistChronology[UTC]> but was:<ISOChronology[UTC]>
	at junit.framework.Assert.fail(Assert.java:47)
	at junit.framework.Assert.failNotEquals(Assert.java:280)
	at junit.framework.Assert.assertEquals(Assert.java:64)
	at junit.framework.Assert.assertEquals(Assert.java:71)
	at org.joda.time.TestLocalTime_Constructors.testConstructor_ObjectLocalTime(TestLocalTime_Constructors.java:463)

testConstructor_ObjectStringEx3(org.joda.time.TestLocalTime_Constructors)  Time elapsed: 0 sec  <<< ERROR!
java.lang.ClassCastException: java.lang.String cannot be cast to java.util.Date
	at org.joda.time.convert.DateConverter.getInstantMillis(DateConverter.java:55)
	at org.joda.time.convert.AbstractConverter.getPartialValues(AbstractConverter.java:101)
	at org.joda.time.convert.AbstractConverter.getPartialValues(AbstractConverter.java:123)
	at org.joda.time.LocalTime.<init>(LocalTime.java:435)
	at org.joda.time.LocalTime.<init>(LocalTime.java:383)
	at org.joda.time.TestLocalTime_Constructors.testConstructor_ObjectStringEx3(TestLocalTime_Constructors.java:434)

testConstructor_ObjectStringEx4(org.joda.time.TestLocalTime_Constructors)  Time elapsed: 0.001 sec  <<< ERROR!
java.lang.ClassCastException: java.lang.String cannot be cast to java.util.Date
	at org.joda.time.convert.DateConverter.getInstantMillis(DateConverter.java:55)
	at org.joda.time.convert.AbstractConverter.getPartialValues(AbstractConverter.java:101)
	at org.joda.time.convert.AbstractConverter.getPartialValues(AbstractConverter.java:123)
	at org.joda.time.LocalTime.<init>(LocalTime.java:435)
	at org.joda.time.LocalTime.<init>(LocalTime.java:383)
	at org.joda.time.TestLocalTime_Constructors.testConstructor_ObjectStringEx4(TestLocalTime_Constructors.java:441)

testConstructor_ObjectStringEx5(org.joda.time.TestLocalTime_Constructors)  Time elapsed: 0 sec  <<< ERROR!
java.lang.ClassCastException: java.lang.String cannot be cast to java.util.Date
	at org.joda.time.convert.DateConverter.getInstantMillis(DateConverter.java:55)
	at org.joda.time.convert.AbstractConverter.getPartialValues(AbstractConverter.java:101)
	at org.joda.time.convert.AbstractConverter.getPartialValues(AbstractConverter.java:123)
	at org.joda.time.LocalTime.<init>(LocalTime.java:435)
	at org.joda.time.LocalTime.<init>(LocalTime.java:383)
	at org.joda.time.TestLocalTime_Constructors.testConstructor_ObjectStringEx5(TestLocalTime_Constructors.java:448)

testConstructor_ObjectStringEx6(org.joda.time.TestLocalTime_Constructors)  Time elapsed: 0.001 sec  <<< ERROR!
java.lang.ClassCastException: java.lang.String cannot be cast to java.util.Date
	at org.joda.time.convert.DateConverter.getInstantMillis(DateConverter.java:55)
	at org.joda.time.convert.AbstractConverter.getPartialValues(AbstractConverter.java:101)
	at org.joda.time.convert.AbstractConverter.getPartialValues(AbstractConverter.java:123)
	at org.joda.time.LocalTime.<init>(LocalTime.java:435)
	at org.joda.time.LocalTime.<init>(LocalTime.java:383)
	at org.joda.time.TestLocalTime_Constructors.testConstructor_ObjectStringEx6(TestLocalTime_Constructors.java:455)

testConstructor_Object2(org.joda.time.TestLocalTime_Constructors)  Time elapsed: 0 sec  <<< ERROR!
java.lang.ClassCastException: java.util.GregorianCalendar cannot be cast to java.util.Date
	at org.joda.time.convert.DateConverter.getInstantMillis(DateConverter.java:55)
	at org.joda.time.convert.AbstractConverter.getPartialValues(AbstractConverter.java:101)
	at org.joda.time.convert.AbstractConverter.getPartialValues(AbstractConverter.java:123)
	at org.joda.time.LocalTime.<init>(LocalTime.java:435)
	at org.joda.time.LocalTime.<init>(LocalTime.java:383)
	at org.joda.time.TestLocalTime_Constructors.testConstructor_Object2(TestLocalTime_Constructors.java:345)

testParse_noFormatter(org.joda.time.TestMutableInterval_Constructors)  Time elapsed: 0.001 sec  <<< FAILURE!
junit.framework.AssertionFailedError: expected:<2010-06-30T12:30:00.000+02:00/2010-07-01T14:30:00.000+02:00> but was:<1970-01-01T01:00:01.234+01:00/1970-01-01T01:00:05.678+01:00>
	at junit.framework.Assert.fail(Assert.java:47)
	at junit.framework.Assert.failNotEquals(Assert.java:280)
	at junit.framework.Assert.assertEquals(Assert.java:64)
	at junit.framework.Assert.assertEquals(Assert.java:71)
	at org.joda.time.TestMutableInterval_Constructors.testParse_noFormatter(TestMutableInterval_Constructors.java:114)

testConstructor_Object_Chronology1(org.joda.time.TestMutableInterval_Constructors)  Time elapsed: 0 sec  <<< FAILURE!
junit.framework.AssertionFailedError: expected:<1086732000000> but was:<1234>
	at junit.framework.Assert.fail(Assert.java:47)
	at junit.framework.Assert.failNotEquals(Assert.java:280)
	at junit.framework.Assert.assertEquals(Assert.java:64)
	at junit.framework.Assert.assertEquals(Assert.java:133)
	at junit.framework.Assert.assertEquals(Assert.java:139)
	at org.joda.time.TestMutableInterval_Constructors.testConstructor_Object_Chronology1(TestMutableInterval_Constructors.java:664)

testConstructor_Object_Chronology2(org.joda.time.TestMutableInterval_Constructors)  Time elapsed: 0.001 sec  <<< FAILURE!
junit.framework.AssertionFailedError: expected:<1086732000000> but was:<1234>
	at junit.framework.Assert.fail(Assert.java:47)
	at junit.framework.Assert.failNotEquals(Assert.java:280)
	at junit.framework.Assert.assertEquals(Assert.java:64)
	at junit.framework.Assert.assertEquals(Assert.java:133)
	at junit.framework.Assert.assertEquals(Assert.java:139)
	at org.joda.time.TestMutableInterval_Constructors.testConstructor_Object_Chronology2(TestMutableInterval_Constructors.java:675)

testConstructor_Object1(org.joda.time.TestMutableInterval_Constructors)  Time elapsed: 0.001 sec  <<< FAILURE!
junit.framework.AssertionFailedError: expected:<1086732000000> but was:<1234>
	at junit.framework.Assert.fail(Assert.java:47)
	at junit.framework.Assert.failNotEquals(Assert.java:280)
	at junit.framework.Assert.assertEquals(Assert.java:64)
	at junit.framework.Assert.assertEquals(Assert.java:133)
	at junit.framework.Assert.assertEquals(Assert.java:139)
	at org.joda.time.TestMutableInterval_Constructors.testConstructor_Object1(TestMutableInterval_Constructors.java:512)

testConstructor_Object2(org.joda.time.TestMutableInterval_Constructors)  Time elapsed: 0 sec  <<< FAILURE!
junit.framework.AssertionFailedError: expected:<1086732000000> but was:<1234>
	at junit.framework.Assert.fail(Assert.java:47)
	at junit.framework.Assert.failNotEquals(Assert.java:280)
	at junit.framework.Assert.assertEquals(Assert.java:64)
	at junit.framework.Assert.assertEquals(Assert.java:133)
	at junit.framework.Assert.assertEquals(Assert.java:139)
	at org.joda.time.TestMutableInterval_Constructors.testConstructor_Object2(TestMutableInterval_Constructors.java:522)

testConstructor_Object3(org.joda.time.TestMutableInterval_Constructors)  Time elapsed: 0.001 sec  <<< FAILURE!
junit.framework.AssertionFailedError: expected:<1086732000000> but was:<1234>
	at junit.framework.Assert.fail(Assert.java:47)
	at junit.framework.Assert.failNotEquals(Assert.java:280)
	at junit.framework.Assert.assertEquals(Assert.java:64)
	at junit.framework.Assert.assertEquals(Assert.java:133)
	at junit.framework.Assert.assertEquals(Assert.java:139)
	at org.joda.time.TestMutableInterval_Constructors.testConstructor_Object3(TestMutableInterval_Constructors.java:532)

testParse_noFormatter(org.joda.time.TestPeriod_Constructors)  Time elapsed: 0 sec  <<< ERROR!
java.lang.ClassCastException: org.joda.time.MutablePeriod cannot be cast to org.joda.time.ReadableDuration
	at org.joda.time.convert.ReadableDurationConverter.setInto(ReadableDurationConverter.java:72)
	at org.joda.time.base.BasePeriod.<init>(BasePeriod.java:279)
	at org.joda.time.MutablePeriod.<init>(MutablePeriod.java:426)
	at org.joda.time.base.BasePeriod.<init>(BasePeriod.java:281)
	at org.joda.time.Period.<init>(Period.java:674)
	at org.joda.time.base.AbstractPeriod.toPeriod(AbstractPeriod.java:147)
	at org.joda.time.format.PeriodFormatter.parsePeriod(PeriodFormatter.java:308)
	at org.joda.time.Period.parse(Period.java:92)
	at org.joda.time.Period.parse(Period.java:81)
	at org.joda.time.TestPeriod_Constructors.testParse_noFormatter(TestPeriod_Constructors.java:104)

testConstructor_Object1(org.joda.time.TestPeriod_Constructors)  Time elapsed: 0.001 sec  <<< ERROR!
java.lang.ClassCastException: java.lang.String cannot be cast to org.joda.time.ReadablePeriod
	at org.joda.time.convert.ReadablePeriodConverter.getPeriodType(ReadablePeriodConverter.java:70)
	at org.joda.time.base.BasePeriod.<init>(BasePeriod.java:273)
	at org.joda.time.Period.<init>(Period.java:674)
	at org.joda.time.TestPeriod_Constructors.testConstructor_Object1(TestPeriod_Constructors.java:1145)

testConstructor_Object3(org.joda.time.TestPeriod_Constructors)  Time elapsed: 0 sec  <<< ERROR!
java.lang.ClassCastException: org.joda.time.Period cannot be cast to org.joda.time.ReadableDuration
	at org.joda.time.convert.ReadableDurationConverter.setInto(ReadableDurationConverter.java:72)
	at org.joda.time.base.BasePeriod.<init>(BasePeriod.java:279)
	at org.joda.time.MutablePeriod.<init>(MutablePeriod.java:426)
	at org.joda.time.base.BasePeriod.<init>(BasePeriod.java:281)
	at org.joda.time.Period.<init>(Period.java:674)
	at org.joda.time.TestPeriod_Constructors.testConstructor_Object3(TestPeriod_Constructors.java:1171)

testConstructor_Object4(org.joda.time.TestPeriod_Constructors)  Time elapsed: 0.001 sec  <<< ERROR!
java.lang.ClassCastException: org.joda.time.Period cannot be cast to org.joda.time.ReadableDuration
	at org.joda.time.convert.ReadableDurationConverter.setInto(ReadableDurationConverter.java:72)
	at org.joda.time.base.BasePeriod.<init>(BasePeriod.java:279)
	at org.joda.time.MutablePeriod.<init>(MutablePeriod.java:426)
	at org.joda.time.base.BasePeriod.<init>(BasePeriod.java:281)
	at org.joda.time.Period.<init>(Period.java:674)
	at org.joda.time.TestPeriod_Constructors.testConstructor_Object4(TestPeriod_Constructors.java:1185)

testConstructor_Object_PeriodType1(org.joda.time.TestPeriod_Constructors)  Time elapsed: 0 sec  <<< ERROR!
java.lang.ClassCastException: java.lang.String cannot be cast to org.joda.time.ReadablePeriod
	at org.joda.time.convert.ReadablePeriodConverter.setInto(ReadablePeriodConverter.java:58)
	at org.joda.time.base.BasePeriod.<init>(BasePeriod.java:279)
	at org.joda.time.MutablePeriod.<init>(MutablePeriod.java:426)
	at org.joda.time.base.BasePeriod.<init>(BasePeriod.java:281)
	at org.joda.time.Period.<init>(Period.java:691)
	at org.joda.time.TestPeriod_Constructors.testConstructor_Object_PeriodType1(TestPeriod_Constructors.java:1202)

testConstructor_Object_PeriodType3(org.joda.time.TestPeriod_Constructors)  Time elapsed: 0.001 sec  <<< ERROR!
java.lang.ClassCastException: org.joda.time.Period cannot be cast to org.joda.time.ReadableDuration
	at org.joda.time.convert.ReadableDurationConverter.setInto(ReadableDurationConverter.java:72)
	at org.joda.time.base.BasePeriod.<init>(BasePeriod.java:279)
	at org.joda.time.MutablePeriod.<init>(MutablePeriod.java:426)
	at org.joda.time.base.BasePeriod.<init>(BasePeriod.java:281)
	at org.joda.time.Period.<init>(Period.java:691)
	at org.joda.time.TestPeriod_Constructors.testConstructor_Object_PeriodType3(TestPeriod_Constructors.java:1228)

testConstructor_Object_PeriodType4(org.joda.time.TestPeriod_Constructors)  Time elapsed: 0 sec  <<< ERROR!
java.lang.ClassCastException: org.joda.time.Period cannot be cast to org.joda.time.ReadableDuration
	at org.joda.time.convert.ReadableDurationConverter.setInto(ReadableDurationConverter.java:72)
	at org.joda.time.base.BasePeriod.<init>(BasePeriod.java:279)
	at org.joda.time.MutablePeriod.<init>(MutablePeriod.java:426)
	at org.joda.time.base.BasePeriod.<init>(BasePeriod.java:281)
	at org.joda.time.Period.<init>(Period.java:691)
	at org.joda.time.TestPeriod_Constructors.testConstructor_Object_PeriodType4(TestPeriod_Constructors.java:1241)

testToMutablePeriod(org.joda.time.TestPeriod_Basics)  Time elapsed: 0 sec  <<< ERROR!
java.lang.ClassCastException: org.joda.time.Period cannot be cast to org.joda.time.ReadableDuration
	at org.joda.time.convert.ReadableDurationConverter.setInto(ReadableDurationConverter.java:72)
	at org.joda.time.base.BasePeriod.<init>(BasePeriod.java:279)
	at org.joda.time.MutablePeriod.<init>(MutablePeriod.java:374)
	at org.joda.time.base.AbstractPeriod.toMutablePeriod(AbstractPeriod.java:158)
	at org.joda.time.TestPeriod_Basics.testToMutablePeriod(TestPeriod_Basics.java:504)

testWithPeriodType2(org.joda.time.TestPeriod_Basics)  Time elapsed: 0 sec  <<< ERROR!
java.lang.ClassCastException: org.joda.time.Period cannot be cast to org.joda.time.ReadableDuration
	at org.joda.time.convert.ReadableDurationConverter.setInto(ReadableDurationConverter.java:72)
	at org.joda.time.base.BasePeriod.<init>(BasePeriod.java:279)
	at org.joda.time.MutablePeriod.<init>(MutablePeriod.java:426)
	at org.joda.time.base.BasePeriod.<init>(BasePeriod.java:281)
	at org.joda.time.Period.<init>(Period.java:691)
	at org.joda.time.Period.withPeriodType(Period.java:840)
	at org.joda.time.TestPeriod_Basics.testWithPeriodType2(TestPeriod_Basics.java:533)

testWithPeriodType3(org.joda.time.TestPeriod_Basics)  Time elapsed: 0.001 sec  <<< ERROR!
java.lang.ClassCastException: org.joda.time.Period cannot be cast to org.joda.time.ReadableDuration
	at org.joda.time.convert.ReadableDurationConverter.setInto(ReadableDurationConverter.java:72)
	at org.joda.time.base.BasePeriod.<init>(BasePeriod.java:279)
	at org.joda.time.MutablePeriod.<init>(MutablePeriod.java:426)
	at org.joda.time.base.BasePeriod.<init>(BasePeriod.java:281)
	at org.joda.time.Period.<init>(Period.java:691)
	at org.joda.time.Period.withPeriodType(Period.java:840)
	at org.joda.time.TestPeriod_Basics.testWithPeriodType3(TestPeriod_Basics.java:542)

testWithPeriodType5(org.joda.time.TestPeriod_Basics)  Time elapsed: 0 sec  <<< ERROR!
java.lang.ClassCastException: org.joda.time.Period cannot be cast to org.joda.time.ReadableDuration
	at org.joda.time.convert.ReadableDurationConverter.setInto(ReadableDurationConverter.java:72)
	at org.joda.time.base.BasePeriod.<init>(BasePeriod.java:279)
	at org.joda.time.MutablePeriod.<init>(MutablePeriod.java:426)
	at org.joda.time.base.BasePeriod.<init>(BasePeriod.java:281)
	at org.joda.time.Period.<init>(Period.java:691)
	at org.joda.time.Period.withPeriodType(Period.java:840)
	at org.joda.time.TestPeriod_Basics.testWithPeriodType5(TestPeriod_Basics.java:557)

testParse_noFormatter(org.joda.time.TestMutablePeriod_Constructors)  Time elapsed: 0 sec  <<< ERROR!
java.lang.ClassCastException: org.joda.time.MutablePeriod cannot be cast to org.joda.time.ReadableDuration
	at org.joda.time.convert.ReadableDurationConverter.setInto(ReadableDurationConverter.java:72)
	at org.joda.time.base.BasePeriod.<init>(BasePeriod.java:279)
	at org.joda.time.MutablePeriod.<init>(MutablePeriod.java:426)
	at org.joda.time.base.BasePeriod.<init>(BasePeriod.java:281)
	at org.joda.time.Period.<init>(Period.java:674)
	at org.joda.time.base.AbstractPeriod.toPeriod(AbstractPeriod.java:147)
	at org.joda.time.format.PeriodFormatter.parsePeriod(PeriodFormatter.java:308)
	at org.joda.time.MutablePeriod.parse(MutablePeriod.java:85)
	at org.joda.time.MutablePeriod.parse(MutablePeriod.java:74)
	at org.joda.time.TestMutablePeriod_Constructors.testParse_noFormatter(TestMutablePeriod_Constructors.java:102)

testConstructor_Object_Chronology2(org.joda.time.TestMutablePeriod_Constructors)  Time elapsed: 0 sec  <<< FAILURE!
junit.framework.AssertionFailedError: expected:<64> but was:<0>
	at junit.framework.Assert.fail(Assert.java:47)
	at junit.framework.Assert.failNotEquals(Assert.java:280)
	at junit.framework.Assert.assertEquals(Assert.java:64)
	at junit.framework.Assert.assertEquals(Assert.java:198)
	at junit.framework.Assert.assertEquals(Assert.java:204)
	at org.joda.time.TestMutablePeriod_Constructors.testConstructor_Object_Chronology2(TestMutablePeriod_Constructors.java:964)

testConstructor_Object1(org.joda.time.TestMutablePeriod_Constructors)  Time elapsed: 0 sec  <<< ERROR!
java.lang.ClassCastException: java.lang.String cannot be cast to org.joda.time.ReadablePeriod
	at org.joda.time.convert.ReadablePeriodConverter.getPeriodType(ReadablePeriodConverter.java:70)
	at org.joda.time.base.BasePeriod.<init>(BasePeriod.java:273)
	at org.joda.time.MutablePeriod.<init>(MutablePeriod.java:374)
	at org.joda.time.TestMutablePeriod_Constructors.testConstructor_Object1(TestMutablePeriod_Constructors.java:827)

testConstructor_Object2(org.joda.time.TestMutablePeriod_Constructors)  Time elapsed: 0.001 sec  <<< ERROR!
java.lang.NullPointerException
	at org.joda.time.convert.ReadablePeriodConverter.getPeriodType(ReadablePeriodConverter.java:71)
	at org.joda.time.base.BasePeriod.<init>(BasePeriod.java:273)
	at org.joda.time.MutablePeriod.<init>(MutablePeriod.java:374)
	at org.joda.time.TestMutablePeriod_Constructors.testConstructor_Object2(TestMutablePeriod_Constructors.java:840)

testConstructor_Object3(org.joda.time.TestMutablePeriod_Constructors)  Time elapsed: 0 sec  <<< ERROR!
java.lang.ClassCastException: org.joda.time.Period cannot be cast to org.joda.time.ReadableDuration
	at org.joda.time.convert.ReadableDurationConverter.setInto(ReadableDurationConverter.java:72)
	at org.joda.time.base.BasePeriod.<init>(BasePeriod.java:279)
	at org.joda.time.MutablePeriod.<init>(MutablePeriod.java:374)
	at org.joda.time.TestMutablePeriod_Constructors.testConstructor_Object3(TestMutablePeriod_Constructors.java:853)

testConstructor_Object4(org.joda.time.TestMutablePeriod_Constructors)  Time elapsed: 0.001 sec  <<< ERROR!
java.lang.ClassCastException: org.joda.time.Period cannot be cast to org.joda.time.ReadableDuration
	at org.joda.time.convert.ReadableDurationConverter.setInto(ReadableDurationConverter.java:72)
	at org.joda.time.base.BasePeriod.<init>(BasePeriod.java:279)
	at org.joda.time.MutablePeriod.<init>(MutablePeriod.java:374)
	at org.joda.time.TestMutablePeriod_Constructors.testConstructor_Object4(TestMutablePeriod_Constructors.java:867)

testConstructor_Object_PeriodType1(org.joda.time.TestMutablePeriod_Constructors)  Time elapsed: 0.001 sec  <<< ERROR!
java.lang.ClassCastException: java.lang.String cannot be cast to org.joda.time.ReadablePeriod
	at org.joda.time.convert.ReadablePeriodConverter.setInto(ReadablePeriodConverter.java:58)
	at org.joda.time.base.BasePeriod.<init>(BasePeriod.java:279)
	at org.joda.time.MutablePeriod.<init>(MutablePeriod.java:391)
	at org.joda.time.TestMutablePeriod_Constructors.testConstructor_Object_PeriodType1(TestMutablePeriod_Constructors.java:884)

testConstructor_Object_PeriodType3(org.joda.time.TestMutablePeriod_Constructors)  Time elapsed: 0 sec  <<< ERROR!
java.lang.ClassCastException: org.joda.time.Period cannot be cast to org.joda.time.ReadableDuration
	at org.joda.time.convert.ReadableDurationConverter.setInto(ReadableDurationConverter.java:72)
	at org.joda.time.base.BasePeriod.<init>(BasePeriod.java:279)
	at org.joda.time.MutablePeriod.<init>(MutablePeriod.java:391)
	at org.joda.time.TestMutablePeriod_Constructors.testConstructor_Object_PeriodType3(TestMutablePeriod_Constructors.java:910)

testConstructor_Object_PeriodType4(org.joda.time.TestMutablePeriod_Constructors)  Time elapsed: 0.001 sec  <<< ERROR!
java.lang.ClassCastException: org.joda.time.Period cannot be cast to org.joda.time.ReadableDuration
	at org.joda.time.convert.ReadableDurationConverter.setInto(ReadableDurationConverter.java:72)
	at org.joda.time.base.BasePeriod.<init>(BasePeriod.java:279)
	at org.joda.time.MutablePeriod.<init>(MutablePeriod.java:391)
	at org.joda.time.TestMutablePeriod_Constructors.testConstructor_Object_PeriodType4(TestMutablePeriod_Constructors.java:923)

testFactory_parseWeeks_String(org.joda.time.TestWeeks)  Time elapsed: 0.001 sec  <<< FAILURE!
junit.framework.AssertionFailedError: expected:<1> but was:<0>
	at junit.framework.Assert.fail(Assert.java:47)
	at junit.framework.Assert.failNotEquals(Assert.java:280)
	at junit.framework.Assert.assertEquals(Assert.java:64)
	at junit.framework.Assert.assertEquals(Assert.java:198)
	at junit.framework.Assert.assertEquals(Assert.java:204)
	at org.joda.time.TestWeeks.testFactory_parseWeeks_String(TestWeeks.java:134)

testFactory_parseDays_String(org.joda.time.TestDays)  Time elapsed: 0.001 sec  <<< FAILURE!
junit.framework.AssertionFailedError: expected:<1> but was:<0>
	at junit.framework.Assert.fail(Assert.java:47)
	at junit.framework.Assert.failNotEquals(Assert.java:280)
	at junit.framework.Assert.assertEquals(Assert.java:64)
	at junit.framework.Assert.assertEquals(Assert.java:198)
	at junit.framework.Assert.assertEquals(Assert.java:204)
	at org.joda.time.TestDays.testFactory_parseDays_String(TestDays.java:176)

testFactory_parseHours_String(org.joda.time.TestHours)  Time elapsed: 0 sec  <<< FAILURE!
junit.framework.AssertionFailedError: expected:<1> but was:<0>
	at junit.framework.Assert.fail(Assert.java:47)
	at junit.framework.Assert.failNotEquals(Assert.java:280)
	at junit.framework.Assert.assertEquals(Assert.java:64)
	at junit.framework.Assert.assertEquals(Assert.java:198)
	at junit.framework.Assert.assertEquals(Assert.java:204)
	at org.joda.time.TestHours.testFactory_parseHours_String(TestHours.java:145)

testFactory_parseMinutes_String(org.joda.time.TestMinutes)  Time elapsed: 0.001 sec  <<< FAILURE!
junit.framework.AssertionFailedError: expected:<1> but was:<0>
	at junit.framework.Assert.fail(Assert.java:47)
	at junit.framework.Assert.failNotEquals(Assert.java:280)
	at junit.framework.Assert.assertEquals(Assert.java:64)
	at junit.framework.Assert.assertEquals(Assert.java:198)
	at junit.framework.Assert.assertEquals(Assert.java:204)
	at org.joda.time.TestMinutes.testFactory_parseMinutes_String(TestMinutes.java:135)

testFactory_parseSeconds_String(org.joda.time.TestSeconds)  Time elapsed: 0 sec  <<< FAILURE!
junit.framework.AssertionFailedError: expected:<1> but was:<0>
	at junit.framework.Assert.fail(Assert.java:47)
	at junit.framework.Assert.failNotEquals(Assert.java:280)
	at junit.framework.Assert.assertEquals(Assert.java:64)
	at junit.framework.Assert.assertEquals(Assert.java:198)
	at junit.framework.Assert.assertEquals(Assert.java:204)
	at org.joda.time.TestSeconds.testFactory_parseSeconds_String(TestSeconds.java:132)

testConstructor_nullObject(org.joda.time.TestTimeOfDay_Constructors)  Time elapsed: 0 sec  <<< ERROR!
java.lang.NullPointerException
	at org.joda.time.format.DateTimeFormatterBuilder$CharacterLiteral.parseInto(DateTimeFormatterBuilder.java:1224)
	at org.joda.time.format.InternalParserDateTimeParser.parseInto(InternalParserDateTimeParser.java:52)
	at org.joda.time.format.DateTimeFormatterBuilder$MatchingParser.parseInto(DateTimeFormatterBuilder.java:2556)
	at org.joda.time.format.DateTimeFormatterBuilder$Composite.parseInto(DateTimeFormatterBuilder.java:2462)
	at org.joda.time.format.DateTimeParserBucket.doParseMillis(DateTimeParserBucket.java:179)
	at org.joda.time.format.DateTimeFormatter.parseMillis(DateTimeFormatter.java:780)
	at org.joda.time.convert.StringConverter.getPartialValues(StringConverter.java:87)
	at org.joda.time.base.BasePartial.<init>(BasePartial.java:163)
	at org.joda.time.TimeOfDay.<init>(TimeOfDay.java:277)
	at org.joda.time.TestTimeOfDay_Constructors.testConstructor_nullObject(TestTimeOfDay_Constructors.java:343)

testConstructor_ObjectString1(org.joda.time.TestTimeOfDay_Constructors)  Time elapsed: 0.001 sec  <<< ERROR!
java.lang.ClassCastException: java.lang.String cannot be cast to java.util.Date
	at org.joda.time.convert.DateConverter.getInstantMillis(DateConverter.java:55)
	at org.joda.time.convert.AbstractConverter.getPartialValues(AbstractConverter.java:101)
	at org.joda.time.convert.AbstractConverter.getPartialValues(AbstractConverter.java:123)
	at org.joda.time.base.BasePartial.<init>(BasePartial.java:163)
	at org.joda.time.TimeOfDay.<init>(TimeOfDay.java:277)
	at org.joda.time.TestTimeOfDay_Constructors.testConstructor_ObjectString1(TestTimeOfDay_Constructors.java:365)

testConstructor_ObjectString2(org.joda.time.TestTimeOfDay_Constructors)  Time elapsed: 0 sec  <<< ERROR!
java.lang.ClassCastException: java.lang.String cannot be cast to java.util.Date
	at org.joda.time.convert.DateConverter.getInstantMillis(DateConverter.java:55)
	at org.joda.time.convert.AbstractConverter.getPartialValues(AbstractConverter.java:101)
	at org.joda.time.convert.AbstractConverter.getPartialValues(AbstractConverter.java:123)
	at org.joda.time.base.BasePartial.<init>(BasePartial.java:163)
	at org.joda.time.TimeOfDay.<init>(TimeOfDay.java:277)
	at org.joda.time.TestTimeOfDay_Constructors.testConstructor_ObjectString2(TestTimeOfDay_Constructors.java:374)

testConstructor_ObjectString3(org.joda.time.TestTimeOfDay_Constructors)  Time elapsed: 0.001 sec  <<< ERROR!
java.lang.ClassCastException: java.lang.String cannot be cast to java.util.Date
	at org.joda.time.convert.DateConverter.getInstantMillis(DateConverter.java:55)
	at org.joda.time.convert.AbstractConverter.getPartialValues(AbstractConverter.java:101)
	at org.joda.time.convert.AbstractConverter.getPartialValues(AbstractConverter.java:123)
	at org.joda.time.base.BasePartial.<init>(BasePartial.java:163)
	at org.joda.time.TimeOfDay.<init>(TimeOfDay.java:277)
	at org.joda.time.TestTimeOfDay_Constructors.testConstructor_ObjectString3(TestTimeOfDay_Constructors.java:383)

testConstructor_ObjectString4(org.joda.time.TestTimeOfDay_Constructors)  Time elapsed: 0 sec  <<< ERROR!
java.lang.ClassCastException: java.lang.String cannot be cast to java.util.Date
	at org.joda.time.convert.DateConverter.getInstantMillis(DateConverter.java:55)
	at org.joda.time.convert.AbstractConverter.getPartialValues(AbstractConverter.java:101)
	at org.joda.time.convert.AbstractConverter.getPartialValues(AbstractConverter.java:123)
	at org.joda.time.base.BasePartial.<init>(BasePartial.java:163)
	at org.joda.time.TimeOfDay.<init>(TimeOfDay.java:277)
	at org.joda.time.TestTimeOfDay_Constructors.testConstructor_ObjectString4(TestTimeOfDay_Constructors.java:392)

testConstructor_ObjectString5(org.joda.time.TestTimeOfDay_Constructors)  Time elapsed: 0 sec  <<< ERROR!
java.lang.ClassCastException: java.lang.String cannot be cast to java.util.Date
	at org.joda.time.convert.DateConverter.getInstantMillis(DateConverter.java:55)
	at org.joda.time.convert.AbstractConverter.getPartialValues(AbstractConverter.java:101)
	at org.joda.time.convert.AbstractConverter.getPartialValues(AbstractConverter.java:123)
	at org.joda.time.base.BasePartial.<init>(BasePartial.java:163)
	at org.joda.time.TimeOfDay.<init>(TimeOfDay.java:277)
	at org.joda.time.TestTimeOfDay_Constructors.testConstructor_ObjectString5(TestTimeOfDay_Constructors.java:401)

testConstructor_ObjectString6(org.joda.time.TestTimeOfDay_Constructors)  Time elapsed: 0 sec  <<< ERROR!
java.lang.ClassCastException: java.lang.String cannot be cast to java.util.Date
	at org.joda.time.convert.DateConverter.getInstantMillis(DateConverter.java:55)
	at org.joda.time.convert.AbstractConverter.getPartialValues(AbstractConverter.java:101)
	at org.joda.time.convert.AbstractConverter.getPartialValues(AbstractConverter.java:123)
	at org.joda.time.base.BasePartial.<init>(BasePartial.java:163)
	at org.joda.time.TimeOfDay.<init>(TimeOfDay.java:277)
	at org.joda.time.TestTimeOfDay_Constructors.testConstructor_ObjectString6(TestTimeOfDay_Constructors.java:410)

testConstructor_ObjectStringEx1(org.joda.time.TestTimeOfDay_Constructors)  Time elapsed: 0 sec  <<< ERROR!
java.lang.ClassCastException: java.lang.String cannot be cast to java.util.Date
	at org.joda.time.convert.DateConverter.getInstantMillis(DateConverter.java:55)
	at org.joda.time.convert.AbstractConverter.getPartialValues(AbstractConverter.java:101)
	at org.joda.time.convert.AbstractConverter.getPartialValues(AbstractConverter.java:123)
	at org.joda.time.base.BasePartial.<init>(BasePartial.java:163)
	at org.joda.time.TimeOfDay.<init>(TimeOfDay.java:277)
	at org.joda.time.TestTimeOfDay_Constructors.testConstructor_ObjectStringEx1(TestTimeOfDay_Constructors.java:420)

testConstructor_ObjectStringEx2(org.joda.time.TestTimeOfDay_Constructors)  Time elapsed: 0.001 sec  <<< ERROR!
java.lang.ClassCastException: java.lang.String cannot be cast to java.util.Date
	at org.joda.time.convert.DateConverter.getInstantMillis(DateConverter.java:55)
	at org.joda.time.convert.AbstractConverter.getPartialValues(AbstractConverter.java:101)
	at org.joda.time.convert.AbstractConverter.getPartialValues(AbstractConverter.java:123)
	at org.joda.time.base.BasePartial.<init>(BasePartial.java:163)
	at org.joda.time.TimeOfDay.<init>(TimeOfDay.java:277)
	at org.joda.time.TestTimeOfDay_Constructors.testConstructor_ObjectStringEx2(TestTimeOfDay_Constructors.java:427)

testConstructor_nullObject_Chronology(org.joda.time.TestTimeOfDay_Constructors)  Time elapsed: 0 sec  <<< ERROR!
java.lang.NullPointerException
	at org.joda.time.format.DateTimeFormatterBuilder$CharacterLiteral.parseInto(DateTimeFormatterBuilder.java:1224)
	at org.joda.time.format.InternalParserDateTimeParser.parseInto(InternalParserDateTimeParser.java:52)
	at org.joda.time.format.DateTimeFormatterBuilder$MatchingParser.parseInto(DateTimeFormatterBuilder.java:2556)
	at org.joda.time.format.DateTimeFormatterBuilder$Composite.parseInto(DateTimeFormatterBuilder.java:2462)
	at org.joda.time.format.DateTimeParserBucket.doParseMillis(DateTimeParserBucket.java:179)
	at org.joda.time.format.DateTimeFormatter.parseMillis(DateTimeFormatter.java:780)
	at org.joda.time.convert.StringConverter.getPartialValues(StringConverter.java:87)
	at org.joda.time.base.BasePartial.<init>(BasePartial.java:163)
	at org.joda.time.TimeOfDay.<init>(TimeOfDay.java:302)
	at org.joda.time.TestTimeOfDay_Constructors.testConstructor_nullObject_Chronology(TestTimeOfDay_Constructors.java:480)

testConstructor_nullObject_nullChronology(org.joda.time.TestTimeOfDay_Constructors)  Time elapsed: 0.001 sec  <<< ERROR!
java.lang.NullPointerException
	at org.joda.time.format.DateTimeFormatterBuilder$CharacterLiteral.parseInto(DateTimeFormatterBuilder.java:1224)
	at org.joda.time.format.InternalParserDateTimeParser.parseInto(InternalParserDateTimeParser.java:52)
	at org.joda.time.format.DateTimeFormatterBuilder$MatchingParser.parseInto(DateTimeFormatterBuilder.java:2556)
	at org.joda.time.format.DateTimeFormatterBuilder$Composite.parseInto(DateTimeFormatterBuilder.java:2462)
	at org.joda.time.format.DateTimeParserBucket.doParseMillis(DateTimeParserBucket.java:179)
	at org.joda.time.format.DateTimeFormatter.parseMillis(DateTimeFormatter.java:780)
	at org.joda.time.convert.StringConverter.getPartialValues(StringConverter.java:87)
	at org.joda.time.base.BasePartial.<init>(BasePartial.java:163)
	at org.joda.time.TimeOfDay.<init>(TimeOfDay.java:302)
	at org.joda.time.TestTimeOfDay_Constructors.testConstructor_nullObject_nullChronology(TestTimeOfDay_Constructors.java:505)

testConstructor2_Object_Chronology(org.joda.time.TestTimeOfDay_Constructors)  Time elapsed: 0.001 sec  <<< ERROR!
java.lang.ClassCastException: java.lang.String cannot be cast to java.util.Date
	at org.joda.time.convert.DateConverter.getInstantMillis(DateConverter.java:55)
	at org.joda.time.convert.AbstractConverter.getPartialValues(AbstractConverter.java:101)
	at org.joda.time.convert.AbstractConverter.getPartialValues(AbstractConverter.java:123)
	at org.joda.time.base.BasePartial.<init>(BasePartial.java:163)
	at org.joda.time.TimeOfDay.<init>(TimeOfDay.java:277)
	at org.joda.time.TestTimeOfDay_Constructors.testConstructor2_Object_Chronology(TestTimeOfDay_Constructors.java:464)

testConstructor_todObject(org.joda.time.TestTimeOfDay_Constructors)  Time elapsed: 0.001 sec  <<< FAILURE!
junit.framework.AssertionFailedError: expected:<CopticChronology[UTC]> but was:<ISOChronology[UTC]>
	at junit.framework.Assert.fail(Assert.java:47)
	at junit.framework.Assert.failNotEquals(Assert.java:280)
	at junit.framework.Assert.assertEquals(Assert.java:64)
	at junit.framework.Assert.assertEquals(Assert.java:71)
	at org.joda.time.TestTimeOfDay_Constructors.testConstructor_todObject(TestTimeOfDay_Constructors.java:357)

testConstructor_ObjectStringEx3(org.joda.time.TestTimeOfDay_Constructors)  Time elapsed: 0 sec  <<< ERROR!
java.lang.ClassCastException: java.lang.String cannot be cast to java.util.Date
	at org.joda.time.convert.DateConverter.getInstantMillis(DateConverter.java:55)
	at org.joda.time.convert.AbstractConverter.getPartialValues(AbstractConverter.java:101)
	at org.joda.time.convert.AbstractConverter.getPartialValues(AbstractConverter.java:123)
	at org.joda.time.base.BasePartial.<init>(BasePartial.java:163)
	at org.joda.time.TimeOfDay.<init>(TimeOfDay.java:277)
	at org.joda.time.TestTimeOfDay_Constructors.testConstructor_ObjectStringEx3(TestTimeOfDay_Constructors.java:434)

testConstructor_ObjectStringEx4(org.joda.time.TestTimeOfDay_Constructors)  Time elapsed: 0.001 sec  <<< ERROR!
java.lang.ClassCastException: java.lang.String cannot be cast to java.util.Date
	at org.joda.time.convert.DateConverter.getInstantMillis(DateConverter.java:55)
	at org.joda.time.convert.AbstractConverter.getPartialValues(AbstractConverter.java:101)
	at org.joda.time.convert.AbstractConverter.getPartialValues(AbstractConverter.java:123)
	at org.joda.time.base.BasePartial.<init>(BasePartial.java:163)
	at org.joda.time.TimeOfDay.<init>(TimeOfDay.java:277)
	at org.joda.time.TestTimeOfDay_Constructors.testConstructor_ObjectStringEx4(TestTimeOfDay_Constructors.java:441)

testConstructor_Object1(org.joda.time.TestTimeOfDay_Constructors)  Time elapsed: 0 sec  <<< ERROR!
java.lang.ClassCastException: java.util.Date cannot be cast to org.joda.time.ReadablePartial
	at org.joda.time.convert.ReadablePartialConverter.getChronology(ReadablePartialConverter.java:68)
	at org.joda.time.base.BasePartial.<init>(BasePartial.java:160)
	at org.joda.time.TimeOfDay.<init>(TimeOfDay.java:277)
	at org.joda.time.TestTimeOfDay_Constructors.testConstructor_Object1(TestTimeOfDay_Constructors.java:317)

testConstructor_Object(org.joda.time.TestYearMonthDay_Constructors)  Time elapsed: 0.001 sec  <<< ERROR!
java.lang.ClassCastException: java.util.Date cannot be cast to org.joda.time.ReadablePartial
	at org.joda.time.convert.ReadablePartialConverter.getChronology(ReadablePartialConverter.java:68)
	at org.joda.time.base.BasePartial.<init>(BasePartial.java:160)
	at org.joda.time.YearMonthDay.<init>(YearMonthDay.java:231)
	at org.joda.time.TestYearMonthDay_Constructors.testConstructor_Object(TestYearMonthDay_Constructors.java:234)

testConstructor_nullObject(org.joda.time.TestYearMonthDay_Constructors)  Time elapsed: 0 sec  <<< ERROR!
java.lang.NullPointerException
	at org.joda.time.format.DateTimeFormatterBuilder$NumberFormatter.parseInto(DateTimeFormatterBuilder.java:1304)
	at org.joda.time.format.DateTimeFormatterBuilder$Composite.parseInto(DateTimeFormatterBuilder.java:2462)
	at org.joda.time.format.InternalParserDateTimeParser.parseInto(InternalParserDateTimeParser.java:52)
	at org.joda.time.format.DateTimeFormatterBuilder$MatchingParser.parseInto(DateTimeFormatterBuilder.java:2556)
	at org.joda.time.format.DateTimeFormatterBuilder$Composite.parseInto(DateTimeFormatterBuilder.java:2462)
	at org.joda.time.format.DateTimeParserBucket.doParseMillis(DateTimeParserBucket.java:179)
	at org.joda.time.format.DateTimeFormatter.parseMillis(DateTimeFormatter.java:780)
	at org.joda.time.convert.StringConverter.getPartialValues(StringConverter.java:87)
	at org.joda.time.base.BasePartial.<init>(BasePartial.java:163)
	at org.joda.time.YearMonthDay.<init>(YearMonthDay.java:231)
	at org.joda.time.TestYearMonthDay_Constructors.testConstructor_nullObject(TestYearMonthDay_Constructors.java:242)

testConstructor_ObjectString1(org.joda.time.TestYearMonthDay_Constructors)  Time elapsed: 0 sec  <<< ERROR!
java.lang.ClassCastException: java.lang.String cannot be cast to java.util.Date
	at org.joda.time.convert.DateConverter.getInstantMillis(DateConverter.java:55)
	at org.joda.time.convert.AbstractConverter.getPartialValues(AbstractConverter.java:101)
	at org.joda.time.convert.AbstractConverter.getPartialValues(AbstractConverter.java:123)
	at org.joda.time.base.BasePartial.<init>(BasePartial.java:163)
	at org.joda.time.YearMonthDay.<init>(YearMonthDay.java:231)
	at org.joda.time.TestYearMonthDay_Constructors.testConstructor_ObjectString1(TestYearMonthDay_Constructors.java:250)

testConstructor_ObjectString2(org.joda.time.TestYearMonthDay_Constructors)  Time elapsed: 0.001 sec  <<< ERROR!
java.lang.ClassCastException: java.lang.String cannot be cast to java.util.Date
	at org.joda.time.convert.DateConverter.getInstantMillis(DateConverter.java:55)
	at org.joda.time.convert.AbstractConverter.getPartialValues(AbstractConverter.java:101)
	at org.joda.time.convert.AbstractConverter.getPartialValues(AbstractConverter.java:123)
	at org.joda.time.base.BasePartial.<init>(BasePartial.java:163)
	at org.joda.time.YearMonthDay.<init>(YearMonthDay.java:231)
	at org.joda.time.TestYearMonthDay_Constructors.testConstructor_ObjectString2(TestYearMonthDay_Constructors.java:258)

testConstructor_ObjectString3(org.joda.time.TestYearMonthDay_Constructors)  Time elapsed: 0.001 sec  <<< ERROR!
java.lang.ClassCastException: java.lang.String cannot be cast to java.util.Date
	at org.joda.time.convert.DateConverter.getInstantMillis(DateConverter.java:55)
	at org.joda.time.convert.AbstractConverter.getPartialValues(AbstractConverter.java:101)
	at org.joda.time.convert.AbstractConverter.getPartialValues(AbstractConverter.java:123)
	at org.joda.time.base.BasePartial.<init>(BasePartial.java:163)
	at org.joda.time.YearMonthDay.<init>(YearMonthDay.java:231)
	at org.joda.time.TestYearMonthDay_Constructors.testConstructor_ObjectString3(TestYearMonthDay_Constructors.java:266)

testConstructor_ObjectString4(org.joda.time.TestYearMonthDay_Constructors)  Time elapsed: 0 sec  <<< ERROR!
java.lang.ClassCastException: java.lang.String cannot be cast to java.util.Date
	at org.joda.time.convert.DateConverter.getInstantMillis(DateConverter.java:55)
	at org.joda.time.convert.AbstractConverter.getPartialValues(AbstractConverter.java:101)
	at org.joda.time.convert.AbstractConverter.getPartialValues(AbstractConverter.java:123)
	at org.joda.time.base.BasePartial.<init>(BasePartial.java:163)
	at org.joda.time.YearMonthDay.<init>(YearMonthDay.java:231)
	at org.joda.time.TestYearMonthDay_Constructors.testConstructor_ObjectString4(TestYearMonthDay_Constructors.java:274)

testConstructor_ObjectString5(org.joda.time.TestYearMonthDay_Constructors)  Time elapsed: 0.001 sec  <<< ERROR!
java.lang.ClassCastException: java.lang.String cannot be cast to java.util.Date
	at org.joda.time.convert.DateConverter.getInstantMillis(DateConverter.java:55)
	at org.joda.time.convert.AbstractConverter.getPartialValues(AbstractConverter.java:101)
	at org.joda.time.convert.AbstractConverter.getPartialValues(AbstractConverter.java:123)
	at org.joda.time.base.BasePartial.<init>(BasePartial.java:163)
	at org.joda.time.YearMonthDay.<init>(YearMonthDay.java:231)
	at org.joda.time.TestYearMonthDay_Constructors.testConstructor_ObjectString5(TestYearMonthDay_Constructors.java:282)

testConstructor_ObjectStringEx1(org.joda.time.TestYearMonthDay_Constructors)  Time elapsed: 0 sec  <<< ERROR!
java.lang.ClassCastException: java.lang.String cannot be cast to java.util.Date
	at org.joda.time.convert.DateConverter.getInstantMillis(DateConverter.java:55)
	at org.joda.time.convert.AbstractConverter.getPartialValues(AbstractConverter.java:101)
	at org.joda.time.convert.AbstractConverter.getPartialValues(AbstractConverter.java:123)
	at org.joda.time.base.BasePartial.<init>(BasePartial.java:163)
	at org.joda.time.YearMonthDay.<init>(YearMonthDay.java:231)
	at org.joda.time.TestYearMonthDay_Constructors.testConstructor_ObjectStringEx1(TestYearMonthDay_Constructors.java:291)

testConstructor_ObjectStringEx2(org.joda.time.TestYearMonthDay_Constructors)  Time elapsed: 0.001 sec  <<< ERROR!
java.lang.ClassCastException: java.lang.String cannot be cast to java.util.Date
	at org.joda.time.convert.DateConverter.getInstantMillis(DateConverter.java:55)
	at org.joda.time.convert.AbstractConverter.getPartialValues(AbstractConverter.java:101)
	at org.joda.time.convert.AbstractConverter.getPartialValues(AbstractConverter.java:123)
	at org.joda.time.base.BasePartial.<init>(BasePartial.java:163)
	at org.joda.time.YearMonthDay.<init>(YearMonthDay.java:231)
	at org.joda.time.TestYearMonthDay_Constructors.testConstructor_ObjectStringEx2(TestYearMonthDay_Constructors.java:300)

testConstructor_Object_Chronology(org.joda.time.TestYearMonthDay_Constructors)  Time elapsed: 0 sec  <<< ERROR!
java.lang.ClassCastException: java.util.Date cannot be cast to org.joda.time.ReadablePartial
	at org.joda.time.convert.ReadablePartialConverter.getPartialValues(ReadablePartialConverter.java:87)
	at org.joda.time.convert.AbstractConverter.getPartialValues(AbstractConverter.java:123)
	at org.joda.time.base.BasePartial.<init>(BasePartial.java:163)
	at org.joda.time.YearMonthDay.<init>(YearMonthDay.java:256)
	at org.joda.time.TestYearMonthDay_Constructors.testConstructor_Object_Chronology(TestYearMonthDay_Constructors.java:331)

testConstructor_nullObject_Chronology(org.joda.time.TestYearMonthDay_Constructors)  Time elapsed: 0 sec  <<< ERROR!
java.lang.NullPointerException
	at org.joda.time.format.DateTimeFormatterBuilder$NumberFormatter.parseInto(DateTimeFormatterBuilder.java:1304)
	at org.joda.time.format.DateTimeFormatterBuilder$Composite.parseInto(DateTimeFormatterBuilder.java:2462)
	at org.joda.time.format.InternalParserDateTimeParser.parseInto(InternalParserDateTimeParser.java:52)
	at org.joda.time.format.DateTimeFormatterBuilder$MatchingParser.parseInto(DateTimeFormatterBuilder.java:2556)
	at org.joda.time.format.DateTimeFormatterBuilder$Composite.parseInto(DateTimeFormatterBuilder.java:2462)
	at org.joda.time.format.DateTimeParserBucket.doParseMillis(DateTimeParserBucket.java:179)
	at org.joda.time.format.DateTimeFormatter.parseMillis(DateTimeFormatter.java:780)
	at org.joda.time.convert.StringConverter.getPartialValues(StringConverter.java:87)
	at org.joda.time.base.BasePartial.<init>(BasePartial.java:163)
	at org.joda.time.YearMonthDay.<init>(YearMonthDay.java:256)
	at org.joda.time.TestYearMonthDay_Constructors.testConstructor_nullObject_Chronology(TestYearMonthDay_Constructors.java:342)

testConstructor_Object_nullChronology(org.joda.time.TestYearMonthDay_Constructors)  Time elapsed: 0.001 sec  <<< ERROR!
java.lang.ClassCastException: java.util.Date cannot be cast to org.joda.time.ReadablePartial
	at org.joda.time.convert.ReadablePartialConverter.getPartialValues(ReadablePartialConverter.java:87)
	at org.joda.time.convert.AbstractConverter.getPartialValues(AbstractConverter.java:123)
	at org.joda.time.base.BasePartial.<init>(BasePartial.java:163)
	at org.joda.time.YearMonthDay.<init>(YearMonthDay.java:256)
	at org.joda.time.TestYearMonthDay_Constructors.testConstructor_Object_nullChronology(TestYearMonthDay_Constructors.java:354)

testConstructor_nullObject_nullChronology(org.joda.time.TestYearMonthDay_Constructors)  Time elapsed: 0 sec  <<< ERROR!
java.lang.NullPointerException
	at org.joda.time.format.DateTimeFormatterBuilder$NumberFormatter.parseInto(DateTimeFormatterBuilder.java:1304)
	at org.joda.time.format.DateTimeFormatterBuilder$Composite.parseInto(DateTimeFormatterBuilder.java:2462)
	at org.joda.time.format.InternalParserDateTimeParser.parseInto(InternalParserDateTimeParser.java:52)
	at org.joda.time.format.DateTimeFormatterBuilder$MatchingParser.parseInto(DateTimeFormatterBuilder.java:2556)
	at org.joda.time.format.DateTimeFormatterBuilder$Composite.parseInto(DateTimeFormatterBuilder.java:2462)
	at org.joda.time.format.DateTimeParserBucket.doParseMillis(DateTimeParserBucket.java:179)
	at org.joda.time.format.DateTimeFormatter.parseMillis(DateTimeFormatter.java:780)
	at org.joda.time.convert.StringConverter.getPartialValues(StringConverter.java:87)
	at org.joda.time.base.BasePartial.<init>(BasePartial.java:163)
	at org.joda.time.YearMonthDay.<init>(YearMonthDay.java:256)
	at org.joda.time.TestYearMonthDay_Constructors.testConstructor_nullObject_nullChronology(TestYearMonthDay_Constructors.java:365)

testConstructor_ObjectStringEx3(org.joda.time.TestYearMonthDay_Constructors)  Time elapsed: 0.001 sec  <<< ERROR!
java.lang.ClassCastException: java.lang.String cannot be cast to java.util.Date
	at org.joda.time.convert.DateConverter.getInstantMillis(DateConverter.java:55)
	at org.joda.time.convert.AbstractConverter.getPartialValues(AbstractConverter.java:101)
	at org.joda.time.convert.AbstractConverter.getPartialValues(AbstractConverter.java:123)
	at org.joda.time.base.BasePartial.<init>(BasePartial.java:163)
	at org.joda.time.YearMonthDay.<init>(YearMonthDay.java:231)
	at org.joda.time.TestYearMonthDay_Constructors.testConstructor_ObjectStringEx3(TestYearMonthDay_Constructors.java:309)

testConstructor_ObjectStringEx4(org.joda.time.TestYearMonthDay_Constructors)  Time elapsed: 0.001 sec  <<< ERROR!
java.lang.ClassCastException: java.lang.String cannot be cast to java.util.Date
	at org.joda.time.convert.DateConverter.getInstantMillis(DateConverter.java:55)
	at org.joda.time.convert.AbstractConverter.getPartialValues(AbstractConverter.java:101)
	at org.joda.time.convert.AbstractConverter.getPartialValues(AbstractConverter.java:123)
	at org.joda.time.base.BasePartial.<init>(BasePartial.java:163)
	at org.joda.time.YearMonthDay.<init>(YearMonthDay.java:231)
	at org.joda.time.TestYearMonthDay_Constructors.testConstructor_ObjectStringEx4(TestYearMonthDay_Constructors.java:318)

testConstructor_Object(org.joda.time.TestYearMonth_Constructors)  Time elapsed: 0.001 sec  <<< ERROR!
java.lang.ClassCastException: java.util.Date cannot be cast to org.joda.time.ReadablePartial
	at org.joda.time.convert.ReadablePartialConverter.getChronology(ReadablePartialConverter.java:68)
	at org.joda.time.base.BasePartial.<init>(BasePartial.java:160)
	at org.joda.time.YearMonth.<init>(YearMonth.java:289)
	at org.joda.time.TestYearMonth_Constructors.testConstructor_Object(TestYearMonth_Constructors.java:239)

testConstructor_nullObject(org.joda.time.TestYearMonth_Constructors)  Time elapsed: 0 sec  <<< ERROR!
java.lang.NullPointerException
	at org.joda.time.format.DateTimeFormatterBuilder$NumberFormatter.parseInto(DateTimeFormatterBuilder.java:1304)
	at org.joda.time.format.DateTimeFormatterBuilder$Composite.parseInto(DateTimeFormatterBuilder.java:2462)
	at org.joda.time.format.InternalParserDateTimeParser.parseInto(InternalParserDateTimeParser.java:52)
	at org.joda.time.format.DateTimeFormatterBuilder$MatchingParser.parseInto(DateTimeFormatterBuilder.java:2556)
	at org.joda.time.format.DateTimeParserBucket.doParseMillis(DateTimeParserBucket.java:179)
	at org.joda.time.format.DateTimeFormatter.parseMillis(DateTimeFormatter.java:780)
	at org.joda.time.convert.StringConverter.getPartialValues(StringConverter.java:87)
	at org.joda.time.base.BasePartial.<init>(BasePartial.java:163)
	at org.joda.time.YearMonth.<init>(YearMonth.java:289)
	at org.joda.time.TestYearMonth_Constructors.testConstructor_nullObject(TestYearMonth_Constructors.java:246)

testConstructor_ObjectString1(org.joda.time.TestYearMonth_Constructors)  Time elapsed: 0 sec  <<< ERROR!
java.lang.ClassCastException: java.lang.String cannot be cast to java.util.Date
	at org.joda.time.convert.DateConverter.getInstantMillis(DateConverter.java:55)
	at org.joda.time.convert.AbstractConverter.getPartialValues(AbstractConverter.java:101)
	at org.joda.time.convert.AbstractConverter.getPartialValues(AbstractConverter.java:123)
	at org.joda.time.base.BasePartial.<init>(BasePartial.java:163)
	at org.joda.time.YearMonth.<init>(YearMonth.java:289)
	at org.joda.time.TestYearMonth_Constructors.testConstructor_ObjectString1(TestYearMonth_Constructors.java:253)

testConstructor_ObjectString5(org.joda.time.TestYearMonth_Constructors)  Time elapsed: 0.001 sec  <<< ERROR!
java.lang.ClassCastException: java.lang.String cannot be cast to java.util.Date
	at org.joda.time.convert.DateConverter.getInstantMillis(DateConverter.java:55)
	at org.joda.time.convert.AbstractConverter.getPartialValues(AbstractConverter.java:101)
	at org.joda.time.convert.AbstractConverter.getPartialValues(AbstractConverter.java:123)
	at org.joda.time.base.BasePartial.<init>(BasePartial.java:163)
	at org.joda.time.YearMonth.<init>(YearMonth.java:289)
	at org.joda.time.TestYearMonth_Constructors.testConstructor_ObjectString5(TestYearMonth_Constructors.java:260)

testConstructor_ObjectStringEx1(org.joda.time.TestYearMonth_Constructors)  Time elapsed: 0.001 sec  <<< ERROR!
java.lang.ClassCastException: java.lang.String cannot be cast to java.util.Date
	at org.joda.time.convert.DateConverter.getInstantMillis(DateConverter.java:55)
	at org.joda.time.convert.AbstractConverter.getPartialValues(AbstractConverter.java:101)
	at org.joda.time.convert.AbstractConverter.getPartialValues(AbstractConverter.java:123)
	at org.joda.time.base.BasePartial.<init>(BasePartial.java:163)
	at org.joda.time.YearMonth.<init>(YearMonth.java:289)
	at org.joda.time.TestYearMonth_Constructors.testConstructor_ObjectStringEx1(TestYearMonth_Constructors.java:268)

testConstructor_ObjectStringEx2(org.joda.time.TestYearMonth_Constructors)  Time elapsed: 0 sec  <<< ERROR!
java.lang.ClassCastException: java.lang.String cannot be cast to java.util.Date
	at org.joda.time.convert.DateConverter.getInstantMillis(DateConverter.java:55)
	at org.joda.time.convert.AbstractConverter.getPartialValues(AbstractConverter.java:101)
	at org.joda.time.convert.AbstractConverter.getPartialValues(AbstractConverter.java:123)
	at org.joda.time.base.BasePartial.<init>(BasePartial.java:163)
	at org.joda.time.YearMonth.<init>(YearMonth.java:289)
	at org.joda.time.TestYearMonth_Constructors.testConstructor_ObjectStringEx2(TestYearMonth_Constructors.java:277)

testConstructor_Object_Chronology(org.joda.time.TestYearMonth_Constructors)  Time elapsed: 0.001 sec  <<< ERROR!
java.lang.ClassCastException: java.util.Date cannot be cast to org.joda.time.ReadablePartial
	at org.joda.time.convert.ReadablePartialConverter.getPartialValues(ReadablePartialConverter.java:87)
	at org.joda.time.convert.AbstractConverter.getPartialValues(AbstractConverter.java:123)
	at org.joda.time.base.BasePartial.<init>(BasePartial.java:163)
	at org.joda.time.YearMonth.<init>(YearMonth.java:311)
	at org.joda.time.TestYearMonth_Constructors.testConstructor_Object_Chronology(TestYearMonth_Constructors.java:308)

testConstructor_nullObject_Chronology(org.joda.time.TestYearMonth_Constructors)  Time elapsed: 0.001 sec  <<< ERROR!
java.lang.NullPointerException
	at org.joda.time.format.DateTimeFormatterBuilder$NumberFormatter.parseInto(DateTimeFormatterBuilder.java:1304)
	at org.joda.time.format.DateTimeFormatterBuilder$Composite.parseInto(DateTimeFormatterBuilder.java:2462)
	at org.joda.time.format.InternalParserDateTimeParser.parseInto(InternalParserDateTimeParser.java:52)
	at org.joda.time.format.DateTimeFormatterBuilder$MatchingParser.parseInto(DateTimeFormatterBuilder.java:2556)
	at org.joda.time.format.DateTimeParserBucket.doParseMillis(DateTimeParserBucket.java:179)
	at org.joda.time.format.DateTimeFormatter.parseMillis(DateTimeFormatter.java:780)
	at org.joda.time.convert.StringConverter.getPartialValues(StringConverter.java:87)
	at org.joda.time.base.BasePartial.<init>(BasePartial.java:163)
	at org.joda.time.YearMonth.<init>(YearMonth.java:311)
	at org.joda.time.TestYearMonth_Constructors.testConstructor_nullObject_Chronology(TestYearMonth_Constructors.java:318)

testConstructor_Object_nullChronology(org.joda.time.TestYearMonth_Constructors)  Time elapsed: 0 sec  <<< ERROR!
java.lang.ClassCastException: java.util.Date cannot be cast to org.joda.time.ReadablePartial
	at org.joda.time.convert.ReadablePartialConverter.getPartialValues(ReadablePartialConverter.java:87)
	at org.joda.time.convert.AbstractConverter.getPartialValues(AbstractConverter.java:123)
	at org.joda.time.base.BasePartial.<init>(BasePartial.java:163)
	at org.joda.time.YearMonth.<init>(YearMonth.java:311)
	at org.joda.time.TestYearMonth_Constructors.testConstructor_Object_nullChronology(TestYearMonth_Constructors.java:329)

testConstructor_nullObject_nullChronology(org.joda.time.TestYearMonth_Constructors)  Time elapsed: 0.001 sec  <<< ERROR!
java.lang.NullPointerException
	at org.joda.time.format.DateTimeFormatterBuilder$NumberFormatter.parseInto(DateTimeFormatterBuilder.java:1304)
	at org.joda.time.format.DateTimeFormatterBuilder$Composite.parseInto(DateTimeFormatterBuilder.java:2462)
	at org.joda.time.format.InternalParserDateTimeParser.parseInto(InternalParserDateTimeParser.java:52)
	at org.joda.time.format.DateTimeFormatterBuilder$MatchingParser.parseInto(DateTimeFormatterBuilder.java:2556)
	at org.joda.time.format.DateTimeParserBucket.doParseMillis(DateTimeParserBucket.java:179)
	at org.joda.time.format.DateTimeFormatter.parseMillis(DateTimeFormatter.java:780)
	at org.joda.time.convert.StringConverter.getPartialValues(StringConverter.java:87)
	at org.joda.time.base.BasePartial.<init>(BasePartial.java:163)
	at org.joda.time.YearMonth.<init>(YearMonth.java:311)
	at org.joda.time.TestYearMonth_Constructors.testConstructor_nullObject_nullChronology(TestYearMonth_Constructors.java:339)

testConstructor_ObjectStringEx3(org.joda.time.TestYearMonth_Constructors)  Time elapsed: 0 sec  <<< ERROR!
java.lang.ClassCastException: java.lang.String cannot be cast to java.util.Date
	at org.joda.time.convert.DateConverter.getInstantMillis(DateConverter.java:55)
	at org.joda.time.convert.AbstractConverter.getPartialValues(AbstractConverter.java:101)
	at org.joda.time.convert.AbstractConverter.getPartialValues(AbstractConverter.java:123)
	at org.joda.time.base.BasePartial.<init>(BasePartial.java:163)
	at org.joda.time.YearMonth.<init>(YearMonth.java:289)
	at org.joda.time.TestYearMonth_Constructors.testConstructor_ObjectStringEx3(TestYearMonth_Constructors.java:286)

testConstructor_ObjectStringEx4(org.joda.time.TestYearMonth_Constructors)  Time elapsed: 0.001 sec  <<< ERROR!
java.lang.ClassCastException: java.lang.String cannot be cast to java.util.Date
	at org.joda.time.convert.DateConverter.getInstantMillis(DateConverter.java:55)
	at org.joda.time.convert.AbstractConverter.getPartialValues(AbstractConverter.java:101)
	at org.joda.time.convert.AbstractConverter.getPartialValues(AbstractConverter.java:123)
	at org.joda.time.base.BasePartial.<init>(BasePartial.java:163)
	at org.joda.time.YearMonth.<init>(YearMonth.java:289)
	at org.joda.time.TestYearMonth_Constructors.testConstructor_ObjectStringEx4(TestYearMonth_Constructors.java:295)

testConstructor_Object(org.joda.time.TestMonthDay_Constructors)  Time elapsed: 0 sec  <<< ERROR!
java.lang.ClassCastException: java.util.Date cannot be cast to org.joda.time.ReadablePartial
	at org.joda.time.convert.ReadablePartialConverter.getChronology(ReadablePartialConverter.java:68)
	at org.joda.time.base.BasePartial.<init>(BasePartial.java:160)
	at org.joda.time.MonthDay.<init>(MonthDay.java:297)
	at org.joda.time.TestMonthDay_Constructors.testConstructor_Object(TestMonthDay_Constructors.java:239)

testConstructor_nullObject(org.joda.time.TestMonthDay_Constructors)  Time elapsed: 0 sec  <<< ERROR!
java.lang.NullPointerException
	at org.joda.time.format.DateTimeFormatterBuilder$NumberFormatter.parseInto(DateTimeFormatterBuilder.java:1304)
	at org.joda.time.format.DateTimeFormatterBuilder$Composite.parseInto(DateTimeFormatterBuilder.java:2462)
	at org.joda.time.format.InternalParserDateTimeParser.parseInto(InternalParserDateTimeParser.java:52)
	at org.joda.time.format.DateTimeFormatterBuilder$MatchingParser.parseInto(DateTimeFormatterBuilder.java:2556)
	at org.joda.time.format.DateTimeParserBucket.doParseMillis(DateTimeParserBucket.java:179)
	at org.joda.time.format.DateTimeFormatter.parseMillis(DateTimeFormatter.java:780)
	at org.joda.time.convert.StringConverter.getPartialValues(StringConverter.java:87)
	at org.joda.time.base.BasePartial.<init>(BasePartial.java:163)
	at org.joda.time.MonthDay.<init>(MonthDay.java:297)
	at org.joda.time.TestMonthDay_Constructors.testConstructor_nullObject(TestMonthDay_Constructors.java:246)

testConstructor_ObjectString1(org.joda.time.TestMonthDay_Constructors)  Time elapsed: 0 sec  <<< ERROR!
java.lang.ClassCastException: java.lang.String cannot be cast to java.util.Date
	at org.joda.time.convert.DateConverter.getInstantMillis(DateConverter.java:55)
	at org.joda.time.convert.AbstractConverter.getPartialValues(AbstractConverter.java:101)
	at org.joda.time.convert.AbstractConverter.getPartialValues(AbstractConverter.java:123)
	at org.joda.time.base.BasePartial.<init>(BasePartial.java:163)
	at org.joda.time.MonthDay.<init>(MonthDay.java:297)
	at org.joda.time.TestMonthDay_Constructors.testConstructor_ObjectString1(TestMonthDay_Constructors.java:253)

testConstructor_ObjectString5(org.joda.time.TestMonthDay_Constructors)  Time elapsed: 0 sec  <<< ERROR!
java.lang.ClassCastException: java.lang.String cannot be cast to java.util.Date
	at org.joda.time.convert.DateConverter.getInstantMillis(DateConverter.java:55)
	at org.joda.time.convert.AbstractConverter.getPartialValues(AbstractConverter.java:101)
	at org.joda.time.convert.AbstractConverter.getPartialValues(AbstractConverter.java:123)
	at org.joda.time.base.BasePartial.<init>(BasePartial.java:163)
	at org.joda.time.MonthDay.<init>(MonthDay.java:297)
	at org.joda.time.TestMonthDay_Constructors.testConstructor_ObjectString5(TestMonthDay_Constructors.java:260)

testConstructor_ObjectStringEx1(org.joda.time.TestMonthDay_Constructors)  Time elapsed: 0 sec  <<< ERROR!
java.lang.ClassCastException: java.lang.String cannot be cast to java.util.Date
	at org.joda.time.convert.DateConverter.getInstantMillis(DateConverter.java:55)
	at org.joda.time.convert.AbstractConverter.getPartialValues(AbstractConverter.java:101)
	at org.joda.time.convert.AbstractConverter.getPartialValues(AbstractConverter.java:123)
	at org.joda.time.base.BasePartial.<init>(BasePartial.java:163)
	at org.joda.time.MonthDay.<init>(MonthDay.java:297)
	at org.joda.time.TestMonthDay_Constructors.testConstructor_ObjectStringEx1(TestMonthDay_Constructors.java:268)

testConstructor_ObjectStringEx2(org.joda.time.TestMonthDay_Constructors)  Time elapsed: 0 sec  <<< ERROR!
java.lang.ClassCastException: java.lang.String cannot be cast to java.util.Date
	at org.joda.time.convert.DateConverter.getInstantMillis(DateConverter.java:55)
	at org.joda.time.convert.AbstractConverter.getPartialValues(AbstractConverter.java:101)
	at org.joda.time.convert.AbstractConverter.getPartialValues(AbstractConverter.java:123)
	at org.joda.time.base.BasePartial.<init>(BasePartial.java:163)
	at org.joda.time.MonthDay.<init>(MonthDay.java:297)
	at org.joda.time.TestMonthDay_Constructors.testConstructor_ObjectStringEx2(TestMonthDay_Constructors.java:277)

testConstructor_Object_Chronology(org.joda.time.TestMonthDay_Constructors)  Time elapsed: 0 sec  <<< ERROR!
java.lang.ClassCastException: java.util.Date cannot be cast to org.joda.time.ReadablePartial
	at org.joda.time.convert.ReadablePartialConverter.getPartialValues(ReadablePartialConverter.java:87)
	at org.joda.time.convert.AbstractConverter.getPartialValues(AbstractConverter.java:123)
	at org.joda.time.base.BasePartial.<init>(BasePartial.java:163)
	at org.joda.time.MonthDay.<init>(MonthDay.java:319)
	at org.joda.time.TestMonthDay_Constructors.testConstructor_Object_Chronology(TestMonthDay_Constructors.java:308)

testConstructor_nullObject_Chronology(org.joda.time.TestMonthDay_Constructors)  Time elapsed: 0 sec  <<< ERROR!
java.lang.NullPointerException
	at org.joda.time.format.DateTimeFormatterBuilder$NumberFormatter.parseInto(DateTimeFormatterBuilder.java:1304)
	at org.joda.time.format.DateTimeFormatterBuilder$Composite.parseInto(DateTimeFormatterBuilder.java:2462)
	at org.joda.time.format.InternalParserDateTimeParser.parseInto(InternalParserDateTimeParser.java:52)
	at org.joda.time.format.DateTimeFormatterBuilder$MatchingParser.parseInto(DateTimeFormatterBuilder.java:2556)
	at org.joda.time.format.DateTimeParserBucket.doParseMillis(DateTimeParserBucket.java:179)
	at org.joda.time.format.DateTimeFormatter.parseMillis(DateTimeFormatter.java:780)
	at org.joda.time.convert.StringConverter.getPartialValues(StringConverter.java:87)
	at org.joda.time.base.BasePartial.<init>(BasePartial.java:163)
	at org.joda.time.MonthDay.<init>(MonthDay.java:319)
	at org.joda.time.TestMonthDay_Constructors.testConstructor_nullObject_Chronology(TestMonthDay_Constructors.java:318)

testConstructor_Object_nullChronology(org.joda.time.TestMonthDay_Constructors)  Time elapsed: 0 sec  <<< ERROR!
java.lang.ClassCastException: java.util.Date cannot be cast to org.joda.time.ReadablePartial
	at org.joda.time.convert.ReadablePartialConverter.getPartialValues(ReadablePartialConverter.java:87)
	at org.joda.time.convert.AbstractConverter.getPartialValues(AbstractConverter.java:123)
	at org.joda.time.base.BasePartial.<init>(BasePartial.java:163)
	at org.joda.time.MonthDay.<init>(MonthDay.java:319)
	at org.joda.time.TestMonthDay_Constructors.testConstructor_Object_nullChronology(TestMonthDay_Constructors.java:329)

testConstructor_nullObject_nullChronology(org.joda.time.TestMonthDay_Constructors)  Time elapsed: 0.001 sec  <<< ERROR!
java.lang.NullPointerException
	at org.joda.time.format.DateTimeFormatterBuilder$NumberFormatter.parseInto(DateTimeFormatterBuilder.java:1304)
	at org.joda.time.format.DateTimeFormatterBuilder$Composite.parseInto(DateTimeFormatterBuilder.java:2462)
	at org.joda.time.format.InternalParserDateTimeParser.parseInto(InternalParserDateTimeParser.java:52)
	at org.joda.time.format.DateTimeFormatterBuilder$MatchingParser.parseInto(DateTimeFormatterBuilder.java:2556)
	at org.joda.time.format.DateTimeParserBucket.doParseMillis(DateTimeParserBucket.java:179)
	at org.joda.time.format.DateTimeFormatter.parseMillis(DateTimeFormatter.java:780)
	at org.joda.time.convert.StringConverter.getPartialValues(StringConverter.java:87)
	at org.joda.time.base.BasePartial.<init>(BasePartial.java:163)
	at org.joda.time.MonthDay.<init>(MonthDay.java:319)
	at org.joda.time.TestMonthDay_Constructors.testConstructor_nullObject_nullChronology(TestMonthDay_Constructors.java:339)

testConstructor_ObjectStringEx3(org.joda.time.TestMonthDay_Constructors)  Time elapsed: 0 sec  <<< ERROR!
java.lang.ClassCastException: java.lang.String cannot be cast to java.util.Date
	at org.joda.time.convert.DateConverter.getInstantMillis(DateConverter.java:55)
	at org.joda.time.convert.AbstractConverter.getPartialValues(AbstractConverter.java:101)
	at org.joda.time.convert.AbstractConverter.getPartialValues(AbstractConverter.java:123)
	at org.joda.time.base.BasePartial.<init>(BasePartial.java:163)
	at org.joda.time.MonthDay.<init>(MonthDay.java:297)
	at org.joda.time.TestMonthDay_Constructors.testConstructor_ObjectStringEx3(TestMonthDay_Constructors.java:286)

testConstructor_ObjectStringEx4(org.joda.time.TestMonthDay_Constructors)  Time elapsed: 0.001 sec  <<< ERROR!
java.lang.ClassCastException: java.lang.String cannot be cast to java.util.Date
	at org.joda.time.convert.DateConverter.getInstantMillis(DateConverter.java:55)
	at org.joda.time.convert.AbstractConverter.getPartialValues(AbstractConverter.java:101)
	at org.joda.time.convert.AbstractConverter.getPartialValues(AbstractConverter.java:123)
	at org.joda.time.base.BasePartial.<init>(BasePartial.java:163)
	at org.joda.time.MonthDay.<init>(MonthDay.java:297)
	at org.joda.time.TestMonthDay_Constructors.testConstructor_ObjectStringEx4(TestMonthDay_Constructors.java:295)

testBasicComps3(org.joda.time.TestDateTimeComparator)  Time elapsed: 0.001 sec  <<< ERROR!
java.lang.ClassCastException: java.util.Date cannot be cast to org.joda.time.ReadableInstant
	at org.joda.time.convert.ReadableInstantConverter.getChronology(ReadableInstantConverter.java:84)
	at org.joda.time.DateTimeComparator.compare(DateTimeComparator.java:197)
	at org.joda.time.TestDateTimeComparator.testBasicComps3(TestDateTimeComparator.java:360)

testBasicComps4(org.joda.time.TestDateTimeComparator)  Time elapsed: 0 sec  <<< ERROR!
java.lang.ClassCastException: java.lang.Long cannot be cast to org.joda.time.ReadableInstant
	at org.joda.time.convert.ReadableInstantConverter.getChronology(ReadableInstantConverter.java:84)
	at org.joda.time.DateTimeComparator.compare(DateTimeComparator.java:193)
	at org.joda.time.TestDateTimeComparator.testBasicComps4(TestDateTimeComparator.java:382)

testBasicComps5(org.joda.time.TestDateTimeComparator)  Time elapsed: 0.001 sec  <<< ERROR!
java.lang.ClassCastException: java.util.GregorianCalendar cannot be cast to org.joda.time.ReadableInstant
	at org.joda.time.convert.ReadableInstantConverter.getChronology(ReadableInstantConverter.java:84)
	at org.joda.time.DateTimeComparator.compare(DateTimeComparator.java:193)
	at org.joda.time.TestDateTimeComparator.testBasicComps5(TestDateTimeComparator.java:404)

testMillis(org.joda.time.TestDateTimeComparator)  Time elapsed: 0 sec  <<< ERROR!
java.lang.ClassCastException: org.joda.time.DateTime cannot be cast to java.util.Date
	at org.joda.time.convert.DateConverter.getInstantMillis(DateConverter.java:55)
	at org.joda.time.DateTimeComparator.compare(DateTimeComparator.java:198)
	at org.joda.time.TestDateTimeComparator.testMillis(TestDateTimeComparator.java:426)

testSecond(org.joda.time.TestDateTimeComparator)  Time elapsed: 0.001 sec  <<< ERROR!
java.lang.ClassCastException: java.lang.String cannot be cast to org.joda.time.ReadableInstant
	at org.joda.time.convert.ReadableInstantConverter.getChronology(ReadableInstantConverter.java:58)
	at org.joda.time.base.BaseDateTime.<init>(BaseDateTime.java:152)
	at org.joda.time.DateTime.<init>(DateTime.java:281)
	at org.joda.time.TestDateTimeComparator.getADate(TestDateTimeComparator.java:906)
	at org.joda.time.TestDateTimeComparator.testSecond(TestDateTimeComparator.java:434)

testMinute(org.joda.time.TestDateTimeComparator)  Time elapsed: 0 sec  <<< ERROR!
java.lang.ClassCastException: java.lang.String cannot be cast to org.joda.time.ReadableInstant
	at org.joda.time.convert.ReadableInstantConverter.getChronology(ReadableInstantConverter.java:58)
	at org.joda.time.base.BaseDateTime.<init>(BaseDateTime.java:152)
	at org.joda.time.DateTime.<init>(DateTime.java:281)
	at org.joda.time.TestDateTimeComparator.getADate(TestDateTimeComparator.java:906)
	at org.joda.time.TestDateTimeComparator.testMinute(TestDateTimeComparator.java:448)

testHour(org.joda.time.TestDateTimeComparator)  Time elapsed: 0.001 sec  <<< ERROR!
java.lang.ClassCastException: java.lang.String cannot be cast to org.joda.time.ReadableInstant
	at org.joda.time.convert.ReadableInstantConverter.getChronology(ReadableInstantConverter.java:58)
	at org.joda.time.base.BaseDateTime.<init>(BaseDateTime.java:152)
	at org.joda.time.DateTime.<init>(DateTime.java:281)
	at org.joda.time.TestDateTimeComparator.getADate(TestDateTimeComparator.java:906)
	at org.joda.time.TestDateTimeComparator.testHour(TestDateTimeComparator.java:462)

testDOW(org.joda.time.TestDateTimeComparator)  Time elapsed: 0 sec  <<< ERROR!
java.lang.ClassCastException: java.lang.String cannot be cast to org.joda.time.ReadableInstant
	at org.joda.time.convert.ReadableInstantConverter.getChronology(ReadableInstantConverter.java:58)
	at org.joda.time.base.BaseDateTime.<init>(BaseDateTime.java:152)
	at org.joda.time.DateTime.<init>(DateTime.java:281)
	at org.joda.time.TestDateTimeComparator.getADate(TestDateTimeComparator.java:906)
	at org.joda.time.TestDateTimeComparator.testDOW(TestDateTimeComparator.java:484)

testDOM(org.joda.time.TestDateTimeComparator)  Time elapsed: 0.001 sec  <<< ERROR!
java.lang.ClassCastException: java.lang.String cannot be cast to org.joda.time.ReadableInstant
	at org.joda.time.convert.ReadableInstantConverter.getChronology(ReadableInstantConverter.java:58)
	at org.joda.time.base.BaseDateTime.<init>(BaseDateTime.java:152)
	at org.joda.time.DateTime.<init>(DateTime.java:281)
	at org.joda.time.TestDateTimeComparator.getADate(TestDateTimeComparator.java:906)
	at org.joda.time.TestDateTimeComparator.testDOM(TestDateTimeComparator.java:494)

testDOY(org.joda.time.TestDateTimeComparator)  Time elapsed: 0 sec  <<< ERROR!
java.lang.ClassCastException: java.lang.String cannot be cast to org.joda.time.ReadableInstant
	at org.joda.time.convert.ReadableInstantConverter.getChronology(ReadableInstantConverter.java:58)
	at org.joda.time.base.BaseDateTime.<init>(BaseDateTime.java:152)
	at org.joda.time.DateTime.<init>(DateTime.java:281)
	at org.joda.time.TestDateTimeComparator.getADate(TestDateTimeComparator.java:906)
	at org.joda.time.TestDateTimeComparator.testDOY(TestDateTimeComparator.java:508)

testWOW(org.joda.time.TestDateTimeComparator)  Time elapsed: 0.001 sec  <<< ERROR!
java.lang.ClassCastException: java.lang.String cannot be cast to org.joda.time.ReadableInstant
	at org.joda.time.convert.ReadableInstantConverter.getChronology(ReadableInstantConverter.java:58)
	at org.joda.time.base.BaseDateTime.<init>(BaseDateTime.java:152)
	at org.joda.time.DateTime.<init>(DateTime.java:281)
	at org.joda.time.TestDateTimeComparator.getADate(TestDateTimeComparator.java:906)
	at org.joda.time.TestDateTimeComparator.testWOW(TestDateTimeComparator.java:523)

testWOYY(org.joda.time.TestDateTimeComparator)  Time elapsed: 0 sec  <<< ERROR!
java.lang.ClassCastException: java.lang.String cannot be cast to org.joda.time.ReadableInstant
	at org.joda.time.convert.ReadableInstantConverter.getChronology(ReadableInstantConverter.java:58)
	at org.joda.time.base.BaseDateTime.<init>(BaseDateTime.java:152)
	at org.joda.time.DateTime.<init>(DateTime.java:281)
	at org.joda.time.TestDateTimeComparator.getADate(TestDateTimeComparator.java:906)
	at org.joda.time.TestDateTimeComparator.testWOYY(TestDateTimeComparator.java:543)

testMonth(org.joda.time.TestDateTimeComparator)  Time elapsed: 0.001 sec  <<< ERROR!
java.lang.ClassCastException: java.lang.String cannot be cast to org.joda.time.ReadableInstant
	at org.joda.time.convert.ReadableInstantConverter.getChronology(ReadableInstantConverter.java:58)
	at org.joda.time.base.BaseDateTime.<init>(BaseDateTime.java:152)
	at org.joda.time.DateTime.<init>(DateTime.java:281)
	at org.joda.time.TestDateTimeComparator.getADate(TestDateTimeComparator.java:906)
	at org.joda.time.TestDateTimeComparator.testMonth(TestDateTimeComparator.java:555)

testYear(org.joda.time.TestDateTimeComparator)  Time elapsed: 0 sec  <<< ERROR!
java.lang.ClassCastException: java.lang.String cannot be cast to org.joda.time.ReadableInstant
	at org.joda.time.convert.ReadableInstantConverter.getChronology(ReadableInstantConverter.java:58)
	at org.joda.time.base.BaseDateTime.<init>(BaseDateTime.java:152)
	at org.joda.time.DateTime.<init>(DateTime.java:281)
	at org.joda.time.TestDateTimeComparator.getADate(TestDateTimeComparator.java:906)
	at org.joda.time.TestDateTimeComparator.testYear(TestDateTimeComparator.java:569)

testListBasic(org.joda.time.TestDateTimeComparator)  Time elapsed: 0.001 sec  <<< ERROR!
java.lang.ClassCastException: java.lang.String cannot be cast to org.joda.time.ReadableInstant
	at org.joda.time.convert.ReadableInstantConverter.getChronology(ReadableInstantConverter.java:58)
	at org.joda.time.base.BaseDateTime.<init>(BaseDateTime.java:152)
	at org.joda.time.DateTime.<init>(DateTime.java:281)
	at org.joda.time.TestDateTimeComparator.loadAList(TestDateTimeComparator.java:920)
	at org.joda.time.TestDateTimeComparator.testListBasic(TestDateTimeComparator.java:596)

testListMillis(org.joda.time.TestDateTimeComparator)  Time elapsed: 0.001 sec  <<< ERROR!
java.lang.ClassCastException: org.joda.time.DateTime cannot be cast to java.util.Date
	at org.joda.time.convert.DateConverter.getInstantMillis(DateConverter.java:55)
	at org.joda.time.DateTimeComparator.compare(DateTimeComparator.java:194)
	at java.util.TimSort.countRunAndMakeAscending(TimSort.java:324)
	at java.util.TimSort.sort(TimSort.java:189)
	at java.util.TimSort.sort(TimSort.java:173)
	at java.util.Arrays.sort(Arrays.java:659)
	at java.util.Collections.sort(Collections.java:217)
	at org.joda.time.TestDateTimeComparator.testListMillis(TestDateTimeComparator.java:618)

testListSecond(org.joda.time.TestDateTimeComparator)  Time elapsed: 0 sec  <<< ERROR!
java.lang.ClassCastException: java.lang.String cannot be cast to org.joda.time.ReadableInstant
	at org.joda.time.convert.ReadableInstantConverter.getChronology(ReadableInstantConverter.java:58)
	at org.joda.time.base.BaseDateTime.<init>(BaseDateTime.java:152)
	at org.joda.time.DateTime.<init>(DateTime.java:281)
	at org.joda.time.TestDateTimeComparator.loadAList(TestDateTimeComparator.java:920)
	at org.joda.time.TestDateTimeComparator.testListSecond(TestDateTimeComparator.java:638)

testListMinute(org.joda.time.TestDateTimeComparator)  Time elapsed: 0.001 sec  <<< ERROR!
java.lang.ClassCastException: java.lang.String cannot be cast to org.joda.time.ReadableInstant
	at org.joda.time.convert.ReadableInstantConverter.getChronology(ReadableInstantConverter.java:58)
	at org.joda.time.base.BaseDateTime.<init>(BaseDateTime.java:152)
	at org.joda.time.DateTime.<init>(DateTime.java:281)
	at org.joda.time.TestDateTimeComparator.loadAList(TestDateTimeComparator.java:920)
	at org.joda.time.TestDateTimeComparator.testListMinute(TestDateTimeComparator.java:659)

testListHour(org.joda.time.TestDateTimeComparator)  Time elapsed: 0 sec  <<< ERROR!
java.lang.ClassCastException: java.lang.String cannot be cast to org.joda.time.ReadableInstant
	at org.joda.time.convert.ReadableInstantConverter.getChronology(ReadableInstantConverter.java:58)
	at org.joda.time.base.BaseDateTime.<init>(BaseDateTime.java:152)
	at org.joda.time.DateTime.<init>(DateTime.java:281)
	at org.joda.time.TestDateTimeComparator.loadAList(TestDateTimeComparator.java:920)
	at org.joda.time.TestDateTimeComparator.testListHour(TestDateTimeComparator.java:680)

testListDOW(org.joda.time.TestDateTimeComparator)  Time elapsed: 0.001 sec  <<< ERROR!
java.lang.ClassCastException: java.lang.String cannot be cast to org.joda.time.ReadableInstant
	at org.joda.time.convert.ReadableInstantConverter.getChronology(ReadableInstantConverter.java:58)
	at org.joda.time.base.BaseDateTime.<init>(BaseDateTime.java:152)
	at org.joda.time.DateTime.<init>(DateTime.java:281)
	at org.joda.time.TestDateTimeComparator.loadAList(TestDateTimeComparator.java:920)
	at org.joda.time.TestDateTimeComparator.testListDOW(TestDateTimeComparator.java:703)

testListDOM(org.joda.time.TestDateTimeComparator)  Time elapsed: 0 sec  <<< ERROR!
java.lang.ClassCastException: java.lang.String cannot be cast to org.joda.time.ReadableInstant
	at org.joda.time.convert.ReadableInstantConverter.getChronology(ReadableInstantConverter.java:58)
	at org.joda.time.base.BaseDateTime.<init>(BaseDateTime.java:152)
	at org.joda.time.DateTime.<init>(DateTime.java:281)
	at org.joda.time.TestDateTimeComparator.loadAList(TestDateTimeComparator.java:920)
	at org.joda.time.TestDateTimeComparator.testListDOM(TestDateTimeComparator.java:725)

testListDOY(org.joda.time.TestDateTimeComparator)  Time elapsed: 0.001 sec  <<< ERROR!
java.lang.ClassCastException: java.lang.String cannot be cast to org.joda.time.ReadableInstant
	at org.joda.time.convert.ReadableInstantConverter.getChronology(ReadableInstantConverter.java:58)
	at org.joda.time.base.BaseDateTime.<init>(BaseDateTime.java:152)
	at org.joda.time.DateTime.<init>(DateTime.java:281)
	at org.joda.time.TestDateTimeComparator.loadAList(TestDateTimeComparator.java:920)
	at org.joda.time.TestDateTimeComparator.testListDOY(TestDateTimeComparator.java:746)

testListWOW(org.joda.time.TestDateTimeComparator)  Time elapsed: 0.001 sec  <<< ERROR!
java.lang.ClassCastException: java.lang.String cannot be cast to org.joda.time.ReadableInstant
	at org.joda.time.convert.ReadableInstantConverter.getChronology(ReadableInstantConverter.java:58)
	at org.joda.time.base.BaseDateTime.<init>(BaseDateTime.java:152)
	at org.joda.time.DateTime.<init>(DateTime.java:281)
	at org.joda.time.TestDateTimeComparator.loadAList(TestDateTimeComparator.java:920)
	at org.joda.time.TestDateTimeComparator.testListWOW(TestDateTimeComparator.java:767)

testListYOYY(org.joda.time.TestDateTimeComparator)  Time elapsed: 0 sec  <<< ERROR!
java.lang.ClassCastException: java.lang.String cannot be cast to org.joda.time.ReadableInstant
	at org.joda.time.convert.ReadableInstantConverter.getChronology(ReadableInstantConverter.java:58)
	at org.joda.time.base.BaseDateTime.<init>(BaseDateTime.java:152)
	at org.joda.time.DateTime.<init>(DateTime.java:281)
	at org.joda.time.TestDateTimeComparator.loadAList(TestDateTimeComparator.java:920)
	at org.joda.time.TestDateTimeComparator.testListYOYY(TestDateTimeComparator.java:784)

testListMonth(org.joda.time.TestDateTimeComparator)  Time elapsed: 0 sec  <<< ERROR!
java.lang.ClassCastException: java.lang.String cannot be cast to org.joda.time.ReadableInstant
	at org.joda.time.convert.ReadableInstantConverter.getChronology(ReadableInstantConverter.java:58)
	at org.joda.time.base.BaseDateTime.<init>(BaseDateTime.java:152)
	at org.joda.time.DateTime.<init>(DateTime.java:281)
	at org.joda.time.TestDateTimeComparator.loadAList(TestDateTimeComparator.java:920)
	at org.joda.time.TestDateTimeComparator.testListMonth(TestDateTimeComparator.java:806)

testListYear(org.joda.time.TestDateTimeComparator)  Time elapsed: 0.001 sec  <<< ERROR!
java.lang.ClassCastException: java.lang.String cannot be cast to org.joda.time.ReadableInstant
	at org.joda.time.convert.ReadableInstantConverter.getChronology(ReadableInstantConverter.java:58)
	at org.joda.time.base.BaseDateTime.<init>(BaseDateTime.java:152)
	at org.joda.time.DateTime.<init>(DateTime.java:281)
	at org.joda.time.TestDateTimeComparator.loadAList(TestDateTimeComparator.java:920)
	at org.joda.time.TestDateTimeComparator.testListYear(TestDateTimeComparator.java:827)

testListDate(org.joda.time.TestDateTimeComparator)  Time elapsed: 0 sec  <<< ERROR!
java.lang.ClassCastException: java.lang.String cannot be cast to org.joda.time.ReadableInstant
	at org.joda.time.convert.ReadableInstantConverter.getChronology(ReadableInstantConverter.java:58)
	at org.joda.time.base.BaseDateTime.<init>(BaseDateTime.java:152)
	at org.joda.time.DateTime.<init>(DateTime.java:281)
	at org.joda.time.TestDateTimeComparator.loadAList(TestDateTimeComparator.java:920)
	at org.joda.time.TestDateTimeComparator.testListDate(TestDateTimeComparator.java:848)

testListTime(org.joda.time.TestDateTimeComparator)  Time elapsed: 0 sec  <<< ERROR!
java.lang.ClassCastException: java.lang.String cannot be cast to org.joda.time.ReadableInstant
	at org.joda.time.convert.ReadableInstantConverter.getChronology(ReadableInstantConverter.java:58)
	at org.joda.time.base.BaseDateTime.<init>(BaseDateTime.java:152)
	at org.joda.time.DateTime.<init>(DateTime.java:281)
	at org.joda.time.TestDateTimeComparator.loadAList(TestDateTimeComparator.java:920)
	at org.joda.time.TestDateTimeComparator.testListTime(TestDateTimeComparator.java:869)

testNullDT(org.joda.time.TestDateTimeComparator)  Time elapsed: 0 sec  <<< ERROR!
java.lang.ClassCastException: java.lang.String cannot be cast to org.joda.time.ReadableInstant
	at org.joda.time.convert.ReadableInstantConverter.getChronology(ReadableInstantConverter.java:58)
	at org.joda.time.base.BaseDateTime.<init>(BaseDateTime.java:152)
	at org.joda.time.DateTime.<init>(DateTime.java:281)
	at org.joda.time.TestDateTimeComparator.getADate(TestDateTimeComparator.java:906)
	at org.joda.time.TestDateTimeComparator.testNullDT(TestDateTimeComparator.java:882)

testInvalidObj(org.joda.time.TestDateTimeComparator)  Time elapsed: 0 sec  <<< ERROR!
java.lang.ClassCastException: java.lang.String cannot be cast to org.joda.time.ReadableInstant
	at org.joda.time.convert.ReadableInstantConverter.getChronology(ReadableInstantConverter.java:58)
	at org.joda.time.base.BaseDateTime.<init>(BaseDateTime.java:152)
	at org.joda.time.DateTime.<init>(DateTime.java:281)
	at org.joda.time.TestDateTimeComparator.getADate(TestDateTimeComparator.java:906)
	at org.joda.time.TestDateTimeComparator.testInvalidObj(TestDateTimeComparator.java:891)

testWithHourOfDayInDstChange(org.joda.time.TestDateTimeZoneCutover)  Time elapsed: 0.001 sec  <<< ERROR!
java.lang.ClassCastException: java.lang.String cannot be cast to org.joda.time.ReadableInstant
	at org.joda.time.convert.ReadableInstantConverter.getChronology(ReadableInstantConverter.java:58)
	at org.joda.time.base.BaseDateTime.<init>(BaseDateTime.java:152)
	at org.joda.time.DateTime.<init>(DateTime.java:281)
	at org.joda.time.TestDateTimeZoneCutover.testWithHourOfDayInDstChange(TestDateTimeZoneCutover.java:1139)

testWithMinuteOfHourInDstChange(org.joda.time.TestDateTimeZoneCutover)  Time elapsed: 0 sec  <<< ERROR!
java.lang.ClassCastException: java.lang.String cannot be cast to org.joda.time.ReadableInstant
	at org.joda.time.convert.ReadableInstantConverter.getChronology(ReadableInstantConverter.java:58)
	at org.joda.time.base.BaseDateTime.<init>(BaseDateTime.java:152)
	at org.joda.time.DateTime.<init>(DateTime.java:281)
	at org.joda.time.TestDateTimeZoneCutover.testWithMinuteOfHourInDstChange(TestDateTimeZoneCutover.java:1146)

testWithSecondOfMinuteInDstChange(org.joda.time.TestDateTimeZoneCutover)  Time elapsed: 0 sec  <<< ERROR!
java.lang.ClassCastException: java.lang.String cannot be cast to org.joda.time.ReadableInstant
	at org.joda.time.convert.ReadableInstantConverter.getChronology(ReadableInstantConverter.java:58)
	at org.joda.time.base.BaseDateTime.<init>(BaseDateTime.java:152)
	at org.joda.time.DateTime.<init>(DateTime.java:281)
	at org.joda.time.TestDateTimeZoneCutover.testWithSecondOfMinuteInDstChange(TestDateTimeZoneCutover.java:1153)

testWithMillisOfSecondInDstChange_Paris_summer(org.joda.time.TestDateTimeZoneCutover)  Time elapsed: 0.001 sec  <<< ERROR!
java.lang.ClassCastException: java.lang.String cannot be cast to org.joda.time.ReadableInstant
	at org.joda.time.convert.ReadableInstantConverter.getChronology(ReadableInstantConverter.java:58)
	at org.joda.time.base.BaseDateTime.<init>(BaseDateTime.java:152)
	at org.joda.time.DateTime.<init>(DateTime.java:281)
	at org.joda.time.TestDateTimeZoneCutover.testWithMillisOfSecondInDstChange_Paris_summer(TestDateTimeZoneCutover.java:1160)

testWithMillisOfSecondInDstChange_Paris_winter(org.joda.time.TestDateTimeZoneCutover)  Time elapsed: 0 sec  <<< ERROR!
java.lang.ClassCastException: java.lang.String cannot be cast to org.joda.time.ReadableInstant
	at org.joda.time.convert.ReadableInstantConverter.getChronology(ReadableInstantConverter.java:58)
	at org.joda.time.base.BaseDateTime.<init>(BaseDateTime.java:152)
	at org.joda.time.DateTime.<init>(DateTime.java:281)
	at org.joda.time.TestDateTimeZoneCutover.testWithMillisOfSecondInDstChange_Paris_winter(TestDateTimeZoneCutover.java:1167)

testWithMillisOfSecondInDstChange_NewYork_summer(org.joda.time.TestDateTimeZoneCutover)  Time elapsed: 0.001 sec  <<< ERROR!
java.lang.ClassCastException: java.lang.String cannot be cast to org.joda.time.ReadableInstant
	at org.joda.time.convert.ReadableInstantConverter.getChronology(ReadableInstantConverter.java:58)
	at org.joda.time.base.BaseDateTime.<init>(BaseDateTime.java:152)
	at org.joda.time.DateTime.<init>(DateTime.java:281)
	at org.joda.time.TestDateTimeZoneCutover.testWithMillisOfSecondInDstChange_NewYork_summer(TestDateTimeZoneCutover.java:1174)

testWithMillisOfSecondInDstChange_NewYork_winter(org.joda.time.TestDateTimeZoneCutover)  Time elapsed: 0 sec  <<< ERROR!
java.lang.ClassCastException: java.lang.String cannot be cast to org.joda.time.ReadableInstant
	at org.joda.time.convert.ReadableInstantConverter.getChronology(ReadableInstantConverter.java:58)
	at org.joda.time.base.BaseDateTime.<init>(BaseDateTime.java:152)
	at org.joda.time.DateTime.<init>(DateTime.java:281)
	at org.joda.time.TestDateTimeZoneCutover.testWithMillisOfSecondInDstChange_NewYork_winter(TestDateTimeZoneCutover.java:1181)

testPlusMinutesInDstChange(org.joda.time.TestDateTimeZoneCutover)  Time elapsed: 0.001 sec  <<< ERROR!
java.lang.ClassCastException: java.lang.String cannot be cast to org.joda.time.ReadableInstant
	at org.joda.time.convert.ReadableInstantConverter.getChronology(ReadableInstantConverter.java:58)
	at org.joda.time.base.BaseDateTime.<init>(BaseDateTime.java:152)
	at org.joda.time.DateTime.<init>(DateTime.java:281)
	at org.joda.time.TestDateTimeZoneCutover.testPlusMinutesInDstChange(TestDateTimeZoneCutover.java:1188)

testPlusSecondsInDstChange(org.joda.time.TestDateTimeZoneCutover)  Time elapsed: 0 sec  <<< ERROR!
java.lang.ClassCastException: java.lang.String cannot be cast to org.joda.time.ReadableInstant
	at org.joda.time.convert.ReadableInstantConverter.getChronology(ReadableInstantConverter.java:58)
	at org.joda.time.base.BaseDateTime.<init>(BaseDateTime.java:152)
	at org.joda.time.DateTime.<init>(DateTime.java:281)
	at org.joda.time.TestDateTimeZoneCutover.testPlusSecondsInDstChange(TestDateTimeZoneCutover.java:1195)

testPlusMillisInDstChange(org.joda.time.TestDateTimeZoneCutover)  Time elapsed: 0.001 sec  <<< ERROR!
java.lang.ClassCastException: java.lang.String cannot be cast to org.joda.time.ReadableInstant
	at org.joda.time.convert.ReadableInstantConverter.getChronology(ReadableInstantConverter.java:58)
	at org.joda.time.base.BaseDateTime.<init>(BaseDateTime.java:152)
	at org.joda.time.DateTime.<init>(DateTime.java:281)
	at org.joda.time.TestDateTimeZoneCutover.testPlusMillisInDstChange(TestDateTimeZoneCutover.java:1202)

testPeriod(org.joda.time.TestDateTimeZoneCutover)  Time elapsed: 0.001 sec  <<< ERROR!
java.lang.ClassCastException: java.lang.String cannot be cast to org.joda.time.ReadableInstant
	at org.joda.time.convert.ReadableInstantConverter.getChronology(ReadableInstantConverter.java:58)
	at org.joda.time.base.BaseDateTime.<init>(BaseDateTime.java:152)
	at org.joda.time.DateTime.<init>(DateTime.java:281)
	at org.joda.time.TestDateTimeZoneCutover.testPeriod(TestDateTimeZoneCutover.java:1247)

test_DateTime_parse_Gaza(org.joda.time.TestDateTimeZoneCutover)  Time elapsed: 0.001 sec  <<< ERROR!
java.lang.ClassCastException: java.lang.String cannot be cast to org.joda.time.ReadableInstant
	at org.joda.time.convert.ReadableInstantConverter.getChronology(ReadableInstantConverter.java:58)
	at org.joda.time.base.BaseDateTime.<init>(BaseDateTime.java:152)
	at org.joda.time.DateTime.<init>(DateTime.java:281)
	at org.joda.time.TestDateTimeZoneCutover.test_DateTime_parse_Gaza(TestDateTimeZoneCutover.java:254)

test_DateTime_parse_Turk(org.joda.time.TestDateTimeZoneCutover)  Time elapsed: 0.001 sec  <<< ERROR!
java.lang.ClassCastException: java.lang.String cannot be cast to org.joda.time.ReadableInstant
	at org.joda.time.convert.ReadableInstantConverter.getChronology(ReadableInstantConverter.java:58)
	at org.joda.time.base.BaseDateTime.<init>(BaseDateTime.java:152)
	at org.joda.time.DateTime.<init>(DateTime.java:281)
	at org.joda.time.TestDateTimeZoneCutover.test_DateTime_parse_Turk(TestDateTimeZoneCutover.java:470)

testYears(org.joda.time.TestStringConvert)  Time elapsed: 0.028 sec  <<< FAILURE!
junit.framework.AssertionFailedError: expected:<P5Y> but was:<P0Y>
	at junit.framework.Assert.fail(Assert.java:47)
	at junit.framework.Assert.failNotEquals(Assert.java:280)
	at junit.framework.Assert.assertEquals(Assert.java:64)
	at junit.framework.Assert.assertEquals(Assert.java:71)
	at org.joda.time.TestStringConvert.testYears(TestStringConvert.java:158)

testMonths(org.joda.time.TestStringConvert)  Time elapsed: 0 sec  <<< FAILURE!
junit.framework.AssertionFailedError: expected:<P5M> but was:<P0M>
	at junit.framework.Assert.fail(Assert.java:47)
	at junit.framework.Assert.failNotEquals(Assert.java:280)
	at junit.framework.Assert.assertEquals(Assert.java:64)
	at junit.framework.Assert.assertEquals(Assert.java:71)
	at org.joda.time.TestStringConvert.testMonths(TestStringConvert.java:165)

testWeeks(org.joda.time.TestStringConvert)  Time elapsed: 0.001 sec  <<< FAILURE!
junit.framework.AssertionFailedError: expected:<P5W> but was:<P0W>
	at junit.framework.Assert.fail(Assert.java:47)
	at junit.framework.Assert.failNotEquals(Assert.java:280)
	at junit.framework.Assert.assertEquals(Assert.java:64)
	at junit.framework.Assert.assertEquals(Assert.java:71)
	at org.joda.time.TestStringConvert.testWeeks(TestStringConvert.java:172)

testDays(org.joda.time.TestStringConvert)  Time elapsed: 0.001 sec  <<< FAILURE!
junit.framework.AssertionFailedError: expected:<P5D> but was:<P0D>
	at junit.framework.Assert.fail(Assert.java:47)
	at junit.framework.Assert.failNotEquals(Assert.java:280)
	at junit.framework.Assert.assertEquals(Assert.java:64)
	at junit.framework.Assert.assertEquals(Assert.java:71)
	at org.joda.time.TestStringConvert.testDays(TestStringConvert.java:179)

testHours(org.joda.time.TestStringConvert)  Time elapsed: 0.001 sec  <<< FAILURE!
junit.framework.AssertionFailedError: expected:<PT5H> but was:<PT0H>
	at junit.framework.Assert.fail(Assert.java:47)
	at junit.framework.Assert.failNotEquals(Assert.java:280)
	at junit.framework.Assert.assertEquals(Assert.java:64)
	at junit.framework.Assert.assertEquals(Assert.java:71)
	at org.joda.time.TestStringConvert.testHours(TestStringConvert.java:186)

testMinutes(org.joda.time.TestStringConvert)  Time elapsed: 0.001 sec  <<< FAILURE!
junit.framework.AssertionFailedError: expected:<PT5M> but was:<PT0M>
	at junit.framework.Assert.fail(Assert.java:47)
	at junit.framework.Assert.failNotEquals(Assert.java:280)
	at junit.framework.Assert.assertEquals(Assert.java:64)
	at junit.framework.Assert.assertEquals(Assert.java:71)
	at org.joda.time.TestStringConvert.testMinutes(TestStringConvert.java:193)

testSeconds(org.joda.time.TestStringConvert)  Time elapsed: 0.001 sec  <<< FAILURE!
junit.framework.AssertionFailedError: expected:<PT5S> but was:<PT0S>
	at junit.framework.Assert.fail(Assert.java:47)
	at junit.framework.Assert.failNotEquals(Assert.java:280)
	at junit.framework.Assert.assertEquals(Assert.java:64)
	at junit.framework.Assert.assertEquals(Assert.java:71)
	at org.joda.time.TestStringConvert.testSeconds(TestStringConvert.java:200)

testPeriod(org.joda.time.TestStringConvert)  Time elapsed: 0.001 sec  <<< FAILURE!
junit.framework.AssertionFailedError: expected:<P1Y2M3W4DT5H6M7.008S> but was:<PT0S>
	at junit.framework.Assert.fail(Assert.java:47)
	at junit.framework.Assert.failNotEquals(Assert.java:280)
	at junit.framework.Assert.assertEquals(Assert.java:64)
	at junit.framework.Assert.assertEquals(Assert.java:71)
	at org.joda.time.TestStringConvert.testPeriod(TestStringConvert.java:144)

testMutablePeriod(org.joda.time.TestStringConvert)  Time elapsed: 0.001 sec  <<< FAILURE!
junit.framework.AssertionFailedError: expected:<P1Y2M3W4DT5H6M7.008S> but was:<PT0S>
	at junit.framework.Assert.fail(Assert.java:47)
	at junit.framework.Assert.failNotEquals(Assert.java:280)
	at junit.framework.Assert.assertEquals(Assert.java:64)
	at junit.framework.Assert.assertEquals(Assert.java:71)
	at org.joda.time.TestStringConvert.testMutablePeriod(TestStringConvert.java:151)

testGJCutover(org.joda.time.TestIllegalFieldValueException)  Time elapsed: 0.001 sec  <<< ERROR!
java.lang.ClassCastException: java.lang.String cannot be cast to org.joda.time.ReadableInstant
	at org.joda.time.convert.ReadableInstantConverter.getInstantMillis(ReadableInstantConverter.java:100)
	at org.joda.time.base.BaseDateTime.<init>(BaseDateTime.java:175)
	at org.joda.time.DateTime.<init>(DateTime.java:302)
	at org.joda.time.TestIllegalFieldValueException.testGJCutover(TestIllegalFieldValueException.java:229)

testPartialGetAsText(org.joda.time.chrono.TestGJChronology)  Time elapsed: 0 sec  <<< ERROR!
java.lang.ClassCastException: java.lang.String cannot be cast to java.util.Date
	at org.joda.time.convert.DateConverter.getInstantMillis(DateConverter.java:55)
	at org.joda.time.convert.AbstractConverter.getPartialValues(AbstractConverter.java:101)
	at org.joda.time.convert.AbstractConverter.getPartialValues(AbstractConverter.java:123)
	at org.joda.time.base.BasePartial.<init>(BasePartial.java:163)
	at org.joda.time.YearMonthDay.<init>(YearMonthDay.java:256)
	at org.joda.time.chrono.TestGJChronology.testPartialGetAsText(TestGJChronology.java:523)

testCutoverAddYears(org.joda.time.chrono.TestGJChronology)  Time elapsed: 0.001 sec  <<< ERROR!
java.lang.ClassCastException: java.lang.String cannot be cast to org.joda.time.ReadableInstant
	at org.joda.time.convert.ReadableInstantConverter.getInstantMillis(ReadableInstantConverter.java:100)
	at org.joda.time.base.BaseDateTime.<init>(BaseDateTime.java:175)
	at org.joda.time.DateTime.<init>(DateTime.java:302)
	at org.joda.time.chrono.TestGJChronology.testAdd(TestGJChronology.java:482)
	at org.joda.time.chrono.TestGJChronology.testCutoverAddYears(TestGJChronology.java:381)

testCutoverAddWeekyears(org.joda.time.chrono.TestGJChronology)  Time elapsed: 0 sec  <<< ERROR!
java.lang.ClassCastException: java.lang.String cannot be cast to org.joda.time.ReadableInstant
	at org.joda.time.convert.ReadableInstantConverter.getInstantMillis(ReadableInstantConverter.java:100)
	at org.joda.time.base.BaseDateTime.<init>(BaseDateTime.java:175)
	at org.joda.time.DateTime.<init>(DateTime.java:302)
	at org.joda.time.chrono.TestGJChronology.testAdd(TestGJChronology.java:482)
	at org.joda.time.chrono.TestGJChronology.testCutoverAddWeekyears(TestGJChronology.java:401)

testCutoverAddMonths(org.joda.time.chrono.TestGJChronology)  Time elapsed: 0.001 sec  <<< ERROR!
java.lang.ClassCastException: java.lang.String cannot be cast to org.joda.time.ReadableInstant
	at org.joda.time.convert.ReadableInstantConverter.getInstantMillis(ReadableInstantConverter.java:100)
	at org.joda.time.base.BaseDateTime.<init>(BaseDateTime.java:175)
	at org.joda.time.DateTime.<init>(DateTime.java:302)
	at org.joda.time.chrono.TestGJChronology.testAdd(TestGJChronology.java:482)
	at org.joda.time.chrono.TestGJChronology.testCutoverAddMonths(TestGJChronology.java:422)

testCutoverAddWeeks(org.joda.time.chrono.TestGJChronology)  Time elapsed: 0.001 sec  <<< ERROR!
java.lang.ClassCastException: java.lang.String cannot be cast to org.joda.time.ReadableInstant
	at org.joda.time.convert.ReadableInstantConverter.getInstantMillis(ReadableInstantConverter.java:100)
	at org.joda.time.base.BaseDateTime.<init>(BaseDateTime.java:175)
	at org.joda.time.DateTime.<init>(DateTime.java:302)
	at org.joda.time.chrono.TestGJChronology.testAdd(TestGJChronology.java:482)
	at org.joda.time.chrono.TestGJChronology.testCutoverAddWeeks(TestGJChronology.java:443)

testCutoverAddDays(org.joda.time.chrono.TestGJChronology)  Time elapsed: 0.001 sec  <<< ERROR!
java.lang.ClassCastException: java.lang.String cannot be cast to org.joda.time.ReadableInstant
	at org.joda.time.convert.ReadableInstantConverter.getInstantMillis(ReadableInstantConverter.java:100)
	at org.joda.time.base.BaseDateTime.<init>(BaseDateTime.java:175)
	at org.joda.time.DateTime.<init>(DateTime.java:302)
	at org.joda.time.chrono.TestGJChronology.testAdd(TestGJChronology.java:482)
	at org.joda.time.chrono.TestGJChronology.testCutoverAddDays(TestGJChronology.java:452)

testYearEndAddDays(org.joda.time.chrono.TestGJChronology)  Time elapsed: 0 sec  <<< ERROR!
java.lang.ClassCastException: java.lang.String cannot be cast to org.joda.time.ReadableInstant
	at org.joda.time.convert.ReadableInstantConverter.getInstantMillis(ReadableInstantConverter.java:100)
	at org.joda.time.base.BaseDateTime.<init>(BaseDateTime.java:175)
	at org.joda.time.DateTime.<init>(DateTime.java:302)
	at org.joda.time.chrono.TestGJChronology.testAdd(TestGJChronology.java:482)
	at org.joda.time.chrono.TestGJChronology.testYearEndAddDays(TestGJChronology.java:462)

testParseEquivalence(org.joda.time.chrono.TestGJChronology)  Time elapsed: 0 sec  <<< ERROR!
java.lang.ClassCastException: java.lang.String cannot be cast to org.joda.time.ReadableInstant
	at org.joda.time.convert.ReadableInstantConverter.getInstantMillis(ReadableInstantConverter.java:100)
	at org.joda.time.base.BaseDateTime.<init>(BaseDateTime.java:175)
	at org.joda.time.DateTime.<init>(DateTime.java:302)
	at org.joda.time.chrono.TestGJChronology.testParse(TestGJChronology.java:375)
	at org.joda.time.chrono.TestGJChronology.testParseEquivalence(TestGJChronology.java:362)

testAddMonths(org.joda.time.chrono.TestISOChronology)  Time elapsed: 0 sec  <<< ERROR!
java.lang.ClassCastException: java.lang.String cannot be cast to org.joda.time.ReadableInstant
	at org.joda.time.convert.ReadableInstantConverter.getInstantMillis(ReadableInstantConverter.java:100)
	at org.joda.time.base.BaseDateTime.<init>(BaseDateTime.java:175)
	at org.joda.time.DateTime.<init>(DateTime.java:302)
	at org.joda.time.chrono.TestISOChronology.testAdd(TestISOChronology.java:411)
	at org.joda.time.chrono.TestISOChronology.testAddMonths(TestISOChronology.java:394)

testMaxYear(org.joda.time.chrono.TestISOChronology)  Time elapsed: 0.001 sec  <<< ERROR!
java.lang.ClassCastException: java.lang.String cannot be cast to org.joda.time.ReadableInstant
	at org.joda.time.convert.ReadableInstantConverter.getInstantMillis(ReadableInstantConverter.java:100)
	at org.joda.time.base.BaseDateTime.<init>(BaseDateTime.java:175)
	at org.joda.time.DateTime.<init>(DateTime.java:302)
	at org.joda.time.chrono.TestISOChronology.testMaxYear(TestISOChronology.java:324)

testMinYear(org.joda.time.chrono.TestISOChronology)  Time elapsed: 0 sec  <<< ERROR!
java.lang.ClassCastException: java.lang.String cannot be cast to org.joda.time.ReadableInstant
	at org.joda.time.convert.ReadableInstantConverter.getInstantMillis(ReadableInstantConverter.java:100)
	at org.joda.time.base.BaseDateTime.<init>(BaseDateTime.java:175)
	at org.joda.time.DateTime.<init>(DateTime.java:302)
	at org.joda.time.chrono.TestISOChronology.testMinYear(TestISOChronology.java:357)

testCutoverAddYears(org.joda.time.chrono.TestISOChronology)  Time elapsed: 0 sec  <<< ERROR!
java.lang.ClassCastException: java.lang.String cannot be cast to org.joda.time.ReadableInstant
	at org.joda.time.convert.ReadableInstantConverter.getInstantMillis(ReadableInstantConverter.java:100)
	at org.joda.time.base.BaseDateTime.<init>(BaseDateTime.java:175)
	at org.joda.time.DateTime.<init>(DateTime.java:302)
	at org.joda.time.chrono.TestISOChronology.testAdd(TestISOChronology.java:411)
	at org.joda.time.chrono.TestISOChronology.testCutoverAddYears(TestISOChronology.java:376)

testGetPartialConverter(org.joda.time.convert.TestConverterManager)  Time elapsed: 0 sec  <<< FAILURE!
junit.framework.AssertionFailedError: expected:<interface org.joda.time.ReadablePartial> but was:<null>
	at junit.framework.Assert.fail(Assert.java:47)
	at junit.framework.Assert.failNotEquals(Assert.java:280)
	at junit.framework.Assert.assertEquals(Assert.java:64)
	at junit.framework.Assert.assertEquals(Assert.java:71)
	at org.joda.time.convert.TestConverterManager.testGetPartialConverter(TestConverterManager.java:338)

testGetInstantConverter(org.joda.time.convert.TestConverterManager)  Time elapsed: 0.001 sec  <<< FAILURE!
junit.framework.AssertionFailedError: expected:<class java.util.Calendar> but was:<class java.lang.String>
	at junit.framework.Assert.fail(Assert.java:47)
	at junit.framework.Assert.failNotEquals(Assert.java:280)
	at junit.framework.Assert.assertEquals(Assert.java:64)
	at junit.framework.Assert.assertEquals(Assert.java:71)
	at org.joda.time.convert.TestConverterManager.testGetInstantConverter(TestConverterManager.java:145)

testGetDurationConverter(org.joda.time.convert.TestConverterManager)  Time elapsed: 0.001 sec  <<< FAILURE!
junit.framework.AssertionFailedError: expected:<class java.lang.Long> but was:<class java.lang.String>
	at junit.framework.Assert.fail(Assert.java:47)
	at junit.framework.Assert.failNotEquals(Assert.java:280)
	at junit.framework.Assert.assertEquals(Assert.java:64)
	at junit.framework.Assert.assertEquals(Assert.java:71)
	at org.joda.time.convert.TestConverterManager.testGetDurationConverter(TestConverterManager.java:545)

testGetPeriodConverter(org.joda.time.convert.TestConverterManager)  Time elapsed: 0.001 sec  <<< FAILURE!
junit.framework.AssertionFailedError: expected:<interface org.joda.time.ReadableInterval> but was:<interface org.joda.time.ReadablePeriod>
	at junit.framework.Assert.fail(Assert.java:47)
	at junit.framework.Assert.failNotEquals(Assert.java:280)
	at junit.framework.Assert.assertEquals(Assert.java:64)
	at junit.framework.Assert.assertEquals(Assert.java:71)
	at org.joda.time.convert.TestConverterManager.testGetPeriodConverter(TestConverterManager.java:699)

testGetIntervalConverter(org.joda.time.convert.TestConverterManager)  Time elapsed: 0.001 sec  <<< FAILURE!
junit.framework.AssertionFailedError: expected:<interface org.joda.time.ReadableInterval> but was:<class java.lang.String>
	at junit.framework.Assert.fail(Assert.java:47)
	at junit.framework.Assert.failNotEquals(Assert.java:280)
	at junit.framework.Assert.assertEquals(Assert.java:64)
	at junit.framework.Assert.assertEquals(Assert.java:71)
	at org.joda.time.convert.TestConverterManager.testGetIntervalConverter(TestConverterManager.java:844)

testAddIntervalConverter2(org.joda.time.convert.TestConverterManager)  Time elapsed: 0 sec  <<< FAILURE!
junit.framework.AssertionFailedError: expected:<Converter[java.lang.String]> but was:<org.joda.time.TestMutableInterval_Constructors$1@494c009f>
	at junit.framework.Assert.fail(Assert.java:47)
	at junit.framework.Assert.failNotEquals(Assert.java:280)
	at junit.framework.Assert.assertEquals(Assert.java:64)
	at junit.framework.Assert.assertEquals(Assert.java:71)
	at org.joda.time.convert.TestConverterManager.testAddIntervalConverter2(TestConverterManager.java:907)

test_appendFixedDecimal(org.joda.time.format.TestDateTimeFormatterBuilder)  Time elapsed: 0.001 sec  <<< ERROR!
java.lang.ClassCastException: java.lang.String cannot be cast to java.util.Date
	at org.joda.time.convert.DateConverter.getInstantMillis(DateConverter.java:55)
	at org.joda.time.base.BaseDateTime.<init>(BaseDateTime.java:175)
	at org.joda.time.DateTime.<init>(DateTime.java:257)
	at org.joda.time.format.TestDateTimeFormatterBuilder.test_appendFixedDecimal(TestDateTimeFormatterBuilder.java:247)

test_appendFixedSignedDecimal(org.joda.time.format.TestDateTimeFormatterBuilder)  Time elapsed: 0 sec  <<< ERROR!
java.lang.ClassCastException: java.lang.String cannot be cast to java.util.Date
	at org.joda.time.convert.DateConverter.getInstantMillis(DateConverter.java:55)
	at org.joda.time.base.BaseDateTime.<init>(BaseDateTime.java:175)
	at org.joda.time.DateTime.<init>(DateTime.java:257)
	at org.joda.time.format.TestDateTimeFormatterBuilder.test_appendFixedSignedDecimal(TestDateTimeFormatterBuilder.java:303)

testSerialization(org.joda.time.tz.TestBuilder)  Time elapsed: 0.008 sec  <<< ERROR!
java.lang.ClassCastException: java.lang.String cannot be cast to java.util.Date
	at org.joda.time.convert.DateConverter.getInstantMillis(DateConverter.java:55)
	at org.joda.time.base.BaseDateTime.<init>(BaseDateTime.java:175)
	at org.joda.time.DateTime.<init>(DateTime.java:257)
	at org.joda.time.tz.TestBuilder.testForwardTransitions(TestBuilder.java:241)
	at org.joda.time.tz.TestBuilder.testSerialization(TestBuilder.java:282)

testReverseTransitions(org.joda.time.tz.TestBuilder)  Time elapsed: 0.006 sec  <<< ERROR!
java.lang.ClassCastException: java.lang.String cannot be cast to java.util.Date
	at org.joda.time.convert.DateConverter.getInstantMillis(DateConverter.java:55)
	at org.joda.time.base.BaseDateTime.<init>(BaseDateTime.java:175)
	at org.joda.time.DateTime.<init>(DateTime.java:257)
	at org.joda.time.tz.TestBuilder.testReverseTransitions(TestBuilder.java:259)
	at org.joda.time.tz.TestBuilder.testReverseTransitions(TestBuilder.java:255)

testForwardTransitions(org.joda.time.tz.TestBuilder)  Time elapsed: 0.007 sec  <<< ERROR!
java.lang.ClassCastException: java.lang.String cannot be cast to java.util.Date
	at org.joda.time.convert.DateConverter.getInstantMillis(DateConverter.java:55)
	at org.joda.time.base.BaseDateTime.<init>(BaseDateTime.java:175)
	at org.joda.time.DateTime.<init>(DateTime.java:257)
	at org.joda.time.tz.TestBuilder.testForwardTransitions(TestBuilder.java:241)
	at org.joda.time.tz.TestBuilder.testForwardTransitions(TestBuilder.java:217)

testCompile(org.joda.time.tz.TestCompiler)  Time elapsed: 0.025 sec  <<< ERROR!
java.lang.ClassCastException: java.lang.String cannot be cast to java.util.Date
	at org.joda.time.convert.DateConverter.getInstantMillis(DateConverter.java:55)
	at org.joda.time.base.BaseDateTime.<init>(BaseDateTime.java:175)
	at org.joda.time.DateTime.<init>(DateTime.java:257)
	at org.joda.time.tz.TestBuilder.testForwardTransitions(TestBuilder.java:241)
	at org.joda.time.tz.TestCompiler.testCompile(TestCompiler.java:117)


Results :

Failed tests: 
  org.joda.time.TestDays#testFactory_parseDays_String AssertionFailedError expec...
  org.joda.time.TestHours#testFactory_parseHours_String AssertionFailedError exp...
  org.joda.time.TestInterval_Basics#testToString_reparse AssertionFailedError ex...
  org.joda.time.TestInterval_Constructors#testConstructor_Object1 AssertionFailedError
  org.joda.time.TestInterval_Constructors#testConstructor_Object2 AssertionFailedError
  org.joda.time.TestInterval_Constructors#testConstructor_Object3 AssertionFailedError
  org.joda.time.TestInterval_Constructors#testConstructor_Object_Chronology1 AssertionFailedError
  org.joda.time.TestInterval_Constructors#testConstructor_Object_Chronology2 AssertionFailedError
  org.joda.time.TestLocalDateTime_Constructors#testConstructor_ObjectLocalDateTime AssertionFailedError
  org.joda.time.TestLocalDateTime_Constructors#testConstructor_ObjectLocalTime AssertionFailedError
  org.joda.time.TestLocalDateTime_Constructors#testConstructor_Object_Chronology_crossChronology AssertionFailedError
  org.joda.time.TestLocalDateTime_Constructors#testConstructor_Object_nullChronology AssertionFailedError
  org.joda.time.TestLocalDate_Constructors#testConstructor_ObjectLocalDateTime AssertionFailedError
  org.joda.time.TestLocalDate_Constructors#testConstructor_ObjectLocalTime AssertionFailedError
  org.joda.time.TestLocalDate_Constructors#testConstructor_ObjectYearMonthDay AssertionFailedError
  org.joda.time.TestLocalTime_Constructors#testConstructor_ObjectLocalDateTime AssertionFailedError
  org.joda.time.TestLocalTime_Constructors#testConstructor_ObjectLocalTime AssertionFailedError
  org.joda.time.TestLocalTime_Constructors#testConstructor_ObjectTimeOfDay AssertionFailedError
  org.joda.time.TestMinutes#testFactory_parseMinutes_String AssertionFailedError
  org.joda.time.TestMutableInterval_Constructors#testConstructor_Object1 AssertionFailedError
  org.joda.time.TestMutableInterval_Constructors#testConstructor_Object2 AssertionFailedError
  org.joda.time.TestMutableInterval_Constructors#testConstructor_Object3 AssertionFailedError
  org.joda.time.TestMutableInterval_Constructors#testConstructor_Object_Chronology1 AssertionFailedError
  org.joda.time.TestMutableInterval_Constructors#testConstructor_Object_Chronology2 AssertionFailedError
  org.joda.time.TestMutableInterval_Constructors#testParse_noFormatter AssertionFailedError
  org.joda.time.TestMutablePeriod_Constructors#testConstructor_Object_Chronology2 AssertionFailedError
  org.joda.time.TestSeconds#testFactory_parseSeconds_String AssertionFailedError
  org.joda.time.TestStringConvert#testDays AssertionFailedError expected:<P5D> b...
  org.joda.time.TestStringConvert#testHours AssertionFailedError expected:<PT5H>...
  org.joda.time.TestStringConvert#testMinutes AssertionFailedError expected:<PT5...
  org.joda.time.TestStringConvert#testMonths AssertionFailedError expected:<P5M>...
  org.joda.time.TestStringConvert#testMutablePeriod AssertionFailedError expecte...
  org.joda.time.TestStringConvert#testPeriod AssertionFailedError expected:<P1Y2...
  org.joda.time.TestStringConvert#testSeconds AssertionFailedError expected:<PT5...
  org.joda.time.TestStringConvert#testWeeks AssertionFailedError expected:<P5W> ...
  org.joda.time.TestStringConvert#testYears AssertionFailedError expected:<P5Y> ...
  org.joda.time.TestTimeOfDay_Constructors#testConstructor_todObject AssertionFailedError
  org.joda.time.TestWeeks#testFactory_parseWeeks_String AssertionFailedError exp...
  org.joda.time.convert.TestConverterManager#testAddIntervalConverter2 AssertionFailedError
  org.joda.time.convert.TestConverterManager#testGetDurationConverter AssertionFailedError
  org.joda.time.convert.TestConverterManager#testGetInstantConverter AssertionFailedError
  org.joda.time.convert.TestConverterManager#testGetIntervalConverter AssertionFailedError
  org.joda.time.convert.TestConverterManager#testGetPartialConverter AssertionFailedError
  org.joda.time.convert.TestConverterManager#testGetPeriodConverter AssertionFailedError
Tests in error: 
  org.joda.time.TestDateMidnight_Constructors#testConstructor_nullObject_nullChronology IllegalArgumentException
  org.joda.time.TestDateMidnight_Constructors#testConstructor_nullObject_nullDateTimeZone IllegalArgumentException
  org.joda.time.TestDateTimeComparator#testBasicComps3 ClassCastException java.u...
  org.joda.time.TestDateTimeComparator#testBasicComps4 ClassCastException java.l...
  org.joda.time.TestDateTimeComparator#testBasicComps5 ClassCastException java.u...
  org.joda.time.TestDateTimeComparator#testDOM ClassCastException java.lang.Stri...
  org.joda.time.TestDateTimeComparator#testDOW ClassCastException java.lang.Stri...
  org.joda.time.TestDateTimeComparator#testDOY ClassCastException java.lang.Stri...
  org.joda.time.TestDateTimeComparator#testHour ClassCastException java.lang.Str...
  org.joda.time.TestDateTimeComparator#testInvalidObj ClassCastException java.la...
  org.joda.time.TestDateTimeComparator#testListBasic ClassCastException java.lan...
  org.joda.time.TestDateTimeComparator#testListDOM ClassCastException java.lang....
  org.joda.time.TestDateTimeComparator#testListDOW ClassCastException java.lang....
  org.joda.time.TestDateTimeComparator#testListDOY ClassCastException java.lang....
  org.joda.time.TestDateTimeComparator#testListDate ClassCastException java.lang...
  org.joda.time.TestDateTimeComparator#testListHour ClassCastException java.lang...
  org.joda.time.TestDateTimeComparator#testListMillis ClassCastException org.jod...
  org.joda.time.TestDateTimeComparator#testListMinute ClassCastException java.la...
  org.joda.time.TestDateTimeComparator#testListMonth ClassCastException java.lan...
  org.joda.time.TestDateTimeComparator#testListSecond ClassCastException java.la...
  org.joda.time.TestDateTimeComparator#testListTime ClassCastException java.lang...
  org.joda.time.TestDateTimeComparator#testListWOW ClassCastException java.lang....
  org.joda.time.TestDateTimeComparator#testListYOYY ClassCastException java.lang...
  org.joda.time.TestDateTimeComparator#testListYear ClassCastException java.lang...
  org.joda.time.TestDateTimeComparator#testMillis ClassCastException org.joda.ti...
  org.joda.time.TestDateTimeComparator#testMinute ClassCastException java.lang.S...
  org.joda.time.TestDateTimeComparator#testMonth ClassCastException java.lang.St...
  org.joda.time.TestDateTimeComparator#testNullDT ClassCastException java.lang.S...
  org.joda.time.TestDateTimeComparator#testSecond ClassCastException java.lang.S...
  org.joda.time.TestDateTimeComparator#testWOW ClassCastException java.lang.Stri...
  org.joda.time.TestDateTimeComparator#testWOYY ClassCastException java.lang.Str...
  org.joda.time.TestDateTimeComparator#testYear ClassCastException java.lang.Str...
  org.joda.time.TestDateTimeZoneCutover#testPeriod ClassCastException java.lang....
  org.joda.time.TestDateTimeZoneCutover#testPlusMillisInDstChange ClassCastException
  org.joda.time.TestDateTimeZoneCutover#testPlusMinutesInDstChange ClassCastException
  org.joda.time.TestDateTimeZoneCutover#testPlusSecondsInDstChange ClassCastException
  org.joda.time.TestDateTimeZoneCutover#testWithHourOfDayInDstChange ClassCastException
  org.joda.time.TestDateTimeZoneCutover#testWithMillisOfSecondInDstChange_NewYork_summer ClassCastException
  org.joda.time.TestDateTimeZoneCutover#testWithMillisOfSecondInDstChange_NewYork_winter ClassCastException
  org.joda.time.TestDateTimeZoneCutover#testWithMillisOfSecondInDstChange_Paris_summer ClassCastException
  org.joda.time.TestDateTimeZoneCutover#testWithMillisOfSecondInDstChange_Paris_winter ClassCastException
  org.joda.time.TestDateTimeZoneCutover#testWithMinuteOfHourInDstChange ClassCastException
  org.joda.time.TestDateTimeZoneCutover#testWithSecondOfMinuteInDstChange ClassCastException
  org.joda.time.TestDateTimeZoneCutover#test_DateTime_parse_Gaza ClassCastException
  org.joda.time.TestDateTimeZoneCutover#test_DateTime_parse_Turk ClassCastException
  org.joda.time.TestDateTime_Constructors#testConstructor_Object_DateTimeZone ClassCastException
  org.joda.time.TestDateTime_Constructors#testConstructor_Object_nullDateTimeZone ClassCastException
  org.joda.time.TestDateTime_Constructors#testConstructor_nullObject_nullChronology IllegalArgumentException
  org.joda.time.TestDateTime_Constructors#testConstructor_nullObject_nullDateTimeZone IllegalArgumentException
  org.joda.time.TestDuration_Constructors#testConstructor_Object3 ClassCastException
  org.joda.time.TestDuration_Constructors#testConstructor_Object5 ClassCastException
  org.joda.time.TestIllegalFieldValueException#testGJCutover ClassCastException ...
  org.joda.time.TestLocalDateTime_Constructors#testConstructor_ObjectLocalDate ClassCastException
  org.joda.time.TestLocalDateTime_Constructors#testConstructor_ObjectStringEx3 ClassCastException
  org.joda.time.TestLocalDateTime_Constructors#testConstructor_ObjectStringEx4 ClassCastException
  org.joda.time.TestLocalDateTime_Constructors#testConstructor_ObjectStringEx5 ClassCastException
  org.joda.time.TestLocalDateTime_Constructors#testConstructor_ObjectStringEx6 ClassCastException
  org.joda.time.TestLocalDateTime_Constructors#testConstructor_Object_ChronologyMoscow ClassCastException
  org.joda.time.TestLocalDateTime_Constructors#testConstructor_Object_ChronologyMoscowBadDateTime ClassCastException
  org.joda.time.TestLocalDate_Constructors#testConstructor_ObjectString1 ClassCastException
  org.joda.time.TestLocalDate_Constructors#testConstructor_ObjectString2 ClassCastException
  org.joda.time.TestLocalDate_Constructors#testConstructor_ObjectString3 ClassCastException
  org.joda.time.TestLocalDate_Constructors#testConstructor_ObjectStringEx1 ClassCastException
  org.joda.time.TestLocalDate_Constructors#testConstructor_ObjectStringEx2 ClassCastException
  org.joda.time.TestLocalDate_Constructors#testConstructor_ObjectStringEx3 ClassCastException
  org.joda.time.TestLocalDate_Constructors#testConstructor_ObjectStringEx4 ClassCastException
  org.joda.time.TestLocalDate_Constructors#testConstructor_ObjectStringEx5 ClassCastException
  org.joda.time.TestLocalDate_Constructors#testConstructor_ObjectStringEx6 ClassCastException
  org.joda.time.TestLocalDate_Constructors#testConstructor_ObjectStringEx7 ClassCastException
  org.joda.time.TestLocalDate_Constructors#testConstructor_nullObject NullPointerException
  org.joda.time.TestLocalDate_Constructors#testConstructor_nullObject_Chronology NullPointerException
  org.joda.time.TestLocalDate_Constructors#testConstructor_nullObject_DateTimeZone NullPointerException
  org.joda.time.TestLocalDate_Constructors#testConstructor_nullObject_nullChronology NullPointerException
  org.joda.time.TestLocalDate_Constructors#testConstructor_nullObject_nullDateTimeZone NullPointerException
  org.joda.time.TestLocalTime_Constructors#testConstructor_Object2 ClassCastException
  org.joda.time.TestLocalTime_Constructors#testConstructor_Object2_Chronology ClassCastException
  org.joda.time.TestLocalTime_Constructors#testConstructor_ObjectString1 ClassCastException
  org.joda.time.TestLocalTime_Constructors#testConstructor_ObjectString1NewYork ClassCastException
  org.joda.time.TestLocalTime_Constructors#testConstructor_ObjectString1Tokyo ClassCastException
  org.joda.time.TestLocalTime_Constructors#testConstructor_ObjectString2 ClassCastException
  org.joda.time.TestLocalTime_Constructors#testConstructor_ObjectString3 ClassCastException
  org.joda.time.TestLocalTime_Constructors#testConstructor_ObjectString4 ClassCastException
  org.joda.time.TestLocalTime_Constructors#testConstructor_ObjectStringEx1 ClassCastException
  org.joda.time.TestLocalTime_Constructors#testConstructor_ObjectStringEx2 ClassCastException
  org.joda.time.TestLocalTime_Constructors#testConstructor_ObjectStringEx3 ClassCastException
  org.joda.time.TestLocalTime_Constructors#testConstructor_ObjectStringEx4 ClassCastException
  org.joda.time.TestLocalTime_Constructors#testConstructor_ObjectStringEx5 ClassCastException
  org.joda.time.TestLocalTime_Constructors#testConstructor_ObjectStringEx6 ClassCastException
  org.joda.time.TestLocalTime_Constructors#testConstructor_ObjectString_DateTimeZoneLondon ClassCastException
  org.joda.time.TestLocalTime_Constructors#testConstructor_ObjectString_DateTimeZoneNewYork ClassCastException
  org.joda.time.TestLocalTime_Constructors#testConstructor_ObjectString_DateTimeZoneTokyo ClassCastException
  org.joda.time.TestLocalTime_Constructors#testConstructor_nullObject NullPointerException
  org.joda.time.TestLocalTime_Constructors#testConstructor_nullObject_Chronology NullPointerException
  org.joda.time.TestLocalTime_Constructors#testConstructor_nullObject_DateTimeZone NullPointerException
  org.joda.time.TestLocalTime_Constructors#testConstructor_nullObject_nullChronology NullPointerException
  org.joda.time.TestLocalTime_Constructors#testConstructor_nullObject_nullDateTimeZone NullPointerException
  org.joda.time.TestMonthDay_Constructors#testConstructor_Object ClassCastException
  org.joda.time.TestMonthDay_Constructors#testConstructor_ObjectString1 ClassCastException
  org.joda.time.TestMonthDay_Constructors#testConstructor_ObjectString5 ClassCastException
  org.joda.time.TestMonthDay_Constructors#testConstructor_ObjectStringEx1 ClassCastException
  org.joda.time.TestMonthDay_Constructors#testConstructor_ObjectStringEx2 ClassCastException
  org.joda.time.TestMonthDay_Constructors#testConstructor_ObjectStringEx3 ClassCastException
  org.joda.time.TestMonthDay_Constructors#testConstructor_ObjectStringEx4 ClassCastException
  org.joda.time.TestMonthDay_Constructors#testConstructor_Object_Chronology ClassCastException
  org.joda.time.TestMonthDay_Constructors#testConstructor_Object_nullChronology ClassCastException
  org.joda.time.TestMonthDay_Constructors#testConstructor_nullObject NullPointerException
  org.joda.time.TestMonthDay_Constructors#testConstructor_nullObject_Chronology NullPointerException
  org.joda.time.TestMonthDay_Constructors#testConstructor_nullObject_nullChronology NullPointerException
  org.joda.time.TestMutableDateTime_Constructors#testConstructor_nullObject NullPointerException
  org.joda.time.TestMutableDateTime_Constructors#testConstructor_nullObject_nullChronology IllegalArgumentException
  org.joda.time.TestMutableDateTime_Constructors#testConstructor_nullObject_nullDateTimeZone IllegalArgumentException
  org.joda.time.TestMutablePeriod_Constructors#testConstructor_Object1 ClassCastException
  org.joda.time.TestMutablePeriod_Constructors#testConstructor_Object2 NullPointerException
  org.joda.time.TestMutablePeriod_Constructors#testConstructor_Object3 ClassCastException
  org.joda.time.TestMutablePeriod_Constructors#testConstructor_Object4 ClassCastException
  org.joda.time.TestMutablePeriod_Constructors#testConstructor_Object_PeriodType1 ClassCastException
  org.joda.time.TestMutablePeriod_Constructors#testConstructor_Object_PeriodType3 ClassCastException
  org.joda.time.TestMutablePeriod_Constructors#testConstructor_Object_PeriodType4 ClassCastException
  org.joda.time.TestMutablePeriod_Constructors#testParse_noFormatter ClassCastException
  org.joda.time.TestPeriod_Basics#testToMutablePeriod ClassCastException org.jod...
  org.joda.time.TestPeriod_Basics#testWithPeriodType2 ClassCastException org.jod...
  org.joda.time.TestPeriod_Basics#testWithPeriodType3 ClassCastException org.jod...
  org.joda.time.TestPeriod_Basics#testWithPeriodType5 ClassCastException org.jod...
  org.joda.time.TestPeriod_Constructors#testConstructor_Object1 ClassCastException
  org.joda.time.TestPeriod_Constructors#testConstructor_Object3 ClassCastException
  org.joda.time.TestPeriod_Constructors#testConstructor_Object4 ClassCastException
  org.joda.time.TestPeriod_Constructors#testConstructor_Object_PeriodType1 ClassCastException
  org.joda.time.TestPeriod_Constructors#testConstructor_Object_PeriodType3 ClassCastException
  org.joda.time.TestPeriod_Constructors#testConstructor_Object_PeriodType4 ClassCastException
  org.joda.time.TestPeriod_Constructors#testParse_noFormatter ClassCastException
  org.joda.time.TestTimeOfDay_Constructors#testConstructor2_Object_Chronology ClassCastException
  org.joda.time.TestTimeOfDay_Constructors#testConstructor_Object1 ClassCastException
  org.joda.time.TestTimeOfDay_Constructors#testConstructor_ObjectString1 ClassCastException
  org.joda.time.TestTimeOfDay_Constructors#testConstructor_ObjectString2 ClassCastException
  org.joda.time.TestTimeOfDay_Constructors#testConstructor_ObjectString3 ClassCastException
  org.joda.time.TestTimeOfDay_Constructors#testConstructor_ObjectString4 ClassCastException
  org.joda.time.TestTimeOfDay_Constructors#testConstructor_ObjectString5 ClassCastException
  org.joda.time.TestTimeOfDay_Constructors#testConstructor_ObjectString6 ClassCastException
  org.joda.time.TestTimeOfDay_Constructors#testConstructor_ObjectStringEx1 ClassCastException
  org.joda.time.TestTimeOfDay_Constructors#testConstructor_ObjectStringEx2 ClassCastException
  org.joda.time.TestTimeOfDay_Constructors#testConstructor_ObjectStringEx3 ClassCastException
  org.joda.time.TestTimeOfDay_Constructors#testConstructor_ObjectStringEx4 ClassCastException
  org.joda.time.TestTimeOfDay_Constructors#testConstructor_nullObject NullPointerException
  org.joda.time.TestTimeOfDay_Constructors#testConstructor_nullObject_Chronology NullPointerException
  org.joda.time.TestTimeOfDay_Constructors#testConstructor_nullObject_nullChronology NullPointerException
  org.joda.time.TestYearMonthDay_Constructors#testConstructor_Object ClassCastException
  org.joda.time.TestYearMonthDay_Constructors#testConstructor_ObjectString1 ClassCastException
  org.joda.time.TestYearMonthDay_Constructors#testConstructor_ObjectString2 ClassCastException
  org.joda.time.TestYearMonthDay_Constructors#testConstructor_ObjectString3 ClassCastException
  org.joda.time.TestYearMonthDay_Constructors#testConstructor_ObjectString4 ClassCastException
  org.joda.time.TestYearMonthDay_Constructors#testConstructor_ObjectString5 ClassCastException
  org.joda.time.TestYearMonthDay_Constructors#testConstructor_ObjectStringEx1 ClassCastException
  org.joda.time.TestYearMonthDay_Constructors#testConstructor_ObjectStringEx2 ClassCastException
  org.joda.time.TestYearMonthDay_Constructors#testConstructor_ObjectStringEx3 ClassCastException
  org.joda.time.TestYearMonthDay_Constructors#testConstructor_ObjectStringEx4 ClassCastException
  org.joda.time.TestYearMonthDay_Constructors#testConstructor_Object_Chronology ClassCastException
  org.joda.time.TestYearMonthDay_Constructors#testConstructor_Object_nullChronology ClassCastException
  org.joda.time.TestYearMonthDay_Constructors#testConstructor_nullObject NullPointerException
  org.joda.time.TestYearMonthDay_Constructors#testConstructor_nullObject_Chronology NullPointerException
  org.joda.time.TestYearMonthDay_Constructors#testConstructor_nullObject_nullChronology NullPointerException
  org.joda.time.TestYearMonth_Constructors#testConstructor_Object ClassCastException
  org.joda.time.TestYearMonth_Constructors#testConstructor_ObjectString1 ClassCastException
  org.joda.time.TestYearMonth_Constructors#testConstructor_ObjectString5 ClassCastException
  org.joda.time.TestYearMonth_Constructors#testConstructor_ObjectStringEx1 ClassCastException
  org.joda.time.TestYearMonth_Constructors#testConstructor_ObjectStringEx2 ClassCastException
  org.joda.time.TestYearMonth_Constructors#testConstructor_ObjectStringEx3 ClassCastException
  org.joda.time.TestYearMonth_Constructors#testConstructor_ObjectStringEx4 ClassCastException
  org.joda.time.TestYearMonth_Constructors#testConstructor_Object_Chronology ClassCastException
  org.joda.time.TestYearMonth_Constructors#testConstructor_Object_nullChronology ClassCastException
  org.joda.time.TestYearMonth_Constructors#testConstructor_nullObject NullPointerException
  org.joda.time.TestYearMonth_Constructors#testConstructor_nullObject_Chronology NullPointerException
  org.joda.time.TestYearMonth_Constructors#testConstructor_nullObject_nullChronology NullPointerException
  org.joda.time.chrono.TestGJChronology#testCutoverAddDays ClassCastException ja...
  org.joda.time.chrono.TestGJChronology#testCutoverAddMonths ClassCastException ...
  org.joda.time.chrono.TestGJChronology#testCutoverAddWeeks ClassCastException j...
  org.joda.time.chrono.TestGJChronology#testCutoverAddWeekyears ClassCastException
  org.joda.time.chrono.TestGJChronology#testCutoverAddYears ClassCastException j...
  org.joda.time.chrono.TestGJChronology#testParseEquivalence ClassCastException ...
  org.joda.time.chrono.TestGJChronology#testPartialGetAsText ClassCastException ...
  org.joda.time.chrono.TestGJChronology#testYearEndAddDays ClassCastException ja...
  org.joda.time.chrono.TestISOChronology#testAddMonths ClassCastException java.l...
  org.joda.time.chrono.TestISOChronology#testCutoverAddYears ClassCastException ...
  org.joda.time.chrono.TestISOChronology#testMaxYear ClassCastException java.lan...
  org.joda.time.chrono.TestISOChronology#testMinYear ClassCastException java.lan...
  org.joda.time.format.TestDateTimeFormatterBuilder#test_appendFixedDecimal ClassCastException
  org.joda.time.format.TestDateTimeFormatterBuilder#test_appendFixedSignedDecimal ClassCastException
  org.joda.time.tz.TestBuilder#testForwardTransitions ClassCastException java.la...
  org.joda.time.tz.TestBuilder#testReverseTransitions ClassCastException java.la...
  org.joda.time.tz.TestBuilder#testSerialization ClassCastException java.lang.St...
  org.joda.time.tz.TestCompiler#testCompile ClassCastException java.lang.String ...

Tests run: 4157, Failures: 44, Errors: 190, Skipped: 0

[INFO] ------------------------------------------------------------------------
[INFO] BUILD FAILURE
[INFO] ------------------------------------------------------------------------
[INFO] Total time: 15.496s
[INFO] Finished at: Thu Aug 06 03:15:48 BST 2015
[INFO] Final Memory: 9M/209M
[INFO] ------------------------------------------------------------------------
[ERROR] Failed to execute goal org.apache.maven.plugins:maven-surefire-plugin:2.18.1:test (default-test) on project joda-time: There are test failures.
[ERROR] 
[ERROR] Please refer to /home/perham/Study/LittleDarwin/Cases/joda-time-2.8.1/target/surefire-reports for the individual test results.
[ERROR] -> [Help 1]
[ERROR] 
[ERROR] To see the full stack trace of the errors, re-run Maven with the -e switch.
[ERROR] Re-run Maven using the -X switch to enable full debug logging.
[ERROR] 
[ERROR] For more information about the errors and possible solutions, please read the following articles:
[ERROR] [Help 1] http://cwiki.apache.org/confluence/display/MAVEN/MojoFailureException
