[INFO] Scanning for projects...
[INFO]                                                                         
[INFO] ------------------------------------------------------------------------
[INFO] Building Joda-Time 2.8.1
[INFO] ------------------------------------------------------------------------
[INFO] 
[INFO] --- maven-resources-plugin:2.7:resources (default-resources) @ joda-time ---
[INFO] Using 'UTF-8' encoding to copy filtered resources.
[INFO] Copying 2 resources to META-INF
[INFO] Copying 10 resources
[INFO] 
[INFO] --- maven-compiler-plugin:3.3:compile (default-compile) @ joda-time ---
[INFO] Changes detected - recompiling the module!
[INFO] Compiling 166 source files to /home/perham/Study/LittleDarwin/Cases/joda-time-2.8.1/target/classes
[INFO] 
[INFO] --- exec-maven-plugin:1.4.0:java (compile-tzdb) @ joda-time ---
Writing zoneinfo files
Writing ZoneInfoMap
[INFO] 
[INFO] --- maven-resources-plugin:2.7:testResources (default-testResources) @ joda-time ---
[INFO] Using 'UTF-8' encoding to copy filtered resources.
[INFO] Copying 34 resources
[INFO] 
[INFO] --- maven-compiler-plugin:3.3:testCompile (default-testCompile) @ joda-time ---
[INFO] Nothing to compile - all classes are up to date
[INFO] 
[INFO] --- maven-surefire-plugin:2.18.1:test (default-test) @ joda-time ---
[INFO] Surefire report directory: /home/perham/Study/LittleDarwin/Cases/joda-time-2.8.1/target/surefire-reports

-------------------------------------------------------
 T E S T S
-------------------------------------------------------
Running org.joda.time.TestAllPackages

TestBuddhistChronology.testCalendar

TestCopticChronology.testCalendar

TestEthiopicChronology.testCalendar

TestIslamicChronology.testCalendar

Testing Gregorian chronology over 1000 iterations
100% complete (i=1000)

Testing Julian chronology over 1000 iterations
100% complete (i=1000)
Writing zoneinfo files
Writing ZoneInfoMap
Tests run: 4157, Failures: 0, Errors: 161, Skipped: 0, Time elapsed: 5.423 sec <<< FAILURE! - in org.joda.time.TestAllPackages
testConstructor_invalidObject(org.joda.time.TestInstant_Constructors)  Time elapsed: 0.004 sec  <<< ERROR!
java.lang.ArrayIndexOutOfBoundsException: 17
	at org.joda.time.convert.ConverterSet.select(ConverterSet.java:17)
	at org.joda.time.convert.ConverterManager.getInstantConverter(ConverterManager.java:160)
	at org.joda.time.Instant.<init>(Instant.java:133)
	at org.joda.time.TestInstant_Constructors.testConstructor_invalidObject(TestInstant_Constructors.java:154)

testConstructor_badconverterObject(org.joda.time.TestInstant_Constructors)  Time elapsed: 0 sec  <<< ERROR!
java.lang.ArrayIndexOutOfBoundsException: 16
	at org.joda.time.convert.ConverterSet.select(ConverterSet.java:17)
	at org.joda.time.convert.ConverterManager.getInstantConverter(ConverterManager.java:160)
	at org.joda.time.Instant.<init>(Instant.java:133)
	at org.joda.time.TestInstant_Constructors.testConstructor_badconverterObject(TestInstant_Constructors.java:174)

testConstructor_invalidObject_DateTimeZone(org.joda.time.TestDateTime_Constructors)  Time elapsed: 0.001 sec  <<< ERROR!
java.lang.ArrayIndexOutOfBoundsException: 17
	at org.joda.time.convert.ConverterSet.select(ConverterSet.java:17)
	at org.joda.time.convert.ConverterManager.getInstantConverter(ConverterManager.java:160)
	at org.joda.time.base.BaseDateTime.<init>(BaseDateTime.java:151)
	at org.joda.time.DateTime.<init>(DateTime.java:281)
	at org.joda.time.TestDateTime_Constructors.testConstructor_invalidObject_DateTimeZone(TestDateTime_Constructors.java:492)

testConstructor_badconverterObject_DateTimeZone(org.joda.time.TestDateTime_Constructors)  Time elapsed: 0.001 sec  <<< ERROR!
java.lang.ArrayIndexOutOfBoundsException: 16
	at org.joda.time.convert.ConverterSet.select(ConverterSet.java:17)
	at org.joda.time.convert.ConverterManager.getInstantConverter(ConverterManager.java:160)
	at org.joda.time.base.BaseDateTime.<init>(BaseDateTime.java:173)
	at org.joda.time.DateTime.<init>(DateTime.java:302)
	at org.joda.time.TestDateTime_Constructors.testConstructor_badconverterObject_DateTimeZone(TestDateTime_Constructors.java:531)

testConstructor_invalidObject(org.joda.time.TestDateTime_Constructors)  Time elapsed: 0.001 sec  <<< ERROR!
java.lang.ArrayIndexOutOfBoundsException: 17
	at org.joda.time.convert.ConverterSet.select(ConverterSet.java:17)
	at org.joda.time.convert.ConverterManager.getInstantConverter(ConverterManager.java:160)
	at org.joda.time.base.BaseDateTime.<init>(BaseDateTime.java:173)
	at org.joda.time.DateTime.<init>(DateTime.java:257)
	at org.joda.time.TestDateTime_Constructors.testConstructor_invalidObject(TestDateTime_Constructors.java:346)

testConstructor_badconverterObject(org.joda.time.TestDateTime_Constructors)  Time elapsed: 0 sec  <<< ERROR!
java.lang.ArrayIndexOutOfBoundsException: 16
	at org.joda.time.convert.ConverterSet.select(ConverterSet.java:17)
	at org.joda.time.convert.ConverterManager.getInstantConverter(ConverterManager.java:160)
	at org.joda.time.base.BaseDateTime.<init>(BaseDateTime.java:173)
	at org.joda.time.DateTime.<init>(DateTime.java:257)
	at org.joda.time.TestDateTime_Constructors.testConstructor_badconverterObject(TestDateTime_Constructors.java:366)

testConstructor_invalidObject_Chronology(org.joda.time.TestDateTime_Constructors)  Time elapsed: 0.001 sec  <<< ERROR!
java.lang.ArrayIndexOutOfBoundsException: 17
	at org.joda.time.convert.ConverterSet.select(ConverterSet.java:17)
	at org.joda.time.convert.ConverterManager.getInstantConverter(ConverterManager.java:160)
	at org.joda.time.base.BaseDateTime.<init>(BaseDateTime.java:173)
	at org.joda.time.DateTime.<init>(DateTime.java:302)
	at org.joda.time.TestDateTime_Constructors.testConstructor_invalidObject_Chronology(TestDateTime_Constructors.java:554)

testConstructor_badconverterObject_Chronology(org.joda.time.TestDateTime_Constructors)  Time elapsed: 0 sec  <<< ERROR!
java.lang.ArrayIndexOutOfBoundsException: 16
	at org.joda.time.convert.ConverterSet.select(ConverterSet.java:17)
	at org.joda.time.convert.ConverterManager.getInstantConverter(ConverterManager.java:160)
	at org.joda.time.base.BaseDateTime.<init>(BaseDateTime.java:173)
	at org.joda.time.DateTime.<init>(DateTime.java:302)
	at org.joda.time.TestDateTime_Constructors.testConstructor_badconverterObject_Chronology(TestDateTime_Constructors.java:593)

testToDateMidnight(org.joda.time.TestDateTime_Basics)  Time elapsed: 0.001 sec  <<< ERROR!
java.lang.ArrayIndexOutOfBoundsException: 16
	at org.joda.time.convert.ConverterSet.select(ConverterSet.java:17)
	at org.joda.time.convert.ConverterManager.getInstantConverter(ConverterManager.java:160)
	at org.joda.time.base.BaseDateTime.<init>(BaseDateTime.java:173)
	at org.joda.time.DateMidnight.<init>(DateMidnight.java:303)
	at org.joda.time.TestDateTime_Basics.testToDateMidnight(TestDateTime_Basics.java:715)

testConstructor_invalidObject_DateTimeZone(org.joda.time.TestMutableDateTime_Constructors)  Time elapsed: 0.001 sec  <<< ERROR!
java.lang.ArrayIndexOutOfBoundsException: 17
	at org.joda.time.convert.ConverterSet.select(ConverterSet.java:17)
	at org.joda.time.convert.ConverterManager.getInstantConverter(ConverterManager.java:160)
	at org.joda.time.base.BaseDateTime.<init>(BaseDateTime.java:151)
	at org.joda.time.MutableDateTime.<init>(MutableDateTime.java:279)
	at org.joda.time.TestMutableDateTime_Constructors.testConstructor_invalidObject_DateTimeZone(TestMutableDateTime_Constructors.java:344)

testConstructor_badconverterObject_DateTimeZone(org.joda.time.TestMutableDateTime_Constructors)  Time elapsed: 0 sec  <<< ERROR!
java.lang.ArrayIndexOutOfBoundsException: 16
	at org.joda.time.convert.ConverterSet.select(ConverterSet.java:17)
	at org.joda.time.convert.ConverterManager.getInstantConverter(ConverterManager.java:160)
	at org.joda.time.base.BaseDateTime.<init>(BaseDateTime.java:173)
	at org.joda.time.MutableDateTime.<init>(MutableDateTime.java:299)
	at org.joda.time.TestMutableDateTime_Constructors.testConstructor_badconverterObject_DateTimeZone(TestMutableDateTime_Constructors.java:383)

testConstructor_invalidObject(org.joda.time.TestMutableDateTime_Constructors)  Time elapsed: 0 sec  <<< ERROR!
java.lang.ArrayIndexOutOfBoundsException: 17
	at org.joda.time.convert.ConverterSet.select(ConverterSet.java:17)
	at org.joda.time.convert.ConverterManager.getInstantConverter(ConverterManager.java:160)
	at org.joda.time.base.BaseDateTime.<init>(BaseDateTime.java:173)
	at org.joda.time.MutableDateTime.<init>(MutableDateTime.java:256)
	at org.joda.time.TestMutableDateTime_Constructors.testConstructor_invalidObject(TestMutableDateTime_Constructors.java:301)

testConstructor_badconverterObject(org.joda.time.TestMutableDateTime_Constructors)  Time elapsed: 0.001 sec  <<< ERROR!
java.lang.ArrayIndexOutOfBoundsException: 16
	at org.joda.time.convert.ConverterSet.select(ConverterSet.java:17)
	at org.joda.time.convert.ConverterManager.getInstantConverter(ConverterManager.java:160)
	at org.joda.time.base.BaseDateTime.<init>(BaseDateTime.java:173)
	at org.joda.time.MutableDateTime.<init>(MutableDateTime.java:256)
	at org.joda.time.TestMutableDateTime_Constructors.testConstructor_badconverterObject(TestMutableDateTime_Constructors.java:321)

testConstructor_invalidObject_Chronology(org.joda.time.TestMutableDateTime_Constructors)  Time elapsed: 0.001 sec  <<< ERROR!
java.lang.ArrayIndexOutOfBoundsException: 17
	at org.joda.time.convert.ConverterSet.select(ConverterSet.java:17)
	at org.joda.time.convert.ConverterManager.getInstantConverter(ConverterManager.java:160)
	at org.joda.time.base.BaseDateTime.<init>(BaseDateTime.java:173)
	at org.joda.time.MutableDateTime.<init>(MutableDateTime.java:299)
	at org.joda.time.TestMutableDateTime_Constructors.testConstructor_invalidObject_Chronology(TestMutableDateTime_Constructors.java:406)

testConstructor_badconverterObject_Chronology(org.joda.time.TestMutableDateTime_Constructors)  Time elapsed: 0 sec  <<< ERROR!
java.lang.ArrayIndexOutOfBoundsException: 16
	at org.joda.time.convert.ConverterSet.select(ConverterSet.java:17)
	at org.joda.time.convert.ConverterManager.getInstantConverter(ConverterManager.java:160)
	at org.joda.time.base.BaseDateTime.<init>(BaseDateTime.java:173)
	at org.joda.time.MutableDateTime.<init>(MutableDateTime.java:299)
	at org.joda.time.TestMutableDateTime_Constructors.testConstructor_badconverterObject_Chronology(TestMutableDateTime_Constructors.java:445)

testConstructor_invalidObject_DateTimeZone(org.joda.time.TestDateMidnight_Constructors)  Time elapsed: 0 sec  <<< ERROR!
java.lang.ArrayIndexOutOfBoundsException: 17
	at org.joda.time.convert.ConverterSet.select(ConverterSet.java:17)
	at org.joda.time.convert.ConverterManager.getInstantConverter(ConverterManager.java:160)
	at org.joda.time.base.BaseDateTime.<init>(BaseDateTime.java:151)
	at org.joda.time.DateMidnight.<init>(DateMidnight.java:281)
	at org.joda.time.TestDateMidnight_Constructors.testConstructor_invalidObject_DateTimeZone(TestDateMidnight_Constructors.java:363)

testConstructor_badconverterObject_DateTimeZone(org.joda.time.TestDateMidnight_Constructors)  Time elapsed: 0.001 sec  <<< ERROR!
java.lang.ArrayIndexOutOfBoundsException: 16
	at org.joda.time.convert.ConverterSet.select(ConverterSet.java:17)
	at org.joda.time.convert.ConverterManager.getInstantConverter(ConverterManager.java:160)
	at org.joda.time.base.BaseDateTime.<init>(BaseDateTime.java:173)
	at org.joda.time.DateMidnight.<init>(DateMidnight.java:303)
	at org.joda.time.TestDateMidnight_Constructors.testConstructor_badconverterObject_DateTimeZone(TestDateMidnight_Constructors.java:402)

testConstructor_invalidObject(org.joda.time.TestDateMidnight_Constructors)  Time elapsed: 0 sec  <<< ERROR!
java.lang.ArrayIndexOutOfBoundsException: 17
	at org.joda.time.convert.ConverterSet.select(ConverterSet.java:17)
	at org.joda.time.convert.ConverterManager.getInstantConverter(ConverterManager.java:160)
	at org.joda.time.base.BaseDateTime.<init>(BaseDateTime.java:173)
	at org.joda.time.DateMidnight.<init>(DateMidnight.java:256)
	at org.joda.time.TestDateMidnight_Constructors.testConstructor_invalidObject(TestDateMidnight_Constructors.java:320)

testConstructor_badconverterObject(org.joda.time.TestDateMidnight_Constructors)  Time elapsed: 0.001 sec  <<< ERROR!
java.lang.ArrayIndexOutOfBoundsException: 16
	at org.joda.time.convert.ConverterSet.select(ConverterSet.java:17)
	at org.joda.time.convert.ConverterManager.getInstantConverter(ConverterManager.java:160)
	at org.joda.time.base.BaseDateTime.<init>(BaseDateTime.java:173)
	at org.joda.time.DateMidnight.<init>(DateMidnight.java:256)
	at org.joda.time.TestDateMidnight_Constructors.testConstructor_badconverterObject(TestDateMidnight_Constructors.java:340)

testConstructor_invalidObject_Chronology(org.joda.time.TestDateMidnight_Constructors)  Time elapsed: 0.001 sec  <<< ERROR!
java.lang.ArrayIndexOutOfBoundsException: 17
	at org.joda.time.convert.ConverterSet.select(ConverterSet.java:17)
	at org.joda.time.convert.ConverterManager.getInstantConverter(ConverterManager.java:160)
	at org.joda.time.base.BaseDateTime.<init>(BaseDateTime.java:173)
	at org.joda.time.DateMidnight.<init>(DateMidnight.java:303)
	at org.joda.time.TestDateMidnight_Constructors.testConstructor_invalidObject_Chronology(TestDateMidnight_Constructors.java:425)

testConstructor_badconverterObject_Chronology(org.joda.time.TestDateMidnight_Constructors)  Time elapsed: 0.001 sec  <<< ERROR!
java.lang.ArrayIndexOutOfBoundsException: 16
	at org.joda.time.convert.ConverterSet.select(ConverterSet.java:17)
	at org.joda.time.convert.ConverterManager.getInstantConverter(ConverterManager.java:160)
	at org.joda.time.base.BaseDateTime.<init>(BaseDateTime.java:173)
	at org.joda.time.DateMidnight.<init>(DateMidnight.java:303)
	at org.joda.time.TestDateMidnight_Constructors.testConstructor_badconverterObject_Chronology(TestDateMidnight_Constructors.java:464)

testConstructor_Object3(org.joda.time.TestDuration_Constructors)  Time elapsed: 0 sec  <<< ERROR!
java.lang.ArrayIndexOutOfBoundsException: 16
	at org.joda.time.convert.ConverterSet.select(ConverterSet.java:17)
	at org.joda.time.convert.ConverterManager.getDurationConverter(ConverterManager.java:334)
	at org.joda.time.base.BaseDuration.<init>(BaseDuration.java:104)
	at org.joda.time.Duration.<init>(Duration.java:210)
	at org.joda.time.TestDuration_Constructors.testConstructor_Object3(TestDuration_Constructors.java:239)

testParse_noFormatter(org.joda.time.TestInterval_Constructors)  Time elapsed: 0.002 sec  <<< ERROR!
java.lang.ArrayIndexOutOfBoundsException: 17
	at org.joda.time.convert.ConverterSet.select(ConverterSet.java:17)
	at org.joda.time.convert.ConverterManager.getPeriodConverter(ConverterManager.java:421)
	at org.joda.time.base.BasePeriod.<init>(BasePeriod.java:272)
	at org.joda.time.Period.<init>(Period.java:674)
	at org.joda.time.base.AbstractPeriod.toPeriod(AbstractPeriod.java:147)
	at org.joda.time.format.PeriodFormatter.parsePeriod(PeriodFormatter.java:308)
	at org.joda.time.convert.StringConverter.setInto(StringConverter.java:223)
	at org.joda.time.base.BaseInterval.<init>(BaseInterval.java:200)
	at org.joda.time.Interval.<init>(Interval.java:193)
	at org.joda.time.Interval.parse(Interval.java:69)
	at org.joda.time.TestInterval_Constructors.testParse_noFormatter(TestInterval_Constructors.java:109)

testConstructor_RI_RP2(org.joda.time.TestInterval_Constructors)  Time elapsed: 0 sec  <<< ERROR!
java.lang.ArrayIndexOutOfBoundsException: 16
	at org.joda.time.convert.ConverterSet.select(ConverterSet.java:17)
	at org.joda.time.convert.ConverterManager.getInstantConverter(ConverterManager.java:160)
	at org.joda.time.Instant.<init>(Instant.java:133)
	at org.joda.time.TestInterval_Constructors.testConstructor_RI_RP2(TestInterval_Constructors.java:281)

testConstructor_RP_RI2(org.joda.time.TestInterval_Constructors)  Time elapsed: 0.001 sec  <<< ERROR!
java.lang.ArrayIndexOutOfBoundsException: 16
	at org.joda.time.convert.ConverterSet.select(ConverterSet.java:17)
	at org.joda.time.convert.ConverterManager.getInstantConverter(ConverterManager.java:160)
	at org.joda.time.Instant.<init>(Instant.java:133)
	at org.joda.time.TestInterval_Constructors.testConstructor_RP_RI2(TestInterval_Constructors.java:365)

testConstructor_RI_RI2(org.joda.time.TestInterval_Constructors)  Time elapsed: 0 sec  <<< ERROR!
java.lang.ArrayIndexOutOfBoundsException: 16
	at org.joda.time.convert.ConverterSet.select(ConverterSet.java:17)
	at org.joda.time.convert.ConverterManager.getInstantConverter(ConverterManager.java:160)
	at org.joda.time.Instant.<init>(Instant.java:133)
	at org.joda.time.TestInterval_Constructors.testConstructor_RI_RI2(TestInterval_Constructors.java:188)

testConstructor_Object3(org.joda.time.TestInterval_Constructors)  Time elapsed: 0 sec  <<< ERROR!
java.lang.ArrayIndexOutOfBoundsException: 17
	at org.joda.time.convert.ConverterSet.select(ConverterSet.java:17)
	at org.joda.time.convert.ConverterManager.getIntervalConverter(ConverterManager.java:508)
	at org.joda.time.base.BaseInterval.<init>(BaseInterval.java:190)
	at org.joda.time.Interval.<init>(Interval.java:193)
	at org.joda.time.TestInterval_Constructors.testConstructor_Object3(TestInterval_Constructors.java:555)

testConstructor_ObjectLocalDate(org.joda.time.TestLocalDateTime_Constructors)  Time elapsed: 0 sec  <<< ERROR!
java.lang.ArrayIndexOutOfBoundsException: 17
	at org.joda.time.convert.ConverterSet.select(ConverterSet.java:17)
	at org.joda.time.convert.ConverterManager.getPartialConverter(ConverterManager.java:247)
	at org.joda.time.LocalDateTime.<init>(LocalDateTime.java:410)
	at org.joda.time.LocalDateTime.<init>(LocalDateTime.java:358)
	at org.joda.time.TestLocalDateTime_Constructors.testConstructor_ObjectLocalDate(TestLocalDateTime_Constructors.java:485)

testConstructor_ObjectLocalTime(org.joda.time.TestLocalDateTime_Constructors)  Time elapsed: 0.001 sec  <<< ERROR!
java.lang.ArrayIndexOutOfBoundsException: 16
	at org.joda.time.convert.ConverterSet.select(ConverterSet.java:17)
	at org.joda.time.convert.ConverterManager.getPartialConverter(ConverterManager.java:247)
	at org.joda.time.LocalDateTime.<init>(LocalDateTime.java:410)
	at org.joda.time.LocalDateTime.<init>(LocalDateTime.java:358)
	at org.joda.time.TestLocalDateTime_Constructors.testConstructor_ObjectLocalTime(TestLocalDateTime_Constructors.java:493)

testConstructor_ObjectLocalDate(org.joda.time.TestLocalDate_Constructors)  Time elapsed: 0.001 sec  <<< ERROR!
java.lang.ArrayIndexOutOfBoundsException: 17
	at org.joda.time.convert.ConverterSet.select(ConverterSet.java:17)
	at org.joda.time.convert.ConverterManager.getPartialConverter(ConverterManager.java:247)
	at org.joda.time.LocalDate.<init>(LocalDate.java:415)
	at org.joda.time.LocalDate.<init>(LocalDate.java:363)
	at org.joda.time.TestLocalDate_Constructors.testConstructor_ObjectLocalDate(TestLocalDate_Constructors.java:407)

testConstructor_ObjectLocalTime(org.joda.time.TestLocalDate_Constructors)  Time elapsed: 0 sec  <<< ERROR!
java.lang.ArrayIndexOutOfBoundsException: 16
	at org.joda.time.convert.ConverterSet.select(ConverterSet.java:17)
	at org.joda.time.convert.ConverterManager.getPartialConverter(ConverterManager.java:247)
	at org.joda.time.LocalDate.<init>(LocalDate.java:415)
	at org.joda.time.LocalDate.<init>(LocalDate.java:363)
	at org.joda.time.TestLocalDate_Constructors.testConstructor_ObjectLocalTime(TestLocalDate_Constructors.java:417)

testConstructor_Object_Chronology_crossChronology(org.joda.time.TestLocalDate_Constructors)  Time elapsed: 0.001 sec  <<< ERROR!
java.lang.ArrayIndexOutOfBoundsException: 17
	at org.joda.time.convert.ConverterSet.select(ConverterSet.java:17)
	at org.joda.time.convert.ConverterManager.getPartialConverter(ConverterManager.java:247)
	at org.joda.time.LocalDate.<init>(LocalDate.java:415)
	at org.joda.time.TestLocalDate_Constructors.testConstructor_Object_Chronology_crossChronology(TestLocalDate_Constructors.java:487)

testConstructor_ObjectYearMonthDay(org.joda.time.TestLocalDate_Constructors)  Time elapsed: 0 sec  <<< ERROR!
java.lang.ArrayIndexOutOfBoundsException: 16
	at org.joda.time.convert.ConverterSet.select(ConverterSet.java:17)
	at org.joda.time.convert.ConverterManager.getPartialConverter(ConverterManager.java:247)
	at org.joda.time.LocalDate.<init>(LocalDate.java:415)
	at org.joda.time.LocalDate.<init>(LocalDate.java:363)
	at org.joda.time.TestLocalDate_Constructors.testConstructor_ObjectYearMonthDay(TestLocalDate_Constructors.java:434)

testConstructor_ObjectLocalDate(org.joda.time.TestLocalTime_Constructors)  Time elapsed: 0 sec  <<< ERROR!
java.lang.ArrayIndexOutOfBoundsException: 17
	at org.joda.time.convert.ConverterSet.select(ConverterSet.java:17)
	at org.joda.time.convert.ConverterManager.getPartialConverter(ConverterManager.java:247)
	at org.joda.time.LocalTime.<init>(LocalTime.java:431)
	at org.joda.time.LocalTime.<init>(LocalTime.java:383)
	at org.joda.time.TestLocalTime_Constructors.testConstructor_ObjectLocalDate(TestLocalTime_Constructors.java:473)

testConstructor_ObjectLocalTime(org.joda.time.TestLocalTime_Constructors)  Time elapsed: 0.001 sec  <<< ERROR!
java.lang.ArrayIndexOutOfBoundsException: 16
	at org.joda.time.convert.ConverterSet.select(ConverterSet.java:17)
	at org.joda.time.convert.ConverterManager.getPartialConverter(ConverterManager.java:247)
	at org.joda.time.LocalTime.<init>(LocalTime.java:431)
	at org.joda.time.LocalTime.<init>(LocalTime.java:383)
	at org.joda.time.TestLocalTime_Constructors.testConstructor_ObjectLocalTime(TestLocalTime_Constructors.java:462)

testParse_noFormatter(org.joda.time.TestMutableInterval_Constructors)  Time elapsed: 0.001 sec  <<< ERROR!
java.lang.ArrayIndexOutOfBoundsException: 17
	at org.joda.time.convert.ConverterSet.select(ConverterSet.java:17)
	at org.joda.time.convert.ConverterManager.getPeriodConverter(ConverterManager.java:421)
	at org.joda.time.base.BasePeriod.<init>(BasePeriod.java:272)
	at org.joda.time.Period.<init>(Period.java:674)
	at org.joda.time.base.AbstractPeriod.toPeriod(AbstractPeriod.java:147)
	at org.joda.time.format.PeriodFormatter.parsePeriod(PeriodFormatter.java:308)
	at org.joda.time.convert.StringConverter.setInto(StringConverter.java:223)
	at org.joda.time.base.BaseInterval.<init>(BaseInterval.java:197)
	at org.joda.time.MutableInterval.<init>(MutableInterval.java:186)
	at org.joda.time.MutableInterval.parse(MutableInterval.java:71)
	at org.joda.time.TestMutableInterval_Constructors.testParse_noFormatter(TestMutableInterval_Constructors.java:115)

testConstructor_RI_RP2(org.joda.time.TestMutableInterval_Constructors)  Time elapsed: 0 sec  <<< ERROR!
java.lang.ArrayIndexOutOfBoundsException: 16
	at org.joda.time.convert.ConverterSet.select(ConverterSet.java:17)
	at org.joda.time.convert.ConverterManager.getInstantConverter(ConverterManager.java:160)
	at org.joda.time.Instant.<init>(Instant.java:133)
	at org.joda.time.TestMutableInterval_Constructors.testConstructor_RI_RP2(TestMutableInterval_Constructors.java:257)

testConstructor_RP_RI2(org.joda.time.TestMutableInterval_Constructors)  Time elapsed: 0 sec  <<< ERROR!
java.lang.ArrayIndexOutOfBoundsException: 16
	at org.joda.time.convert.ConverterSet.select(ConverterSet.java:17)
	at org.joda.time.convert.ConverterManager.getInstantConverter(ConverterManager.java:160)
	at org.joda.time.Instant.<init>(Instant.java:133)
	at org.joda.time.TestMutableInterval_Constructors.testConstructor_RP_RI2(TestMutableInterval_Constructors.java:341)

testConstructor_Object6(org.joda.time.TestMutableInterval_Constructors)  Time elapsed: 0 sec  <<< ERROR!
java.lang.ArrayIndexOutOfBoundsException: 17
	at org.joda.time.convert.ConverterSet.select(ConverterSet.java:17)
	at org.joda.time.convert.ConverterManager.getIntervalConverter(ConverterManager.java:508)
	at org.joda.time.TestMutableInterval_Constructors.testConstructor_Object6(TestMutableInterval_Constructors.java:570)

testConstructor_RI_RI2(org.joda.time.TestMutableInterval_Constructors)  Time elapsed: 0 sec  <<< ERROR!
java.lang.ArrayIndexOutOfBoundsException: 16
	at org.joda.time.convert.ConverterSet.select(ConverterSet.java:17)
	at org.joda.time.convert.ConverterManager.getInstantConverter(ConverterManager.java:160)
	at org.joda.time.Instant.<init>(Instant.java:133)
	at org.joda.time.TestMutableInterval_Constructors.testConstructor_RI_RI2(TestMutableInterval_Constructors.java:182)

testConstructor_Object2(org.joda.time.TestMutableInterval_Constructors)  Time elapsed: 0 sec  <<< ERROR!
java.lang.ArrayIndexOutOfBoundsException: 17
	at org.joda.time.convert.ConverterSet.select(ConverterSet.java:17)
	at org.joda.time.convert.ConverterManager.getIntervalConverter(ConverterManager.java:508)
	at org.joda.time.base.BaseInterval.<init>(BaseInterval.java:190)
	at org.joda.time.MutableInterval.<init>(MutableInterval.java:186)
	at org.joda.time.TestMutableInterval_Constructors.testConstructor_Object2(TestMutableInterval_Constructors.java:521)

testConstructor_Object4(org.joda.time.TestMutableInterval_Constructors)  Time elapsed: 0 sec  <<< ERROR!
java.lang.ArrayIndexOutOfBoundsException: 17
	at org.joda.time.convert.ConverterSet.select(ConverterSet.java:17)
	at org.joda.time.convert.ConverterManager.getIntervalConverter(ConverterManager.java:508)
	at org.joda.time.base.BaseInterval.<init>(BaseInterval.java:190)
	at org.joda.time.MutableInterval.<init>(MutableInterval.java:186)
	at org.joda.time.TestMutableInterval_Constructors.testConstructor_Object4(TestMutableInterval_Constructors.java:538)

testParse_noFormatter(org.joda.time.TestPeriod_Constructors)  Time elapsed: 0.001 sec  <<< ERROR!
java.lang.ArrayIndexOutOfBoundsException: 17
	at org.joda.time.convert.ConverterSet.select(ConverterSet.java:17)
	at org.joda.time.convert.ConverterManager.getPeriodConverter(ConverterManager.java:421)
	at org.joda.time.base.BasePeriod.<init>(BasePeriod.java:272)
	at org.joda.time.Period.<init>(Period.java:674)
	at org.joda.time.base.AbstractPeriod.toPeriod(AbstractPeriod.java:147)
	at org.joda.time.format.PeriodFormatter.parsePeriod(PeriodFormatter.java:308)
	at org.joda.time.Period.parse(Period.java:92)
	at org.joda.time.Period.parse(Period.java:81)
	at org.joda.time.TestPeriod_Constructors.testParse_noFormatter(TestPeriod_Constructors.java:104)

testParse_noFormatter(org.joda.time.TestMutablePeriod_Constructors)  Time elapsed: 0.001 sec  <<< ERROR!
java.lang.ArrayIndexOutOfBoundsException: 17
	at org.joda.time.convert.ConverterSet.select(ConverterSet.java:17)
	at org.joda.time.convert.ConverterManager.getPeriodConverter(ConverterManager.java:421)
	at org.joda.time.base.BasePeriod.<init>(BasePeriod.java:272)
	at org.joda.time.Period.<init>(Period.java:674)
	at org.joda.time.base.AbstractPeriod.toPeriod(AbstractPeriod.java:147)
	at org.joda.time.format.PeriodFormatter.parsePeriod(PeriodFormatter.java:308)
	at org.joda.time.MutablePeriod.parse(MutablePeriod.java:85)
	at org.joda.time.MutablePeriod.parse(MutablePeriod.java:74)
	at org.joda.time.TestMutablePeriod_Constructors.testParse_noFormatter(TestMutablePeriod_Constructors.java:102)

testToMutablePeriod(org.joda.time.TestMutablePeriod_Basics)  Time elapsed: 0.001 sec  <<< ERROR!
java.lang.ArrayIndexOutOfBoundsException: 17
	at org.joda.time.convert.ConverterSet.select(ConverterSet.java:17)
	at org.joda.time.convert.ConverterManager.getPeriodConverter(ConverterManager.java:421)
	at org.joda.time.base.BasePeriod.<init>(BasePeriod.java:272)
	at org.joda.time.MutablePeriod.<init>(MutablePeriod.java:374)
	at org.joda.time.base.AbstractPeriod.toMutablePeriod(AbstractPeriod.java:158)
	at org.joda.time.TestMutablePeriod_Basics.testToMutablePeriod(TestMutablePeriod_Basics.java:423)

testToPeriod(org.joda.time.TestMutablePeriod_Basics)  Time elapsed: 0.001 sec  <<< ERROR!
java.lang.ArrayIndexOutOfBoundsException: 17
	at org.joda.time.convert.ConverterSet.select(ConverterSet.java:17)
	at org.joda.time.convert.ConverterManager.getPeriodConverter(ConverterManager.java:421)
	at org.joda.time.base.BasePeriod.<init>(BasePeriod.java:272)
	at org.joda.time.Period.<init>(Period.java:674)
	at org.joda.time.base.AbstractPeriod.toPeriod(AbstractPeriod.java:147)
	at org.joda.time.TestMutablePeriod_Basics.testToPeriod(TestMutablePeriod_Basics.java:417)

testFactory_parseYears_String(org.joda.time.TestYears)  Time elapsed: 0.001 sec  <<< ERROR!
java.lang.ArrayIndexOutOfBoundsException: 17
	at org.joda.time.convert.ConverterSet.select(ConverterSet.java:17)
	at org.joda.time.convert.ConverterManager.getPeriodConverter(ConverterManager.java:421)
	at org.joda.time.base.BasePeriod.<init>(BasePeriod.java:272)
	at org.joda.time.Period.<init>(Period.java:674)
	at org.joda.time.base.AbstractPeriod.toPeriod(AbstractPeriod.java:147)
	at org.joda.time.format.PeriodFormatter.parsePeriod(PeriodFormatter.java:308)
	at org.joda.time.Years.parseYears(Years.java:162)
	at org.joda.time.TestYears.testFactory_parseYears_String(TestYears.java:116)

testFactory_parseMonths_String(org.joda.time.TestMonths)  Time elapsed: 0.001 sec  <<< ERROR!
java.lang.ArrayIndexOutOfBoundsException: 17
	at org.joda.time.convert.ConverterSet.select(ConverterSet.java:17)
	at org.joda.time.convert.ConverterManager.getPeriodConverter(ConverterManager.java:421)
	at org.joda.time.base.BasePeriod.<init>(BasePeriod.java:272)
	at org.joda.time.Period.<init>(Period.java:674)
	at org.joda.time.base.AbstractPeriod.toPeriod(AbstractPeriod.java:147)
	at org.joda.time.format.PeriodFormatter.parsePeriod(PeriodFormatter.java:308)
	at org.joda.time.Months.parseMonths(Months.java:198)
	at org.joda.time.TestMonths.testFactory_parseMonths_String(TestMonths.java:161)

testFactory_parseWeeks_String(org.joda.time.TestWeeks)  Time elapsed: 0.001 sec  <<< ERROR!
java.lang.ArrayIndexOutOfBoundsException: 17
	at org.joda.time.convert.ConverterSet.select(ConverterSet.java:17)
	at org.joda.time.convert.ConverterManager.getPeriodConverter(ConverterManager.java:421)
	at org.joda.time.base.BasePeriod.<init>(BasePeriod.java:272)
	at org.joda.time.Period.<init>(Period.java:674)
	at org.joda.time.base.AbstractPeriod.toPeriod(AbstractPeriod.java:147)
	at org.joda.time.format.PeriodFormatter.parsePeriod(PeriodFormatter.java:308)
	at org.joda.time.Weeks.parseWeeks(Weeks.java:185)
	at org.joda.time.TestWeeks.testFactory_parseWeeks_String(TestWeeks.java:133)

testFactory_parseDays_String(org.joda.time.TestDays)  Time elapsed: 0 sec  <<< ERROR!
java.lang.ArrayIndexOutOfBoundsException: 17
	at org.joda.time.convert.ConverterSet.select(ConverterSet.java:17)
	at org.joda.time.convert.ConverterManager.getPeriodConverter(ConverterManager.java:421)
	at org.joda.time.base.BasePeriod.<init>(BasePeriod.java:272)
	at org.joda.time.Period.<init>(Period.java:674)
	at org.joda.time.base.AbstractPeriod.toPeriod(AbstractPeriod.java:147)
	at org.joda.time.format.PeriodFormatter.parsePeriod(PeriodFormatter.java:308)
	at org.joda.time.Days.parseDays(Days.java:203)
	at org.joda.time.TestDays.testFactory_parseDays_String(TestDays.java:175)

testFactory_parseHours_String(org.joda.time.TestHours)  Time elapsed: 0.001 sec  <<< ERROR!
java.lang.ArrayIndexOutOfBoundsException: 17
	at org.joda.time.convert.ConverterSet.select(ConverterSet.java:17)
	at org.joda.time.convert.ConverterManager.getPeriodConverter(ConverterManager.java:421)
	at org.joda.time.base.BasePeriod.<init>(BasePeriod.java:272)
	at org.joda.time.Period.<init>(Period.java:674)
	at org.joda.time.base.AbstractPeriod.toPeriod(AbstractPeriod.java:147)
	at org.joda.time.format.PeriodFormatter.parsePeriod(PeriodFormatter.java:308)
	at org.joda.time.Hours.parseHours(Hours.java:205)
	at org.joda.time.TestHours.testFactory_parseHours_String(TestHours.java:144)

testFactory_parseMinutes_String(org.joda.time.TestMinutes)  Time elapsed: 0 sec  <<< ERROR!
java.lang.ArrayIndexOutOfBoundsException: 17
	at org.joda.time.convert.ConverterSet.select(ConverterSet.java:17)
	at org.joda.time.convert.ConverterManager.getPeriodConverter(ConverterManager.java:421)
	at org.joda.time.base.BasePeriod.<init>(BasePeriod.java:272)
	at org.joda.time.Period.<init>(Period.java:674)
	at org.joda.time.base.AbstractPeriod.toPeriod(AbstractPeriod.java:147)
	at org.joda.time.format.PeriodFormatter.parsePeriod(PeriodFormatter.java:308)
	at org.joda.time.Minutes.parseMinutes(Minutes.java:185)
	at org.joda.time.TestMinutes.testFactory_parseMinutes_String(TestMinutes.java:134)

testFactory_parseSeconds_String(org.joda.time.TestSeconds)  Time elapsed: 0 sec  <<< ERROR!
java.lang.ArrayIndexOutOfBoundsException: 17
	at org.joda.time.convert.ConverterSet.select(ConverterSet.java:17)
	at org.joda.time.convert.ConverterManager.getPeriodConverter(ConverterManager.java:421)
	at org.joda.time.base.BasePeriod.<init>(BasePeriod.java:272)
	at org.joda.time.Period.<init>(Period.java:674)
	at org.joda.time.base.AbstractPeriod.toPeriod(AbstractPeriod.java:147)
	at org.joda.time.format.PeriodFormatter.parsePeriod(PeriodFormatter.java:308)
	at org.joda.time.Seconds.parseSeconds(Seconds.java:185)
	at org.joda.time.TestSeconds.testFactory_parseSeconds_String(TestSeconds.java:131)

testBasicComps1(org.joda.time.TestDateTimeComparator)  Time elapsed: 0.001 sec  <<< ERROR!
java.lang.ArrayIndexOutOfBoundsException: 16
	at org.joda.time.convert.ConverterSet.select(ConverterSet.java:17)
	at org.joda.time.convert.ConverterManager.getInstantConverter(ConverterManager.java:160)
	at org.joda.time.DateTimeComparator.compare(DateTimeComparator.java:192)
	at org.joda.time.TestDateTimeComparator.testBasicComps1(TestDateTimeComparator.java:312)

testBasicComps2(org.joda.time.TestDateTimeComparator)  Time elapsed: 0 sec  <<< ERROR!
java.lang.ArrayIndexOutOfBoundsException: 16
	at org.joda.time.convert.ConverterSet.select(ConverterSet.java:17)
	at org.joda.time.convert.ConverterManager.getInstantConverter(ConverterManager.java:160)
	at org.joda.time.DateTimeComparator.compare(DateTimeComparator.java:192)
	at org.joda.time.TestDateTimeComparator.testBasicComps2(TestDateTimeComparator.java:336)

testBasicComps4(org.joda.time.TestDateTimeComparator)  Time elapsed: 0 sec  <<< ERROR!
java.lang.ArrayIndexOutOfBoundsException: 16
	at org.joda.time.convert.ConverterSet.select(ConverterSet.java:17)
	at org.joda.time.convert.ConverterManager.getInstantConverter(ConverterManager.java:160)
	at org.joda.time.DateTimeComparator.compare(DateTimeComparator.java:192)
	at org.joda.time.TestDateTimeComparator.testBasicComps4(TestDateTimeComparator.java:382)

testMillis(org.joda.time.TestDateTimeComparator)  Time elapsed: 0 sec  <<< ERROR!
java.lang.ArrayIndexOutOfBoundsException: 16
	at org.joda.time.convert.ConverterSet.select(ConverterSet.java:17)
	at org.joda.time.convert.ConverterManager.getInstantConverter(ConverterManager.java:160)
	at org.joda.time.DateTimeComparator.compare(DateTimeComparator.java:192)
	at org.joda.time.TestDateTimeComparator.testMillis(TestDateTimeComparator.java:426)

testSecond(org.joda.time.TestDateTimeComparator)  Time elapsed: 0 sec  <<< ERROR!
java.lang.ArrayIndexOutOfBoundsException: 16
	at org.joda.time.convert.ConverterSet.select(ConverterSet.java:17)
	at org.joda.time.convert.ConverterManager.getInstantConverter(ConverterManager.java:160)
	at org.joda.time.DateTimeComparator.compare(DateTimeComparator.java:192)
	at org.joda.time.TestDateTimeComparator.testSecond(TestDateTimeComparator.java:436)

testMinute(org.joda.time.TestDateTimeComparator)  Time elapsed: 0.001 sec  <<< ERROR!
java.lang.ArrayIndexOutOfBoundsException: 16
	at org.joda.time.convert.ConverterSet.select(ConverterSet.java:17)
	at org.joda.time.convert.ConverterManager.getInstantConverter(ConverterManager.java:160)
	at org.joda.time.DateTimeComparator.compare(DateTimeComparator.java:192)
	at org.joda.time.TestDateTimeComparator.testMinute(TestDateTimeComparator.java:450)

testHour(org.joda.time.TestDateTimeComparator)  Time elapsed: 0 sec  <<< ERROR!
java.lang.ArrayIndexOutOfBoundsException: 16
	at org.joda.time.convert.ConverterSet.select(ConverterSet.java:17)
	at org.joda.time.convert.ConverterManager.getInstantConverter(ConverterManager.java:160)
	at org.joda.time.DateTimeComparator.compare(DateTimeComparator.java:192)
	at org.joda.time.TestDateTimeComparator.testHour(TestDateTimeComparator.java:464)

testDOW(org.joda.time.TestDateTimeComparator)  Time elapsed: 0.001 sec  <<< ERROR!
java.lang.ArrayIndexOutOfBoundsException: 16
	at org.joda.time.convert.ConverterSet.select(ConverterSet.java:17)
	at org.joda.time.convert.ConverterManager.getInstantConverter(ConverterManager.java:160)
	at org.joda.time.DateTimeComparator.compare(DateTimeComparator.java:192)
	at org.joda.time.TestDateTimeComparator.testDOW(TestDateTimeComparator.java:486)

testDOM(org.joda.time.TestDateTimeComparator)  Time elapsed: 0.001 sec  <<< ERROR!
java.lang.ArrayIndexOutOfBoundsException: 16
	at org.joda.time.convert.ConverterSet.select(ConverterSet.java:17)
	at org.joda.time.convert.ConverterManager.getInstantConverter(ConverterManager.java:160)
	at org.joda.time.DateTimeComparator.compare(DateTimeComparator.java:192)
	at org.joda.time.TestDateTimeComparator.testDOM(TestDateTimeComparator.java:496)

testDOY(org.joda.time.TestDateTimeComparator)  Time elapsed: 0 sec  <<< ERROR!
java.lang.ArrayIndexOutOfBoundsException: 16
	at org.joda.time.convert.ConverterSet.select(ConverterSet.java:17)
	at org.joda.time.convert.ConverterManager.getInstantConverter(ConverterManager.java:160)
	at org.joda.time.DateTimeComparator.compare(DateTimeComparator.java:192)
	at org.joda.time.TestDateTimeComparator.testDOY(TestDateTimeComparator.java:510)

testWOW(org.joda.time.TestDateTimeComparator)  Time elapsed: 0.001 sec  <<< ERROR!
java.lang.ArrayIndexOutOfBoundsException: 16
	at org.joda.time.convert.ConverterSet.select(ConverterSet.java:17)
	at org.joda.time.convert.ConverterManager.getInstantConverter(ConverterManager.java:160)
	at org.joda.time.DateTimeComparator.compare(DateTimeComparator.java:192)
	at org.joda.time.TestDateTimeComparator.testWOW(TestDateTimeComparator.java:525)

testWOYY(org.joda.time.TestDateTimeComparator)  Time elapsed: 0.001 sec  <<< ERROR!
java.lang.ArrayIndexOutOfBoundsException: 16
	at org.joda.time.convert.ConverterSet.select(ConverterSet.java:17)
	at org.joda.time.convert.ConverterManager.getInstantConverter(ConverterManager.java:160)
	at org.joda.time.DateTimeComparator.compare(DateTimeComparator.java:192)
	at org.joda.time.TestDateTimeComparator.testWOYY(TestDateTimeComparator.java:545)

testMonth(org.joda.time.TestDateTimeComparator)  Time elapsed: 0 sec  <<< ERROR!
java.lang.ArrayIndexOutOfBoundsException: 16
	at org.joda.time.convert.ConverterSet.select(ConverterSet.java:17)
	at org.joda.time.convert.ConverterManager.getInstantConverter(ConverterManager.java:160)
	at org.joda.time.DateTimeComparator.compare(DateTimeComparator.java:192)
	at org.joda.time.TestDateTimeComparator.testMonth(TestDateTimeComparator.java:557)

testYear(org.joda.time.TestDateTimeComparator)  Time elapsed: 0.001 sec  <<< ERROR!
java.lang.ArrayIndexOutOfBoundsException: 16
	at org.joda.time.convert.ConverterSet.select(ConverterSet.java:17)
	at org.joda.time.convert.ConverterManager.getInstantConverter(ConverterManager.java:160)
	at org.joda.time.DateTimeComparator.compare(DateTimeComparator.java:192)
	at org.joda.time.TestDateTimeComparator.testYear(TestDateTimeComparator.java:571)

testListMillis(org.joda.time.TestDateTimeComparator)  Time elapsed: 0 sec  <<< ERROR!
java.lang.ArrayIndexOutOfBoundsException: 16
	at org.joda.time.convert.ConverterSet.select(ConverterSet.java:17)
	at org.joda.time.convert.ConverterManager.getInstantConverter(ConverterManager.java:160)
	at org.joda.time.DateTimeComparator.compare(DateTimeComparator.java:192)
	at java.util.TimSort.countRunAndMakeAscending(TimSort.java:324)
	at java.util.TimSort.sort(TimSort.java:189)
	at java.util.TimSort.sort(TimSort.java:173)
	at java.util.Arrays.sort(Arrays.java:659)
	at java.util.Collections.sort(Collections.java:217)
	at org.joda.time.TestDateTimeComparator.testListMillis(TestDateTimeComparator.java:618)

testListSecond(org.joda.time.TestDateTimeComparator)  Time elapsed: 0.001 sec  <<< ERROR!
java.lang.ArrayIndexOutOfBoundsException: 16
	at org.joda.time.convert.ConverterSet.select(ConverterSet.java:17)
	at org.joda.time.convert.ConverterManager.getInstantConverter(ConverterManager.java:160)
	at org.joda.time.DateTimeComparator.compare(DateTimeComparator.java:192)
	at java.util.TimSort.countRunAndMakeAscending(TimSort.java:324)
	at java.util.TimSort.sort(TimSort.java:189)
	at java.util.TimSort.sort(TimSort.java:173)
	at java.util.Arrays.sort(Arrays.java:659)
	at java.util.Collections.sort(Collections.java:217)
	at org.joda.time.TestDateTimeComparator.testListSecond(TestDateTimeComparator.java:640)

testListMinute(org.joda.time.TestDateTimeComparator)  Time elapsed: 0.001 sec  <<< ERROR!
java.lang.ArrayIndexOutOfBoundsException: 16
	at org.joda.time.convert.ConverterSet.select(ConverterSet.java:17)
	at org.joda.time.convert.ConverterManager.getInstantConverter(ConverterManager.java:160)
	at org.joda.time.DateTimeComparator.compare(DateTimeComparator.java:192)
	at java.util.TimSort.countRunAndMakeAscending(TimSort.java:324)
	at java.util.TimSort.sort(TimSort.java:189)
	at java.util.TimSort.sort(TimSort.java:173)
	at java.util.Arrays.sort(Arrays.java:659)
	at java.util.Collections.sort(Collections.java:217)
	at org.joda.time.TestDateTimeComparator.testListMinute(TestDateTimeComparator.java:661)

testListHour(org.joda.time.TestDateTimeComparator)  Time elapsed: 0.001 sec  <<< ERROR!
java.lang.ArrayIndexOutOfBoundsException: 16
	at org.joda.time.convert.ConverterSet.select(ConverterSet.java:17)
	at org.joda.time.convert.ConverterManager.getInstantConverter(ConverterManager.java:160)
	at org.joda.time.DateTimeComparator.compare(DateTimeComparator.java:192)
	at java.util.TimSort.countRunAndMakeAscending(TimSort.java:324)
	at java.util.TimSort.sort(TimSort.java:189)
	at java.util.TimSort.sort(TimSort.java:173)
	at java.util.Arrays.sort(Arrays.java:659)
	at java.util.Collections.sort(Collections.java:217)
	at org.joda.time.TestDateTimeComparator.testListHour(TestDateTimeComparator.java:682)

testListDOW(org.joda.time.TestDateTimeComparator)  Time elapsed: 0.001 sec  <<< ERROR!
java.lang.ArrayIndexOutOfBoundsException: 16
	at org.joda.time.convert.ConverterSet.select(ConverterSet.java:17)
	at org.joda.time.convert.ConverterManager.getInstantConverter(ConverterManager.java:160)
	at org.joda.time.DateTimeComparator.compare(DateTimeComparator.java:192)
	at java.util.TimSort.countRunAndMakeAscending(TimSort.java:324)
	at java.util.TimSort.sort(TimSort.java:189)
	at java.util.TimSort.sort(TimSort.java:173)
	at java.util.Arrays.sort(Arrays.java:659)
	at java.util.Collections.sort(Collections.java:217)
	at org.joda.time.TestDateTimeComparator.testListDOW(TestDateTimeComparator.java:705)

testListDOM(org.joda.time.TestDateTimeComparator)  Time elapsed: 0.001 sec  <<< ERROR!
java.lang.ArrayIndexOutOfBoundsException: 16
	at org.joda.time.convert.ConverterSet.select(ConverterSet.java:17)
	at org.joda.time.convert.ConverterManager.getInstantConverter(ConverterManager.java:160)
	at org.joda.time.DateTimeComparator.compare(DateTimeComparator.java:192)
	at java.util.TimSort.countRunAndMakeAscending(TimSort.java:324)
	at java.util.TimSort.sort(TimSort.java:189)
	at java.util.TimSort.sort(TimSort.java:173)
	at java.util.Arrays.sort(Arrays.java:659)
	at java.util.Collections.sort(Collections.java:217)
	at org.joda.time.TestDateTimeComparator.testListDOM(TestDateTimeComparator.java:727)

testListDOY(org.joda.time.TestDateTimeComparator)  Time elapsed: 0.001 sec  <<< ERROR!
java.lang.ArrayIndexOutOfBoundsException: 16
	at org.joda.time.convert.ConverterSet.select(ConverterSet.java:17)
	at org.joda.time.convert.ConverterManager.getInstantConverter(ConverterManager.java:160)
	at org.joda.time.DateTimeComparator.compare(DateTimeComparator.java:192)
	at java.util.TimSort.countRunAndMakeAscending(TimSort.java:324)
	at java.util.TimSort.sort(TimSort.java:189)
	at java.util.TimSort.sort(TimSort.java:173)
	at java.util.Arrays.sort(Arrays.java:659)
	at java.util.Collections.sort(Collections.java:217)
	at org.joda.time.TestDateTimeComparator.testListDOY(TestDateTimeComparator.java:748)

testListWOW(org.joda.time.TestDateTimeComparator)  Time elapsed: 0.001 sec  <<< ERROR!
java.lang.ArrayIndexOutOfBoundsException: 16
	at org.joda.time.convert.ConverterSet.select(ConverterSet.java:17)
	at org.joda.time.convert.ConverterManager.getInstantConverter(ConverterManager.java:160)
	at org.joda.time.DateTimeComparator.compare(DateTimeComparator.java:192)
	at java.util.TimSort.countRunAndMakeAscending(TimSort.java:324)
	at java.util.TimSort.sort(TimSort.java:189)
	at java.util.TimSort.sort(TimSort.java:173)
	at java.util.Arrays.sort(Arrays.java:659)
	at java.util.Collections.sort(Collections.java:217)
	at org.joda.time.TestDateTimeComparator.testListWOW(TestDateTimeComparator.java:769)

testListYOYY(org.joda.time.TestDateTimeComparator)  Time elapsed: 0.001 sec  <<< ERROR!
java.lang.ArrayIndexOutOfBoundsException: 16
	at org.joda.time.convert.ConverterSet.select(ConverterSet.java:17)
	at org.joda.time.convert.ConverterManager.getInstantConverter(ConverterManager.java:160)
	at org.joda.time.DateTimeComparator.compare(DateTimeComparator.java:192)
	at java.util.TimSort.countRunAndMakeAscending(TimSort.java:324)
	at java.util.TimSort.sort(TimSort.java:189)
	at java.util.TimSort.sort(TimSort.java:173)
	at java.util.Arrays.sort(Arrays.java:659)
	at java.util.Collections.sort(Collections.java:217)
	at org.joda.time.TestDateTimeComparator.testListYOYY(TestDateTimeComparator.java:786)

testListMonth(org.joda.time.TestDateTimeComparator)  Time elapsed: 0.001 sec  <<< ERROR!
java.lang.ArrayIndexOutOfBoundsException: 16
	at org.joda.time.convert.ConverterSet.select(ConverterSet.java:17)
	at org.joda.time.convert.ConverterManager.getInstantConverter(ConverterManager.java:160)
	at org.joda.time.DateTimeComparator.compare(DateTimeComparator.java:192)
	at java.util.TimSort.countRunAndMakeAscending(TimSort.java:324)
	at java.util.TimSort.sort(TimSort.java:189)
	at java.util.TimSort.sort(TimSort.java:173)
	at java.util.Arrays.sort(Arrays.java:659)
	at java.util.Collections.sort(Collections.java:217)
	at org.joda.time.TestDateTimeComparator.testListMonth(TestDateTimeComparator.java:808)

testListYear(org.joda.time.TestDateTimeComparator)  Time elapsed: 0.001 sec  <<< ERROR!
java.lang.ArrayIndexOutOfBoundsException: 16
	at org.joda.time.convert.ConverterSet.select(ConverterSet.java:17)
	at org.joda.time.convert.ConverterManager.getInstantConverter(ConverterManager.java:160)
	at org.joda.time.DateTimeComparator.compare(DateTimeComparator.java:192)
	at java.util.TimSort.countRunAndMakeAscending(TimSort.java:324)
	at java.util.TimSort.sort(TimSort.java:189)
	at java.util.TimSort.sort(TimSort.java:173)
	at java.util.Arrays.sort(Arrays.java:659)
	at java.util.Collections.sort(Collections.java:217)
	at org.joda.time.TestDateTimeComparator.testListYear(TestDateTimeComparator.java:829)

testListDate(org.joda.time.TestDateTimeComparator)  Time elapsed: 0.001 sec  <<< ERROR!
java.lang.ArrayIndexOutOfBoundsException: 16
	at org.joda.time.convert.ConverterSet.select(ConverterSet.java:17)
	at org.joda.time.convert.ConverterManager.getInstantConverter(ConverterManager.java:160)
	at org.joda.time.DateTimeComparator.compare(DateTimeComparator.java:192)
	at java.util.TimSort.countRunAndMakeAscending(TimSort.java:324)
	at java.util.TimSort.sort(TimSort.java:189)
	at java.util.TimSort.sort(TimSort.java:173)
	at java.util.Arrays.sort(Arrays.java:659)
	at java.util.Collections.sort(Collections.java:217)
	at org.joda.time.TestDateTimeComparator.testListDate(TestDateTimeComparator.java:850)

testListTime(org.joda.time.TestDateTimeComparator)  Time elapsed: 0.001 sec  <<< ERROR!
java.lang.ArrayIndexOutOfBoundsException: 16
	at org.joda.time.convert.ConverterSet.select(ConverterSet.java:17)
	at org.joda.time.convert.ConverterManager.getInstantConverter(ConverterManager.java:160)
	at org.joda.time.DateTimeComparator.compare(DateTimeComparator.java:192)
	at java.util.TimSort.countRunAndMakeAscending(TimSort.java:324)
	at java.util.TimSort.sort(TimSort.java:189)
	at java.util.TimSort.sort(TimSort.java:173)
	at java.util.Arrays.sort(Arrays.java:659)
	at java.util.Collections.sort(Collections.java:217)
	at org.joda.time.TestDateTimeComparator.testListTime(TestDateTimeComparator.java:871)

testNullDT(org.joda.time.TestDateTimeComparator)  Time elapsed: 0.001 sec  <<< ERROR!
java.lang.ArrayIndexOutOfBoundsException: 16
	at org.joda.time.convert.ConverterSet.select(ConverterSet.java:17)
	at org.joda.time.convert.ConverterManager.getInstantConverter(ConverterManager.java:160)
	at org.joda.time.DateTimeComparator.compare(DateTimeComparator.java:196)
	at org.joda.time.TestDateTimeComparator.testNullDT(TestDateTimeComparator.java:883)

testPeriod(org.joda.time.TestStringConvert)  Time elapsed: 0.029 sec  <<< ERROR!
java.lang.ArrayIndexOutOfBoundsException: 17
	at org.joda.time.convert.ConverterSet.select(ConverterSet.java:17)
	at org.joda.time.convert.ConverterManager.getPeriodConverter(ConverterManager.java:421)
	at org.joda.time.base.BasePeriod.<init>(BasePeriod.java:272)
	at org.joda.time.Period.<init>(Period.java:674)
	at org.joda.time.base.AbstractPeriod.toPeriod(AbstractPeriod.java:147)
	at org.joda.time.format.PeriodFormatter.parsePeriod(PeriodFormatter.java:308)
	at org.joda.time.Period.parse(Period.java:92)
	at org.joda.time.Period.parse(Period.java:81)
	at sun.reflect.NativeMethodAccessorImpl.invoke0(Native Method)
	at sun.reflect.NativeMethodAccessorImpl.invoke(NativeMethodAccessorImpl.java:57)
	at sun.reflect.DelegatingMethodAccessorImpl.invoke(DelegatingMethodAccessorImpl.java:43)
	at java.lang.reflect.Method.invoke(Method.java:606)
	at org.joda.convert.MethodsStringConverter.convertFromString(MethodsStringConverter.java:70)
	at org.joda.convert.StringConvert.convertFromString(StringConvert.java:163)
	at org.joda.time.TestStringConvert.testPeriod(TestStringConvert.java:144)

testMutablePeriod(org.joda.time.TestStringConvert)  Time elapsed: 0.001 sec  <<< ERROR!
java.lang.ArrayIndexOutOfBoundsException: 17
	at org.joda.time.convert.ConverterSet.select(ConverterSet.java:17)
	at org.joda.time.convert.ConverterManager.getPeriodConverter(ConverterManager.java:421)
	at org.joda.time.base.BasePeriod.<init>(BasePeriod.java:272)
	at org.joda.time.Period.<init>(Period.java:674)
	at org.joda.time.base.AbstractPeriod.toPeriod(AbstractPeriod.java:147)
	at org.joda.time.format.PeriodFormatter.parsePeriod(PeriodFormatter.java:308)
	at org.joda.time.MutablePeriod.parse(MutablePeriod.java:85)
	at org.joda.time.MutablePeriod.parse(MutablePeriod.java:74)
	at sun.reflect.NativeMethodAccessorImpl.invoke0(Native Method)
	at sun.reflect.NativeMethodAccessorImpl.invoke(NativeMethodAccessorImpl.java:57)
	at sun.reflect.DelegatingMethodAccessorImpl.invoke(DelegatingMethodAccessorImpl.java:43)
	at java.lang.reflect.Method.invoke(Method.java:606)
	at org.joda.convert.MethodsStringConverter.convertFromString(MethodsStringConverter.java:70)
	at org.joda.convert.StringConvert.convertFromString(StringConvert.java:163)
	at org.joda.time.TestStringConvert.testMutablePeriod(TestStringConvert.java:151)

testYears(org.joda.time.TestStringConvert)  Time elapsed: 0.001 sec  <<< ERROR!
java.lang.ArrayIndexOutOfBoundsException: 17
	at org.joda.time.convert.ConverterSet.select(ConverterSet.java:17)
	at org.joda.time.convert.ConverterManager.getPeriodConverter(ConverterManager.java:421)
	at org.joda.time.base.BasePeriod.<init>(BasePeriod.java:272)
	at org.joda.time.Period.<init>(Period.java:674)
	at org.joda.time.base.AbstractPeriod.toPeriod(AbstractPeriod.java:147)
	at org.joda.time.format.PeriodFormatter.parsePeriod(PeriodFormatter.java:308)
	at org.joda.time.Years.parseYears(Years.java:162)
	at sun.reflect.NativeMethodAccessorImpl.invoke0(Native Method)
	at sun.reflect.NativeMethodAccessorImpl.invoke(NativeMethodAccessorImpl.java:57)
	at sun.reflect.DelegatingMethodAccessorImpl.invoke(DelegatingMethodAccessorImpl.java:43)
	at java.lang.reflect.Method.invoke(Method.java:606)
	at org.joda.convert.MethodsStringConverter.convertFromString(MethodsStringConverter.java:70)
	at org.joda.convert.StringConvert.convertFromString(StringConvert.java:163)
	at org.joda.time.TestStringConvert.testYears(TestStringConvert.java:158)

testMonths(org.joda.time.TestStringConvert)  Time elapsed: 0.001 sec  <<< ERROR!
java.lang.ArrayIndexOutOfBoundsException: 17
	at org.joda.time.convert.ConverterSet.select(ConverterSet.java:17)
	at org.joda.time.convert.ConverterManager.getPeriodConverter(ConverterManager.java:421)
	at org.joda.time.base.BasePeriod.<init>(BasePeriod.java:272)
	at org.joda.time.Period.<init>(Period.java:674)
	at org.joda.time.base.AbstractPeriod.toPeriod(AbstractPeriod.java:147)
	at org.joda.time.format.PeriodFormatter.parsePeriod(PeriodFormatter.java:308)
	at org.joda.time.Months.parseMonths(Months.java:198)
	at sun.reflect.NativeMethodAccessorImpl.invoke0(Native Method)
	at sun.reflect.NativeMethodAccessorImpl.invoke(NativeMethodAccessorImpl.java:57)
	at sun.reflect.DelegatingMethodAccessorImpl.invoke(DelegatingMethodAccessorImpl.java:43)
	at java.lang.reflect.Method.invoke(Method.java:606)
	at org.joda.convert.MethodsStringConverter.convertFromString(MethodsStringConverter.java:70)
	at org.joda.convert.StringConvert.convertFromString(StringConvert.java:163)
	at org.joda.time.TestStringConvert.testMonths(TestStringConvert.java:165)

testWeeks(org.joda.time.TestStringConvert)  Time elapsed: 0.001 sec  <<< ERROR!
java.lang.ArrayIndexOutOfBoundsException: 17
	at org.joda.time.convert.ConverterSet.select(ConverterSet.java:17)
	at org.joda.time.convert.ConverterManager.getPeriodConverter(ConverterManager.java:421)
	at org.joda.time.base.BasePeriod.<init>(BasePeriod.java:272)
	at org.joda.time.Period.<init>(Period.java:674)
	at org.joda.time.base.AbstractPeriod.toPeriod(AbstractPeriod.java:147)
	at org.joda.time.format.PeriodFormatter.parsePeriod(PeriodFormatter.java:308)
	at org.joda.time.Weeks.parseWeeks(Weeks.java:185)
	at sun.reflect.NativeMethodAccessorImpl.invoke0(Native Method)
	at sun.reflect.NativeMethodAccessorImpl.invoke(NativeMethodAccessorImpl.java:57)
	at sun.reflect.DelegatingMethodAccessorImpl.invoke(DelegatingMethodAccessorImpl.java:43)
	at java.lang.reflect.Method.invoke(Method.java:606)
	at org.joda.convert.MethodsStringConverter.convertFromString(MethodsStringConverter.java:70)
	at org.joda.convert.StringConvert.convertFromString(StringConvert.java:163)
	at org.joda.time.TestStringConvert.testWeeks(TestStringConvert.java:172)

testDays(org.joda.time.TestStringConvert)  Time elapsed: 0.001 sec  <<< ERROR!
java.lang.ArrayIndexOutOfBoundsException: 17
	at org.joda.time.convert.ConverterSet.select(ConverterSet.java:17)
	at org.joda.time.convert.ConverterManager.getPeriodConverter(ConverterManager.java:421)
	at org.joda.time.base.BasePeriod.<init>(BasePeriod.java:272)
	at org.joda.time.Period.<init>(Period.java:674)
	at org.joda.time.base.AbstractPeriod.toPeriod(AbstractPeriod.java:147)
	at org.joda.time.format.PeriodFormatter.parsePeriod(PeriodFormatter.java:308)
	at org.joda.time.Days.parseDays(Days.java:203)
	at sun.reflect.NativeMethodAccessorImpl.invoke0(Native Method)
	at sun.reflect.NativeMethodAccessorImpl.invoke(NativeMethodAccessorImpl.java:57)
	at sun.reflect.DelegatingMethodAccessorImpl.invoke(DelegatingMethodAccessorImpl.java:43)
	at java.lang.reflect.Method.invoke(Method.java:606)
	at org.joda.convert.MethodsStringConverter.convertFromString(MethodsStringConverter.java:70)
	at org.joda.convert.StringConvert.convertFromString(StringConvert.java:163)
	at org.joda.time.TestStringConvert.testDays(TestStringConvert.java:179)

testHours(org.joda.time.TestStringConvert)  Time elapsed: 0 sec  <<< ERROR!
java.lang.ArrayIndexOutOfBoundsException: 17
	at org.joda.time.convert.ConverterSet.select(ConverterSet.java:17)
	at org.joda.time.convert.ConverterManager.getPeriodConverter(ConverterManager.java:421)
	at org.joda.time.base.BasePeriod.<init>(BasePeriod.java:272)
	at org.joda.time.Period.<init>(Period.java:674)
	at org.joda.time.base.AbstractPeriod.toPeriod(AbstractPeriod.java:147)
	at org.joda.time.format.PeriodFormatter.parsePeriod(PeriodFormatter.java:308)
	at org.joda.time.Hours.parseHours(Hours.java:205)
	at sun.reflect.NativeMethodAccessorImpl.invoke0(Native Method)
	at sun.reflect.NativeMethodAccessorImpl.invoke(NativeMethodAccessorImpl.java:57)
	at sun.reflect.DelegatingMethodAccessorImpl.invoke(DelegatingMethodAccessorImpl.java:43)
	at java.lang.reflect.Method.invoke(Method.java:606)
	at org.joda.convert.MethodsStringConverter.convertFromString(MethodsStringConverter.java:70)
	at org.joda.convert.StringConvert.convertFromString(StringConvert.java:163)
	at org.joda.time.TestStringConvert.testHours(TestStringConvert.java:186)

testMinutes(org.joda.time.TestStringConvert)  Time elapsed: 0.001 sec  <<< ERROR!
java.lang.ArrayIndexOutOfBoundsException: 17
	at org.joda.time.convert.ConverterSet.select(ConverterSet.java:17)
	at org.joda.time.convert.ConverterManager.getPeriodConverter(ConverterManager.java:421)
	at org.joda.time.base.BasePeriod.<init>(BasePeriod.java:272)
	at org.joda.time.Period.<init>(Period.java:674)
	at org.joda.time.base.AbstractPeriod.toPeriod(AbstractPeriod.java:147)
	at org.joda.time.format.PeriodFormatter.parsePeriod(PeriodFormatter.java:308)
	at org.joda.time.Minutes.parseMinutes(Minutes.java:185)
	at sun.reflect.NativeMethodAccessorImpl.invoke0(Native Method)
	at sun.reflect.NativeMethodAccessorImpl.invoke(NativeMethodAccessorImpl.java:57)
	at sun.reflect.DelegatingMethodAccessorImpl.invoke(DelegatingMethodAccessorImpl.java:43)
	at java.lang.reflect.Method.invoke(Method.java:606)
	at org.joda.convert.MethodsStringConverter.convertFromString(MethodsStringConverter.java:70)
	at org.joda.convert.StringConvert.convertFromString(StringConvert.java:163)
	at org.joda.time.TestStringConvert.testMinutes(TestStringConvert.java:193)

testSeconds(org.joda.time.TestStringConvert)  Time elapsed: 0.001 sec  <<< ERROR!
java.lang.ArrayIndexOutOfBoundsException: 17
	at org.joda.time.convert.ConverterSet.select(ConverterSet.java:17)
	at org.joda.time.convert.ConverterManager.getPeriodConverter(ConverterManager.java:421)
	at org.joda.time.base.BasePeriod.<init>(BasePeriod.java:272)
	at org.joda.time.Period.<init>(Period.java:674)
	at org.joda.time.base.AbstractPeriod.toPeriod(AbstractPeriod.java:147)
	at org.joda.time.format.PeriodFormatter.parsePeriod(PeriodFormatter.java:308)
	at org.joda.time.Seconds.parseSeconds(Seconds.java:185)
	at sun.reflect.NativeMethodAccessorImpl.invoke0(Native Method)
	at sun.reflect.NativeMethodAccessorImpl.invoke(NativeMethodAccessorImpl.java:57)
	at sun.reflect.DelegatingMethodAccessorImpl.invoke(DelegatingMethodAccessorImpl.java:43)
	at java.lang.reflect.Method.invoke(Method.java:606)
	at org.joda.convert.MethodsStringConverter.convertFromString(MethodsStringConverter.java:70)
	at org.joda.convert.StringConvert.convertFromString(StringConvert.java:163)
	at org.joda.time.TestStringConvert.testSeconds(TestStringConvert.java:200)

testGetPartialConverterOKMultipleMatches(org.joda.time.convert.TestConverterManager)  Time elapsed: 0.001 sec  <<< ERROR!
java.lang.ArrayIndexOutOfBoundsException: 16
	at org.joda.time.convert.ConverterSet.select(ConverterSet.java:17)
	at org.joda.time.convert.ConverterManager.getPartialConverter(ConverterManager.java:247)
	at org.joda.time.convert.TestConverterManager.testGetPartialConverterOKMultipleMatches(TestConverterManager.java:384)

testGetPartialConverterBadMultipleMatches(org.joda.time.convert.TestConverterManager)  Time elapsed: 0.001 sec  <<< ERROR!
java.lang.ArrayIndexOutOfBoundsException: 16
	at org.joda.time.convert.ConverterSet.select(ConverterSet.java:17)
	at org.joda.time.convert.ConverterManager.getPartialConverter(ConverterManager.java:247)
	at org.joda.time.convert.TestConverterManager.testGetPartialConverterBadMultipleMatches(TestConverterManager.java:404)

testAddPartialConverter1(org.joda.time.convert.TestConverterManager)  Time elapsed: 0.001 sec  <<< ERROR!
java.lang.ArrayIndexOutOfBoundsException: 17
	at org.joda.time.convert.ConverterSet.select(ConverterSet.java:17)
	at org.joda.time.convert.ConverterManager.getPartialConverter(ConverterManager.java:247)
	at org.joda.time.convert.TestConverterManager.testAddPartialConverter1(TestConverterManager.java:433)

testGetDurationConverter(org.joda.time.convert.TestConverterManager)  Time elapsed: 0 sec  <<< ERROR!
java.lang.ArrayIndexOutOfBoundsException: 16
	at org.joda.time.convert.ConverterSet.select(ConverterSet.java:17)
	at org.joda.time.convert.ConverterManager.getDurationConverter(ConverterManager.java:334)
	at org.joda.time.convert.TestConverterManager.testGetDurationConverter(TestConverterManager.java:544)

testAddDurationConverter1(org.joda.time.convert.TestConverterManager)  Time elapsed: 0.001 sec  <<< ERROR!
java.lang.ArrayIndexOutOfBoundsException: 17
	at org.joda.time.convert.ConverterSet.select(ConverterSet.java:17)
	at org.joda.time.convert.ConverterManager.getDurationConverter(ConverterManager.java:334)
	at org.joda.time.convert.TestConverterManager.testAddDurationConverter1(TestConverterManager.java:593)

testGetPeriodConverter(org.joda.time.convert.TestConverterManager)  Time elapsed: 0 sec  <<< ERROR!
java.lang.ArrayIndexOutOfBoundsException: 17
	at org.joda.time.convert.ConverterSet.select(ConverterSet.java:17)
	at org.joda.time.convert.ConverterManager.getPeriodConverter(ConverterManager.java:421)
	at org.joda.time.convert.TestConverterManager.testGetPeriodConverter(TestConverterManager.java:708)

testAddPeriodConverter1(org.joda.time.convert.TestConverterManager)  Time elapsed: 0.001 sec  <<< ERROR!
java.lang.ArrayIndexOutOfBoundsException: 17
	at org.joda.time.convert.ConverterSet.select(ConverterSet.java:17)
	at org.joda.time.convert.ConverterManager.getPeriodConverter(ConverterManager.java:421)
	at org.joda.time.convert.TestConverterManager.testAddPeriodConverter1(TestConverterManager.java:742)

testGetIntervalConverter(org.joda.time.convert.TestConverterManager)  Time elapsed: 0.001 sec  <<< ERROR!
java.lang.ArrayIndexOutOfBoundsException: 17
	at org.joda.time.convert.ConverterSet.select(ConverterSet.java:17)
	at org.joda.time.convert.ConverterManager.getIntervalConverter(ConverterManager.java:508)
	at org.joda.time.convert.TestConverterManager.testGetIntervalConverter(TestConverterManager.java:853)

testGetInstantConverterOKMultipleMatches(org.joda.time.convert.TestConverterManager)  Time elapsed: 0.001 sec  <<< ERROR!
java.lang.ArrayIndexOutOfBoundsException: 16
	at org.joda.time.convert.ConverterSet.select(ConverterSet.java:17)
	at org.joda.time.convert.ConverterManager.getInstantConverter(ConverterManager.java:160)
	at org.joda.time.convert.TestConverterManager.testGetInstantConverterOKMultipleMatches(TestConverterManager.java:178)

testGetInstantConverterBadMultipleMatches(org.joda.time.convert.TestConverterManager)  Time elapsed: 0.001 sec  <<< ERROR!
java.lang.ArrayIndexOutOfBoundsException: 16
	at org.joda.time.convert.ConverterSet.select(ConverterSet.java:17)
	at org.joda.time.convert.ConverterManager.getInstantConverter(ConverterManager.java:160)
	at org.joda.time.convert.TestConverterManager.testGetInstantConverterBadMultipleMatches(TestConverterManager.java:197)

testAddInstantConverter1(org.joda.time.convert.TestConverterManager)  Time elapsed: 0.001 sec  <<< ERROR!
java.lang.ArrayIndexOutOfBoundsException: 17
	at org.joda.time.convert.ConverterSet.select(ConverterSet.java:17)
	at org.joda.time.convert.ConverterManager.getInstantConverter(ConverterManager.java:160)
	at org.joda.time.convert.TestConverterManager.testAddInstantConverter1(TestConverterManager.java:225)

testGetPartialConverter(org.joda.time.convert.TestConverterManager)  Time elapsed: 0.001 sec  <<< ERROR!
java.lang.ArrayIndexOutOfBoundsException: 16
	at org.joda.time.convert.ConverterSet.select(ConverterSet.java:17)
	at org.joda.time.convert.ConverterManager.getPartialConverter(ConverterManager.java:247)
	at org.joda.time.convert.TestConverterManager.testGetPartialConverter(TestConverterManager.java:334)

testAddIntervalConverter1(org.joda.time.convert.TestConverterManager)  Time elapsed: 0.001 sec  <<< ERROR!
java.lang.ArrayIndexOutOfBoundsException: 17
	at org.joda.time.convert.ConverterSet.select(ConverterSet.java:17)
	at org.joda.time.convert.ConverterManager.getIntervalConverter(ConverterManager.java:508)
	at org.joda.time.convert.TestConverterManager.testAddIntervalConverter1(TestConverterManager.java:891)

testGetInstantConverter(org.joda.time.convert.TestConverterManager)  Time elapsed: 0.001 sec  <<< ERROR!
java.lang.ArrayIndexOutOfBoundsException: 16
	at org.joda.time.convert.ConverterSet.select(ConverterSet.java:17)
	at org.joda.time.convert.ConverterManager.getInstantConverter(ConverterManager.java:160)
	at org.joda.time.convert.TestConverterManager.testGetInstantConverter(TestConverterManager.java:132)

testBigHashtable(org.joda.time.convert.TestConverterSet)  Time elapsed: 0.001 sec  <<< ERROR!
java.lang.ArrayIndexOutOfBoundsException: 17
	at org.joda.time.convert.ConverterSet.select(ConverterSet.java:17)
	at org.joda.time.convert.TestConverterSet.testBigHashtable(TestConverterSet.java:92)

testSetIntoIntervalEx_Object_Chronology5(org.joda.time.convert.TestStringConverter)  Time elapsed: 0.001 sec  <<< ERROR!
java.lang.ArrayIndexOutOfBoundsException: 17
	at org.joda.time.convert.ConverterSet.select(ConverterSet.java:17)
	at org.joda.time.convert.ConverterManager.getPeriodConverter(ConverterManager.java:421)
	at org.joda.time.base.BasePeriod.<init>(BasePeriod.java:272)
	at org.joda.time.Period.<init>(Period.java:674)
	at org.joda.time.base.AbstractPeriod.toPeriod(AbstractPeriod.java:147)
	at org.joda.time.format.PeriodFormatter.parsePeriod(PeriodFormatter.java:308)
	at org.joda.time.convert.StringConverter.setInto(StringConverter.java:210)
	at org.joda.time.convert.TestStringConverter.testSetIntoIntervalEx_Object_Chronology5(TestStringConverter.java:573)

testSetIntoInterval_Object_Chronology1(org.joda.time.convert.TestStringConverter)  Time elapsed: 0.001 sec  <<< ERROR!
java.lang.ArrayIndexOutOfBoundsException: 17
	at org.joda.time.convert.ConverterSet.select(ConverterSet.java:17)
	at org.joda.time.convert.ConverterManager.getPeriodConverter(ConverterManager.java:421)
	at org.joda.time.base.BasePeriod.<init>(BasePeriod.java:272)
	at org.joda.time.Period.<init>(Period.java:674)
	at org.joda.time.base.AbstractPeriod.toPeriod(AbstractPeriod.java:147)
	at org.joda.time.format.PeriodFormatter.parsePeriod(PeriodFormatter.java:308)
	at org.joda.time.convert.StringConverter.setInto(StringConverter.java:223)
	at org.joda.time.convert.TestStringConverter.testSetIntoInterval_Object_Chronology1(TestStringConverter.java:476)

testSetIntoInterval_Object_Chronology2(org.joda.time.convert.TestStringConverter)  Time elapsed: 0 sec  <<< ERROR!
java.lang.ArrayIndexOutOfBoundsException: 17
	at org.joda.time.convert.ConverterSet.select(ConverterSet.java:17)
	at org.joda.time.convert.ConverterManager.getPeriodConverter(ConverterManager.java:421)
	at org.joda.time.base.BasePeriod.<init>(BasePeriod.java:272)
	at org.joda.time.Period.<init>(Period.java:674)
	at org.joda.time.base.AbstractPeriod.toPeriod(AbstractPeriod.java:147)
	at org.joda.time.format.PeriodFormatter.parsePeriod(PeriodFormatter.java:308)
	at org.joda.time.convert.StringConverter.setInto(StringConverter.java:210)
	at org.joda.time.convert.TestStringConverter.testSetIntoInterval_Object_Chronology2(TestStringConverter.java:484)

testSetIntoInterval_Object_Chronology4(org.joda.time.convert.TestStringConverter)  Time elapsed: 0 sec  <<< ERROR!
java.lang.ArrayIndexOutOfBoundsException: 17
	at org.joda.time.convert.ConverterSet.select(ConverterSet.java:17)
	at org.joda.time.convert.ConverterManager.getPeriodConverter(ConverterManager.java:421)
	at org.joda.time.base.BasePeriod.<init>(BasePeriod.java:272)
	at org.joda.time.Period.<init>(Period.java:674)
	at org.joda.time.base.AbstractPeriod.toPeriod(AbstractPeriod.java:147)
	at org.joda.time.format.PeriodFormatter.parsePeriod(PeriodFormatter.java:308)
	at org.joda.time.convert.StringConverter.setInto(StringConverter.java:223)
	at org.joda.time.convert.TestStringConverter.testSetIntoInterval_Object_Chronology4(TestStringConverter.java:500)

testSetIntoInterval_Object_Chronology5(org.joda.time.convert.TestStringConverter)  Time elapsed: 0.001 sec  <<< ERROR!
java.lang.ArrayIndexOutOfBoundsException: 17
	at org.joda.time.convert.ConverterSet.select(ConverterSet.java:17)
	at org.joda.time.convert.ConverterManager.getPeriodConverter(ConverterManager.java:421)
	at org.joda.time.base.BasePeriod.<init>(BasePeriod.java:272)
	at org.joda.time.Period.<init>(Period.java:674)
	at org.joda.time.base.AbstractPeriod.toPeriod(AbstractPeriod.java:147)
	at org.joda.time.format.PeriodFormatter.parsePeriod(PeriodFormatter.java:308)
	at org.joda.time.convert.StringConverter.setInto(StringConverter.java:210)
	at org.joda.time.convert.TestStringConverter.testSetIntoInterval_Object_Chronology5(TestStringConverter.java:508)

testPrinterParserMethods(org.joda.time.format.TestPeriodFormatter)  Time elapsed: 0.001 sec  <<< ERROR!
java.lang.ArrayIndexOutOfBoundsException: 17
	at org.joda.time.convert.ConverterSet.select(ConverterSet.java:17)
	at org.joda.time.convert.ConverterManager.getPeriodConverter(ConverterManager.java:421)
	at org.joda.time.base.BasePeriod.<init>(BasePeriod.java:272)
	at org.joda.time.Period.<init>(Period.java:674)
	at org.joda.time.base.AbstractPeriod.toPeriod(AbstractPeriod.java:147)
	at org.joda.time.format.PeriodFormatter.parsePeriod(PeriodFormatter.java:308)
	at org.joda.time.format.TestPeriodFormatter.testPrinterParserMethods(TestPeriodFormatter.java:161)

testParsePeriod_simple(org.joda.time.format.TestPeriodFormatter)  Time elapsed: 0 sec  <<< ERROR!
java.lang.ArrayIndexOutOfBoundsException: 17
	at org.joda.time.convert.ConverterSet.select(ConverterSet.java:17)
	at org.joda.time.convert.ConverterManager.getPeriodConverter(ConverterManager.java:421)
	at org.joda.time.base.BasePeriod.<init>(BasePeriod.java:272)
	at org.joda.time.Period.<init>(Period.java:674)
	at org.joda.time.base.AbstractPeriod.toPeriod(AbstractPeriod.java:147)
	at org.joda.time.format.PeriodFormatter.parsePeriod(PeriodFormatter.java:308)
	at org.joda.time.format.TestPeriodFormatter.testParsePeriod_simple(TestPeriodFormatter.java:189)

testParsePeriod_parseType(org.joda.time.format.TestPeriodFormatter)  Time elapsed: 0.001 sec  <<< ERROR!
java.lang.ArrayIndexOutOfBoundsException: 17
	at org.joda.time.convert.ConverterSet.select(ConverterSet.java:17)
	at org.joda.time.convert.ConverterManager.getPeriodConverter(ConverterManager.java:421)
	at org.joda.time.base.BasePeriod.<init>(BasePeriod.java:272)
	at org.joda.time.Period.<init>(Period.java:674)
	at org.joda.time.base.AbstractPeriod.toPeriod(AbstractPeriod.java:147)
	at org.joda.time.format.PeriodFormatter.parsePeriod(PeriodFormatter.java:308)
	at org.joda.time.format.TestPeriodFormatter.testParsePeriod_parseType(TestPeriodFormatter.java:199)

test_wordBased_pl_parseOneField(org.joda.time.format.TestPeriodFormat)  Time elapsed: 0.001 sec  <<< ERROR!
java.lang.ArrayIndexOutOfBoundsException: 17
	at org.joda.time.convert.ConverterSet.select(ConverterSet.java:17)
	at org.joda.time.convert.ConverterManager.getPeriodConverter(ConverterManager.java:421)
	at org.joda.time.base.BasePeriod.<init>(BasePeriod.java:272)
	at org.joda.time.Period.<init>(Period.java:674)
	at org.joda.time.base.AbstractPeriod.toPeriod(AbstractPeriod.java:147)
	at org.joda.time.format.PeriodFormatter.parsePeriod(PeriodFormatter.java:308)
	at org.joda.time.format.TestPeriodFormat.test_wordBased_pl_parseOneField(TestPeriodFormat.java:398)

test_wordBased_pl_parseTwoFields(org.joda.time.format.TestPeriodFormat)  Time elapsed: 0 sec  <<< ERROR!
java.lang.ArrayIndexOutOfBoundsException: 17
	at org.joda.time.convert.ConverterSet.select(ConverterSet.java:17)
	at org.joda.time.convert.ConverterManager.getPeriodConverter(ConverterManager.java:421)
	at org.joda.time.base.BasePeriod.<init>(BasePeriod.java:272)
	at org.joda.time.Period.<init>(Period.java:674)
	at org.joda.time.base.AbstractPeriod.toPeriod(AbstractPeriod.java:147)
	at org.joda.time.format.PeriodFormatter.parsePeriod(PeriodFormatter.java:308)
	at org.joda.time.format.TestPeriodFormat.test_wordBased_pl_parseTwoFields(TestPeriodFormat.java:404)

test_wordBased_en_withLocale_pt(org.joda.time.format.TestPeriodFormat)  Time elapsed: 0.001 sec  <<< ERROR!
java.lang.ArrayIndexOutOfBoundsException: 17
	at org.joda.time.convert.ConverterSet.select(ConverterSet.java:17)
	at org.joda.time.convert.ConverterManager.getPeriodConverter(ConverterManager.java:421)
	at org.joda.time.base.BasePeriod.<init>(BasePeriod.java:272)
	at org.joda.time.Period.<init>(Period.java:674)
	at org.joda.time.base.AbstractPeriod.toPeriod(AbstractPeriod.java:147)
	at org.joda.time.format.PeriodFormatter.parsePeriod(PeriodFormatter.java:308)
	at org.joda.time.format.TestPeriodFormat.test_wordBased_en_withLocale_pt(TestPeriodFormat.java:634)

test_wordBased_es_parseOneField(org.joda.time.format.TestPeriodFormat)  Time elapsed: 0 sec  <<< ERROR!
java.lang.ArrayIndexOutOfBoundsException: 17
	at org.joda.time.convert.ConverterSet.select(ConverterSet.java:17)
	at org.joda.time.convert.ConverterManager.getPeriodConverter(ConverterManager.java:421)
	at org.joda.time.base.BasePeriod.<init>(BasePeriod.java:272)
	at org.joda.time.Period.<init>(Period.java:674)
	at org.joda.time.base.AbstractPeriod.toPeriod(AbstractPeriod.java:147)
	at org.joda.time.format.PeriodFormatter.parsePeriod(PeriodFormatter.java:308)
	at org.joda.time.format.TestPeriodFormat.test_wordBased_es_parseOneField(TestPeriodFormat.java:226)

test_wordBased_es_parseTwoFields(org.joda.time.format.TestPeriodFormat)  Time elapsed: 0.001 sec  <<< ERROR!
java.lang.ArrayIndexOutOfBoundsException: 17
	at org.joda.time.convert.ConverterSet.select(ConverterSet.java:17)
	at org.joda.time.convert.ConverterManager.getPeriodConverter(ConverterManager.java:421)
	at org.joda.time.base.BasePeriod.<init>(BasePeriod.java:272)
	at org.joda.time.Period.<init>(Period.java:674)
	at org.joda.time.base.AbstractPeriod.toPeriod(AbstractPeriod.java:147)
	at org.joda.time.format.PeriodFormatter.parsePeriod(PeriodFormatter.java:308)
	at org.joda.time.format.TestPeriodFormat.test_wordBased_es_parseTwoFields(TestPeriodFormat.java:232)

test_wordBased_de_parseOneField(org.joda.time.format.TestPeriodFormat)  Time elapsed: 0 sec  <<< ERROR!
java.lang.ArrayIndexOutOfBoundsException: 17
	at org.joda.time.convert.ConverterSet.select(ConverterSet.java:17)
	at org.joda.time.convert.ConverterManager.getPeriodConverter(ConverterManager.java:421)
	at org.joda.time.base.BasePeriod.<init>(BasePeriod.java:272)
	at org.joda.time.Period.<init>(Period.java:674)
	at org.joda.time.base.AbstractPeriod.toPeriod(AbstractPeriod.java:147)
	at org.joda.time.format.PeriodFormatter.parsePeriod(PeriodFormatter.java:308)
	at org.joda.time.format.TestPeriodFormat.test_wordBased_de_parseOneField(TestPeriodFormat.java:263)

test_wordBased_de_parseTwoFields(org.joda.time.format.TestPeriodFormat)  Time elapsed: 0.001 sec  <<< ERROR!
java.lang.ArrayIndexOutOfBoundsException: 17
	at org.joda.time.convert.ConverterSet.select(ConverterSet.java:17)
	at org.joda.time.convert.ConverterManager.getPeriodConverter(ConverterManager.java:421)
	at org.joda.time.base.BasePeriod.<init>(BasePeriod.java:272)
	at org.joda.time.Period.<init>(Period.java:674)
	at org.joda.time.base.AbstractPeriod.toPeriod(AbstractPeriod.java:147)
	at org.joda.time.format.PeriodFormatter.parsePeriod(PeriodFormatter.java:308)
	at org.joda.time.format.TestPeriodFormat.test_wordBased_de_parseTwoFields(TestPeriodFormat.java:269)

test_wordBased_nl_parseOneField(org.joda.time.format.TestPeriodFormat)  Time elapsed: 0.001 sec  <<< ERROR!
java.lang.ArrayIndexOutOfBoundsException: 17
	at org.joda.time.convert.ConverterSet.select(ConverterSet.java:17)
	at org.joda.time.convert.ConverterManager.getPeriodConverter(ConverterManager.java:421)
	at org.joda.time.base.BasePeriod.<init>(BasePeriod.java:272)
	at org.joda.time.Period.<init>(Period.java:674)
	at org.joda.time.base.AbstractPeriod.toPeriod(AbstractPeriod.java:147)
	at org.joda.time.format.PeriodFormatter.parsePeriod(PeriodFormatter.java:308)
	at org.joda.time.format.TestPeriodFormat.test_wordBased_nl_parseOneField(TestPeriodFormat.java:300)

test_wordBased_nl_parseTwoFields(org.joda.time.format.TestPeriodFormat)  Time elapsed: 0 sec  <<< ERROR!
java.lang.ArrayIndexOutOfBoundsException: 17
	at org.joda.time.convert.ConverterSet.select(ConverterSet.java:17)
	at org.joda.time.convert.ConverterManager.getPeriodConverter(ConverterManager.java:421)
	at org.joda.time.base.BasePeriod.<init>(BasePeriod.java:272)
	at org.joda.time.Period.<init>(Period.java:674)
	at org.joda.time.base.AbstractPeriod.toPeriod(AbstractPeriod.java:147)
	at org.joda.time.format.PeriodFormatter.parsePeriod(PeriodFormatter.java:308)
	at org.joda.time.format.TestPeriodFormat.test_wordBased_nl_parseTwoFields(TestPeriodFormat.java:306)

test_wordBased_ja_parseOneField(org.joda.time.format.TestPeriodFormat)  Time elapsed: 0.001 sec  <<< ERROR!
java.lang.ArrayIndexOutOfBoundsException: 17
	at org.joda.time.convert.ConverterSet.select(ConverterSet.java:17)
	at org.joda.time.convert.ConverterManager.getPeriodConverter(ConverterManager.java:421)
	at org.joda.time.base.BasePeriod.<init>(BasePeriod.java:272)
	at org.joda.time.Period.<init>(Period.java:674)
	at org.joda.time.base.AbstractPeriod.toPeriod(AbstractPeriod.java:147)
	at org.joda.time.format.PeriodFormatter.parsePeriod(PeriodFormatter.java:308)
	at org.joda.time.format.TestPeriodFormat.test_wordBased_ja_parseOneField(TestPeriodFormat.java:355)

test_wordBased_ja_parseTwoFields(org.joda.time.format.TestPeriodFormat)  Time elapsed: 0 sec  <<< ERROR!
java.lang.ArrayIndexOutOfBoundsException: 17
	at org.joda.time.convert.ConverterSet.select(ConverterSet.java:17)
	at org.joda.time.convert.ConverterManager.getPeriodConverter(ConverterManager.java:421)
	at org.joda.time.base.BasePeriod.<init>(BasePeriod.java:272)
	at org.joda.time.Period.<init>(Period.java:674)
	at org.joda.time.base.AbstractPeriod.toPeriod(AbstractPeriod.java:147)
	at org.joda.time.format.PeriodFormatter.parsePeriod(PeriodFormatter.java:308)
	at org.joda.time.format.TestPeriodFormat.test_wordBased_ja_parseTwoFields(TestPeriodFormat.java:361)

test_getDefault_parseTwoFields(org.joda.time.format.TestPeriodFormat)  Time elapsed: 0.001 sec  <<< ERROR!
java.lang.ArrayIndexOutOfBoundsException: 17
	at org.joda.time.convert.ConverterSet.select(ConverterSet.java:17)
	at org.joda.time.convert.ConverterManager.getPeriodConverter(ConverterManager.java:421)
	at org.joda.time.base.BasePeriod.<init>(BasePeriod.java:272)
	at org.joda.time.Period.<init>(Period.java:674)
	at org.joda.time.base.AbstractPeriod.toPeriod(AbstractPeriod.java:147)
	at org.joda.time.format.PeriodFormatter.parsePeriod(PeriodFormatter.java:308)
	at org.joda.time.format.TestPeriodFormat.test_getDefault_parseTwoFields(TestPeriodFormat.java:103)

test_wordBased_fr_parseOneField(org.joda.time.format.TestPeriodFormat)  Time elapsed: 0 sec  <<< ERROR!
java.lang.ArrayIndexOutOfBoundsException: 17
	at org.joda.time.convert.ConverterSet.select(ConverterSet.java:17)
	at org.joda.time.convert.ConverterManager.getPeriodConverter(ConverterManager.java:421)
	at org.joda.time.base.BasePeriod.<init>(BasePeriod.java:272)
	at org.joda.time.Period.<init>(Period.java:674)
	at org.joda.time.base.AbstractPeriod.toPeriod(AbstractPeriod.java:147)
	at org.joda.time.format.PeriodFormatter.parsePeriod(PeriodFormatter.java:308)
	at org.joda.time.format.TestPeriodFormat.test_wordBased_fr_parseOneField(TestPeriodFormat.java:152)

test_wordBased_fr_parseTwoFields(org.joda.time.format.TestPeriodFormat)  Time elapsed: 0 sec  <<< ERROR!
java.lang.ArrayIndexOutOfBoundsException: 17
	at org.joda.time.convert.ConverterSet.select(ConverterSet.java:17)
	at org.joda.time.convert.ConverterManager.getPeriodConverter(ConverterManager.java:421)
	at org.joda.time.base.BasePeriod.<init>(BasePeriod.java:272)
	at org.joda.time.Period.<init>(Period.java:674)
	at org.joda.time.base.AbstractPeriod.toPeriod(AbstractPeriod.java:147)
	at org.joda.time.format.PeriodFormatter.parsePeriod(PeriodFormatter.java:308)
	at org.joda.time.format.TestPeriodFormat.test_wordBased_fr_parseTwoFields(TestPeriodFormat.java:158)

test_wordBased_pt_parseOneField(org.joda.time.format.TestPeriodFormat)  Time elapsed: 0 sec  <<< ERROR!
java.lang.ArrayIndexOutOfBoundsException: 17
	at org.joda.time.convert.ConverterSet.select(ConverterSet.java:17)
	at org.joda.time.convert.ConverterManager.getPeriodConverter(ConverterManager.java:421)
	at org.joda.time.base.BasePeriod.<init>(BasePeriod.java:272)
	at org.joda.time.Period.<init>(Period.java:674)
	at org.joda.time.base.AbstractPeriod.toPeriod(AbstractPeriod.java:147)
	at org.joda.time.format.PeriodFormatter.parsePeriod(PeriodFormatter.java:308)
	at org.joda.time.format.TestPeriodFormat.test_wordBased_pt_parseOneField(TestPeriodFormat.java:189)

test_wordBased_pt_parseTwoFields(org.joda.time.format.TestPeriodFormat)  Time elapsed: 0.001 sec  <<< ERROR!
java.lang.ArrayIndexOutOfBoundsException: 17
	at org.joda.time.convert.ConverterSet.select(ConverterSet.java:17)
	at org.joda.time.convert.ConverterManager.getPeriodConverter(ConverterManager.java:421)
	at org.joda.time.base.BasePeriod.<init>(BasePeriod.java:272)
	at org.joda.time.Period.<init>(Period.java:674)
	at org.joda.time.base.AbstractPeriod.toPeriod(AbstractPeriod.java:147)
	at org.joda.time.format.PeriodFormatter.parsePeriod(PeriodFormatter.java:308)
	at org.joda.time.format.TestPeriodFormat.test_wordBased_pt_parseTwoFields(TestPeriodFormat.java:195)

test_getDefault_parseOneField(org.joda.time.format.TestPeriodFormat)  Time elapsed: 0.001 sec  <<< ERROR!
java.lang.ArrayIndexOutOfBoundsException: 17
	at org.joda.time.convert.ConverterSet.select(ConverterSet.java:17)
	at org.joda.time.convert.ConverterManager.getPeriodConverter(ConverterManager.java:421)
	at org.joda.time.base.BasePeriod.<init>(BasePeriod.java:272)
	at org.joda.time.Period.<init>(Period.java:674)
	at org.joda.time.base.AbstractPeriod.toPeriod(AbstractPeriod.java:147)
	at org.joda.time.format.PeriodFormatter.parsePeriod(PeriodFormatter.java:308)
	at org.joda.time.format.TestPeriodFormat.test_getDefault_parseOneField(TestPeriodFormat.java:97)

testParseStandard8(org.joda.time.format.TestISOPeriodFormatParsing)  Time elapsed: 0.001 sec  <<< ERROR!
java.lang.ArrayIndexOutOfBoundsException: 17
	at org.joda.time.convert.ConverterSet.select(ConverterSet.java:17)
	at org.joda.time.convert.ConverterManager.getPeriodConverter(ConverterManager.java:421)
	at org.joda.time.base.BasePeriod.<init>(BasePeriod.java:272)
	at org.joda.time.Period.<init>(Period.java:674)
	at org.joda.time.base.AbstractPeriod.toPeriod(AbstractPeriod.java:147)
	at org.joda.time.format.PeriodFormatter.parsePeriod(PeriodFormatter.java:308)
	at org.joda.time.format.TestISOPeriodFormatParsing.testParseStandard8(TestISOPeriodFormatParsing.java:143)

testParseStandard9(org.joda.time.format.TestISOPeriodFormatParsing)  Time elapsed: 0.001 sec  <<< ERROR!
java.lang.ArrayIndexOutOfBoundsException: 17
	at org.joda.time.convert.ConverterSet.select(ConverterSet.java:17)
	at org.joda.time.convert.ConverterManager.getPeriodConverter(ConverterManager.java:421)
	at org.joda.time.base.BasePeriod.<init>(BasePeriod.java:272)
	at org.joda.time.Period.<init>(Period.java:674)
	at org.joda.time.base.AbstractPeriod.toPeriod(AbstractPeriod.java:147)
	at org.joda.time.format.PeriodFormatter.parsePeriod(PeriodFormatter.java:308)
	at org.joda.time.format.TestISOPeriodFormatParsing.testParseStandard9(TestISOPeriodFormatParsing.java:150)

testParseStandard10(org.joda.time.format.TestISOPeriodFormatParsing)  Time elapsed: 0 sec  <<< ERROR!
java.lang.ArrayIndexOutOfBoundsException: 17
	at org.joda.time.convert.ConverterSet.select(ConverterSet.java:17)
	at org.joda.time.convert.ConverterManager.getPeriodConverter(ConverterManager.java:421)
	at org.joda.time.base.BasePeriod.<init>(BasePeriod.java:272)
	at org.joda.time.Period.<init>(Period.java:674)
	at org.joda.time.base.AbstractPeriod.toPeriod(AbstractPeriod.java:147)
	at org.joda.time.format.PeriodFormatter.parsePeriod(PeriodFormatter.java:308)
	at org.joda.time.format.TestISOPeriodFormatParsing.testParseStandard10(TestISOPeriodFormatParsing.java:157)

testParseStandard11(org.joda.time.format.TestISOPeriodFormatParsing)  Time elapsed: 0.001 sec  <<< ERROR!
java.lang.ArrayIndexOutOfBoundsException: 17
	at org.joda.time.convert.ConverterSet.select(ConverterSet.java:17)
	at org.joda.time.convert.ConverterManager.getPeriodConverter(ConverterManager.java:421)
	at org.joda.time.base.BasePeriod.<init>(BasePeriod.java:272)
	at org.joda.time.Period.<init>(Period.java:674)
	at org.joda.time.base.AbstractPeriod.toPeriod(AbstractPeriod.java:147)
	at org.joda.time.format.PeriodFormatter.parsePeriod(PeriodFormatter.java:308)
	at org.joda.time.format.TestISOPeriodFormatParsing.testParseStandard11(TestISOPeriodFormatParsing.java:164)

testParseStandard1(org.joda.time.format.TestISOPeriodFormatParsing)  Time elapsed: 0 sec  <<< ERROR!
java.lang.ArrayIndexOutOfBoundsException: 17
	at org.joda.time.convert.ConverterSet.select(ConverterSet.java:17)
	at org.joda.time.convert.ConverterManager.getPeriodConverter(ConverterManager.java:421)
	at org.joda.time.base.BasePeriod.<init>(BasePeriod.java:272)
	at org.joda.time.Period.<init>(Period.java:674)
	at org.joda.time.base.AbstractPeriod.toPeriod(AbstractPeriod.java:147)
	at org.joda.time.format.PeriodFormatter.parsePeriod(PeriodFormatter.java:308)
	at org.joda.time.format.TestISOPeriodFormatParsing.testParseStandard1(TestISOPeriodFormatParsing.java:94)

testParseStandard2(org.joda.time.format.TestISOPeriodFormatParsing)  Time elapsed: 0.001 sec  <<< ERROR!
java.lang.ArrayIndexOutOfBoundsException: 17
	at org.joda.time.convert.ConverterSet.select(ConverterSet.java:17)
	at org.joda.time.convert.ConverterManager.getPeriodConverter(ConverterManager.java:421)
	at org.joda.time.base.BasePeriod.<init>(BasePeriod.java:272)
	at org.joda.time.Period.<init>(Period.java:674)
	at org.joda.time.base.AbstractPeriod.toPeriod(AbstractPeriod.java:147)
	at org.joda.time.format.PeriodFormatter.parsePeriod(PeriodFormatter.java:308)
	at org.joda.time.format.TestISOPeriodFormatParsing.testParseStandard2(TestISOPeriodFormatParsing.java:101)

testParseStandard3(org.joda.time.format.TestISOPeriodFormatParsing)  Time elapsed: 0.001 sec  <<< ERROR!
java.lang.ArrayIndexOutOfBoundsException: 17
	at org.joda.time.convert.ConverterSet.select(ConverterSet.java:17)
	at org.joda.time.convert.ConverterManager.getPeriodConverter(ConverterManager.java:421)
	at org.joda.time.base.BasePeriod.<init>(BasePeriod.java:272)
	at org.joda.time.Period.<init>(Period.java:674)
	at org.joda.time.base.AbstractPeriod.toPeriod(AbstractPeriod.java:147)
	at org.joda.time.format.PeriodFormatter.parsePeriod(PeriodFormatter.java:308)
	at org.joda.time.format.TestISOPeriodFormatParsing.testParseStandard3(TestISOPeriodFormatParsing.java:108)

testParseStandard4(org.joda.time.format.TestISOPeriodFormatParsing)  Time elapsed: 0 sec  <<< ERROR!
java.lang.ArrayIndexOutOfBoundsException: 17
	at org.joda.time.convert.ConverterSet.select(ConverterSet.java:17)
	at org.joda.time.convert.ConverterManager.getPeriodConverter(ConverterManager.java:421)
	at org.joda.time.base.BasePeriod.<init>(BasePeriod.java:272)
	at org.joda.time.Period.<init>(Period.java:674)
	at org.joda.time.base.AbstractPeriod.toPeriod(AbstractPeriod.java:147)
	at org.joda.time.format.PeriodFormatter.parsePeriod(PeriodFormatter.java:308)
	at org.joda.time.format.TestISOPeriodFormatParsing.testParseStandard4(TestISOPeriodFormatParsing.java:115)

testParseStandard5(org.joda.time.format.TestISOPeriodFormatParsing)  Time elapsed: 0.001 sec  <<< ERROR!
java.lang.ArrayIndexOutOfBoundsException: 17
	at org.joda.time.convert.ConverterSet.select(ConverterSet.java:17)
	at org.joda.time.convert.ConverterManager.getPeriodConverter(ConverterManager.java:421)
	at org.joda.time.base.BasePeriod.<init>(BasePeriod.java:272)
	at org.joda.time.Period.<init>(Period.java:674)
	at org.joda.time.base.AbstractPeriod.toPeriod(AbstractPeriod.java:147)
	at org.joda.time.format.PeriodFormatter.parsePeriod(PeriodFormatter.java:308)
	at org.joda.time.format.TestISOPeriodFormatParsing.testParseStandard5(TestISOPeriodFormatParsing.java:122)

testParseStandard6(org.joda.time.format.TestISOPeriodFormatParsing)  Time elapsed: 0 sec  <<< ERROR!
java.lang.ArrayIndexOutOfBoundsException: 17
	at org.joda.time.convert.ConverterSet.select(ConverterSet.java:17)
	at org.joda.time.convert.ConverterManager.getPeriodConverter(ConverterManager.java:421)
	at org.joda.time.base.BasePeriod.<init>(BasePeriod.java:272)
	at org.joda.time.Period.<init>(Period.java:674)
	at org.joda.time.base.AbstractPeriod.toPeriod(AbstractPeriod.java:147)
	at org.joda.time.format.PeriodFormatter.parsePeriod(PeriodFormatter.java:308)
	at org.joda.time.format.TestISOPeriodFormatParsing.testParseStandard6(TestISOPeriodFormatParsing.java:129)

testParseStandard7(org.joda.time.format.TestISOPeriodFormatParsing)  Time elapsed: 0.001 sec  <<< ERROR!
java.lang.ArrayIndexOutOfBoundsException: 17
	at org.joda.time.convert.ConverterSet.select(ConverterSet.java:17)
	at org.joda.time.convert.ConverterManager.getPeriodConverter(ConverterManager.java:421)
	at org.joda.time.base.BasePeriod.<init>(BasePeriod.java:272)
	at org.joda.time.Period.<init>(Period.java:674)
	at org.joda.time.base.AbstractPeriod.toPeriod(AbstractPeriod.java:147)
	at org.joda.time.format.PeriodFormatter.parsePeriod(PeriodFormatter.java:308)
	at org.joda.time.format.TestISOPeriodFormatParsing.testParseStandard7(TestISOPeriodFormatParsing.java:136)

testParseNegativeMillis2(org.joda.time.format.TestPeriodFormatParsing)  Time elapsed: 0 sec  <<< ERROR!
java.lang.ArrayIndexOutOfBoundsException: 17
	at org.joda.time.convert.ConverterSet.select(ConverterSet.java:17)
	at org.joda.time.convert.ConverterManager.getPeriodConverter(ConverterManager.java:421)
	at org.joda.time.base.BasePeriod.<init>(BasePeriod.java:272)
	at org.joda.time.Period.<init>(Period.java:674)
	at org.joda.time.base.AbstractPeriod.toPeriod(AbstractPeriod.java:147)
	at org.joda.time.format.PeriodFormatter.parsePeriod(PeriodFormatter.java:308)
	at org.joda.time.Period.parse(Period.java:92)
	at org.joda.time.Period.parse(Period.java:81)
	at org.joda.time.format.TestPeriodFormatParsing.testParseNegativeMillis2(TestPeriodFormatParsing.java:110)

testParseCustom1(org.joda.time.format.TestPeriodFormatParsing)  Time elapsed: 0.001 sec  <<< ERROR!
java.lang.ArrayIndexOutOfBoundsException: 17
	at org.joda.time.convert.ConverterSet.select(ConverterSet.java:17)
	at org.joda.time.convert.ConverterManager.getPeriodConverter(ConverterManager.java:421)
	at org.joda.time.base.BasePeriod.<init>(BasePeriod.java:272)
	at org.joda.time.Period.<init>(Period.java:674)
	at org.joda.time.base.AbstractPeriod.toPeriod(AbstractPeriod.java:147)
	at org.joda.time.format.PeriodFormatter.parsePeriod(PeriodFormatter.java:308)
	at org.joda.time.format.TestPeriodFormatParsing.testParseCustom1(TestPeriodFormatParsing.java:127)

testParseNegativeMillis1(org.joda.time.format.TestPeriodFormatParsing)  Time elapsed: 0 sec  <<< ERROR!
java.lang.ArrayIndexOutOfBoundsException: 17
	at org.joda.time.convert.ConverterSet.select(ConverterSet.java:17)
	at org.joda.time.convert.ConverterManager.getPeriodConverter(ConverterManager.java:421)
	at org.joda.time.base.BasePeriod.<init>(BasePeriod.java:272)
	at org.joda.time.Period.<init>(Period.java:674)
	at org.joda.time.base.AbstractPeriod.toPeriod(AbstractPeriod.java:147)
	at org.joda.time.format.PeriodFormatter.parsePeriod(PeriodFormatter.java:308)
	at org.joda.time.Period.parse(Period.java:92)
	at org.joda.time.Period.parse(Period.java:81)
	at org.joda.time.format.TestPeriodFormatParsing.testParseNegativeMillis1(TestPeriodFormatParsing.java:102)

testParseStandard1(org.joda.time.format.TestPeriodFormatParsing)  Time elapsed: 0.001 sec  <<< ERROR!
java.lang.ArrayIndexOutOfBoundsException: 17
	at org.joda.time.convert.ConverterSet.select(ConverterSet.java:17)
	at org.joda.time.convert.ConverterManager.getPeriodConverter(ConverterManager.java:421)
	at org.joda.time.base.BasePeriod.<init>(BasePeriod.java:272)
	at org.joda.time.Period.<init>(Period.java:674)
	at org.joda.time.base.AbstractPeriod.toPeriod(AbstractPeriod.java:147)
	at org.joda.time.format.PeriodFormatter.parsePeriod(PeriodFormatter.java:308)
	at org.joda.time.format.TestPeriodFormatParsing.testParseStandard1(TestPeriodFormatParsing.java:94)

testFormatAppend_PrinterParser_null_Parser(org.joda.time.format.TestPeriodFormatterBuilder)  Time elapsed: 0.001 sec  <<< ERROR!
java.lang.ArrayIndexOutOfBoundsException: 17
	at org.joda.time.convert.ConverterSet.select(ConverterSet.java:17)
	at org.joda.time.convert.ConverterManager.getPeriodConverter(ConverterManager.java:421)
	at org.joda.time.base.BasePeriod.<init>(BasePeriod.java:272)
	at org.joda.time.Period.<init>(Period.java:674)
	at org.joda.time.base.AbstractPeriod.toPeriod(AbstractPeriod.java:147)
	at org.joda.time.format.PeriodFormatter.parsePeriod(PeriodFormatter.java:308)
	at org.joda.time.format.TestPeriodFormatterBuilder.testFormatAppend_PrinterParser_null_Parser(TestPeriodFormatterBuilder.java:1104)

testFormatAppend_PrinterParser_PrinterParser(org.joda.time.format.TestPeriodFormatterBuilder)  Time elapsed: 0 sec  <<< ERROR!
java.lang.ArrayIndexOutOfBoundsException: 17
	at org.joda.time.convert.ConverterSet.select(ConverterSet.java:17)
	at org.joda.time.convert.ConverterManager.getPeriodConverter(ConverterManager.java:421)
	at org.joda.time.base.BasePeriod.<init>(BasePeriod.java:272)
	at org.joda.time.Period.<init>(Period.java:674)
	at org.joda.time.base.AbstractPeriod.toPeriod(AbstractPeriod.java:147)
	at org.joda.time.format.PeriodFormatter.parsePeriod(PeriodFormatter.java:308)
	at org.joda.time.format.TestPeriodFormatterBuilder.testFormatAppend_PrinterParser_PrinterParser(TestPeriodFormatterBuilder.java:1116)

testBug2495455(org.joda.time.format.TestPeriodFormatterBuilder)  Time elapsed: 0.001 sec  <<< ERROR!
java.lang.ArrayIndexOutOfBoundsException: 17
	at org.joda.time.convert.ConverterSet.select(ConverterSet.java:17)
	at org.joda.time.convert.ConverterManager.getPeriodConverter(ConverterManager.java:421)
	at org.joda.time.base.BasePeriod.<init>(BasePeriod.java:272)
	at org.joda.time.Period.<init>(Period.java:674)
	at org.joda.time.base.AbstractPeriod.toPeriod(AbstractPeriod.java:147)
	at org.joda.time.format.PeriodFormatter.parsePeriod(PeriodFormatter.java:308)
	at org.joda.time.format.TestPeriodFormatterBuilder.testBug2495455(TestPeriodFormatterBuilder.java:1166)

testMonthsAndMinutesAreConsideredSeparateAndCaseIsNotIgnored(org.joda.time.format.TestPeriodFormatterBuilder)  Time elapsed: 0.001 sec  <<< ERROR!
java.lang.ArrayIndexOutOfBoundsException: 17
	at org.joda.time.convert.ConverterSet.select(ConverterSet.java:17)
	at org.joda.time.convert.ConverterManager.getPeriodConverter(ConverterManager.java:421)
	at org.joda.time.base.BasePeriod.<init>(BasePeriod.java:272)
	at org.joda.time.Period.<init>(Period.java:674)
	at org.joda.time.base.AbstractPeriod.toPeriod(AbstractPeriod.java:147)
	at org.joda.time.format.PeriodFormatter.parsePeriod(PeriodFormatter.java:308)
	at org.joda.time.format.TestPeriodFormatterBuilder.testMonthsAndMinutesAreConsideredSeparateAndCaseIsNotIgnored(TestPeriodFormatterBuilder.java:1179)

testFormatPrefixSimple4IgnoringPrefix(org.joda.time.format.TestPeriodFormatterBuilder)  Time elapsed: 0.001 sec  <<< ERROR!
java.lang.ArrayIndexOutOfBoundsException: 17
	at org.joda.time.convert.ConverterSet.select(ConverterSet.java:17)
	at org.joda.time.convert.ConverterManager.getPeriodConverter(ConverterManager.java:421)
	at org.joda.time.base.BasePeriod.<init>(BasePeriod.java:272)
	at org.joda.time.Period.<init>(Period.java:674)
	at org.joda.time.base.AbstractPeriod.toPeriod(AbstractPeriod.java:147)
	at org.joda.time.format.PeriodFormatter.parsePeriod(PeriodFormatter.java:308)
	at org.joda.time.format.TestPeriodFormatterBuilder.testFormatPrefixSimple4IgnoringPrefix(TestPeriodFormatterBuilder.java:348)

testPluralAffixParseOrder(org.joda.time.format.TestPeriodFormatterBuilder)  Time elapsed: 0 sec  <<< ERROR!
java.lang.ArrayIndexOutOfBoundsException: 17
	at org.joda.time.convert.ConverterSet.select(ConverterSet.java:17)
	at org.joda.time.convert.ConverterManager.getPeriodConverter(ConverterManager.java:421)
	at org.joda.time.base.BasePeriod.<init>(BasePeriod.java:272)
	at org.joda.time.Period.<init>(Period.java:674)
	at org.joda.time.base.AbstractPeriod.toPeriod(AbstractPeriod.java:147)
	at org.joda.time.format.PeriodFormatter.parsePeriod(PeriodFormatter.java:308)
	at org.joda.time.format.TestPeriodFormatterBuilder.testPluralAffixParseOrder(TestPeriodFormatterBuilder.java:357)

testFormatPrefixPlural4IgnoringPrefix(org.joda.time.format.TestPeriodFormatterBuilder)  Time elapsed: 0 sec  <<< ERROR!
java.lang.ArrayIndexOutOfBoundsException: 17
	at org.joda.time.convert.ConverterSet.select(ConverterSet.java:17)
	at org.joda.time.convert.ConverterManager.getPeriodConverter(ConverterManager.java:421)
	at org.joda.time.base.BasePeriod.<init>(BasePeriod.java:272)
	at org.joda.time.Period.<init>(Period.java:674)
	at org.joda.time.base.AbstractPeriod.toPeriod(AbstractPeriod.java:147)
	at org.joda.time.format.PeriodFormatter.parsePeriod(PeriodFormatter.java:308)
	at org.joda.time.format.TestPeriodFormatterBuilder.testFormatPrefixPlural4IgnoringPrefix(TestPeriodFormatterBuilder.java:407)

testRegExAffixParseOrder(org.joda.time.format.TestPeriodFormatterBuilder)  Time elapsed: 0.001 sec  <<< ERROR!
java.lang.ArrayIndexOutOfBoundsException: 17
	at org.joda.time.convert.ConverterSet.select(ConverterSet.java:17)
	at org.joda.time.convert.ConverterManager.getPeriodConverter(ConverterManager.java:421)
	at org.joda.time.base.BasePeriod.<init>(BasePeriod.java:272)
	at org.joda.time.Period.<init>(Period.java:674)
	at org.joda.time.base.AbstractPeriod.toPeriod(AbstractPeriod.java:147)
	at org.joda.time.format.PeriodFormatter.parsePeriod(PeriodFormatter.java:308)
	at org.joda.time.format.TestPeriodFormatterBuilder.testRegExAffixParseOrder(TestPeriodFormatterBuilder.java:424)

testFormatPrefixRegEx4IgnoringPrefix(org.joda.time.format.TestPeriodFormatterBuilder)  Time elapsed: 0 sec  <<< ERROR!
java.lang.ArrayIndexOutOfBoundsException: 17
	at org.joda.time.convert.ConverterSet.select(ConverterSet.java:17)
	at org.joda.time.convert.ConverterManager.getPeriodConverter(ConverterManager.java:421)
	at org.joda.time.base.BasePeriod.<init>(BasePeriod.java:272)
	at org.joda.time.Period.<init>(Period.java:674)
	at org.joda.time.base.AbstractPeriod.toPeriod(AbstractPeriod.java:147)
	at org.joda.time.format.PeriodFormatter.parsePeriod(PeriodFormatter.java:308)
	at org.joda.time.format.TestPeriodFormatterBuilder.testFormatPrefixRegEx4IgnoringPrefix(TestPeriodFormatterBuilder.java:492)

testFormatPrefixComposite1(org.joda.time.format.TestPeriodFormatterBuilder)  Time elapsed: 0.002 sec  <<< ERROR!
java.lang.ArrayIndexOutOfBoundsException: 17
	at org.joda.time.convert.ConverterSet.select(ConverterSet.java:17)
	at org.joda.time.convert.ConverterManager.getPeriodConverter(ConverterManager.java:421)
	at org.joda.time.base.BasePeriod.<init>(BasePeriod.java:272)
	at org.joda.time.Period.<init>(Period.java:674)
	at org.joda.time.base.AbstractPeriod.toPeriod(AbstractPeriod.java:147)
	at org.joda.time.format.PeriodFormatter.parsePeriod(PeriodFormatter.java:308)
	at org.joda.time.format.TestPeriodFormatterBuilder.testFormatPrefixComposite1(TestPeriodFormatterBuilder.java:513)

testFormatPrefixSimple5IgnoringPrefix(org.joda.time.format.TestPeriodFormatterBuilder)  Time elapsed: 0 sec  <<< ERROR!
java.lang.ArrayIndexOutOfBoundsException: 17
	at org.joda.time.convert.ConverterSet.select(ConverterSet.java:17)
	at org.joda.time.convert.ConverterManager.getPeriodConverter(ConverterManager.java:421)
	at org.joda.time.base.BasePeriod.<init>(BasePeriod.java:272)
	at org.joda.time.Period.<init>(Period.java:674)
	at org.joda.time.base.AbstractPeriod.toPeriod(AbstractPeriod.java:147)
	at org.joda.time.format.PeriodFormatter.parsePeriod(PeriodFormatter.java:308)
	at org.joda.time.format.TestPeriodFormatterBuilder.testFormatPrefixSimple5IgnoringPrefix(TestPeriodFormatterBuilder.java:563)

testFormatPrefixSimple6IgnoringPrefix(org.joda.time.format.TestPeriodFormatterBuilder)  Time elapsed: 0 sec  <<< ERROR!
java.lang.ArrayIndexOutOfBoundsException: 17
	at org.joda.time.convert.ConverterSet.select(ConverterSet.java:17)
	at org.joda.time.convert.ConverterManager.getPeriodConverter(ConverterManager.java:421)
	at org.joda.time.base.BasePeriod.<init>(BasePeriod.java:272)
	at org.joda.time.Period.<init>(Period.java:674)
	at org.joda.time.base.AbstractPeriod.toPeriod(AbstractPeriod.java:147)
	at org.joda.time.format.PeriodFormatter.parsePeriod(PeriodFormatter.java:308)
	at org.joda.time.format.TestPeriodFormatterBuilder.testFormatPrefixSimple6IgnoringPrefix(TestPeriodFormatterBuilder.java:574)

testFormatSuffixPlural4IgnoringPrefix(org.joda.time.format.TestPeriodFormatterBuilder)  Time elapsed: 0 sec  <<< ERROR!
java.lang.ArrayIndexOutOfBoundsException: 17
	at org.joda.time.convert.ConverterSet.select(ConverterSet.java:17)
	at org.joda.time.convert.ConverterManager.getPeriodConverter(ConverterManager.java:421)
	at org.joda.time.base.BasePeriod.<init>(BasePeriod.java:272)
	at org.joda.time.Period.<init>(Period.java:674)
	at org.joda.time.base.AbstractPeriod.toPeriod(AbstractPeriod.java:147)
	at org.joda.time.format.PeriodFormatter.parsePeriod(PeriodFormatter.java:308)
	at org.joda.time.format.TestPeriodFormatterBuilder.testFormatSuffixPlural4IgnoringPrefix(TestPeriodFormatterBuilder.java:631)

testFormatSuffixRegEx5IgnoringAffix(org.joda.time.format.TestPeriodFormatterBuilder)  Time elapsed: 0 sec  <<< ERROR!
java.lang.ArrayIndexOutOfBoundsException: 17
	at org.joda.time.convert.ConverterSet.select(ConverterSet.java:17)
	at org.joda.time.convert.ConverterManager.getPeriodConverter(ConverterManager.java:421)
	at org.joda.time.base.BasePeriod.<init>(BasePeriod.java:272)
	at org.joda.time.Period.<init>(Period.java:674)
	at org.joda.time.base.AbstractPeriod.toPeriod(AbstractPeriod.java:147)
	at org.joda.time.format.PeriodFormatter.parsePeriod(PeriodFormatter.java:308)
	at org.joda.time.format.TestPeriodFormatterBuilder.testFormatSuffixRegEx5IgnoringAffix(TestPeriodFormatterBuilder.java:723)

testFormatSuffixComposite1(org.joda.time.format.TestPeriodFormatterBuilder)  Time elapsed: 0 sec  <<< ERROR!
java.lang.ArrayIndexOutOfBoundsException: 17
	at org.joda.time.convert.ConverterSet.select(ConverterSet.java:17)
	at org.joda.time.convert.ConverterManager.getPeriodConverter(ConverterManager.java:421)
	at org.joda.time.base.BasePeriod.<init>(BasePeriod.java:272)
	at org.joda.time.Period.<init>(Period.java:674)
	at org.joda.time.base.AbstractPeriod.toPeriod(AbstractPeriod.java:147)
	at org.joda.time.format.PeriodFormatter.parsePeriod(PeriodFormatter.java:308)
	at org.joda.time.format.TestPeriodFormatterBuilder.testFormatSuffixComposite1(TestPeriodFormatterBuilder.java:743)

testFormatSuffixComposite5IgnoringAffix(org.joda.time.format.TestPeriodFormatterBuilder)  Time elapsed: 0 sec  <<< ERROR!
java.lang.ArrayIndexOutOfBoundsException: 17
	at org.joda.time.convert.ConverterSet.select(ConverterSet.java:17)
	at org.joda.time.convert.ConverterManager.getPeriodConverter(ConverterManager.java:421)
	at org.joda.time.base.BasePeriod.<init>(BasePeriod.java:272)
	at org.joda.time.Period.<init>(Period.java:674)
	at org.joda.time.base.AbstractPeriod.toPeriod(AbstractPeriod.java:147)
	at org.joda.time.format.PeriodFormatter.parsePeriod(PeriodFormatter.java:308)
	at org.joda.time.format.TestPeriodFormatterBuilder.testFormatSuffixComposite5IgnoringAffix(TestPeriodFormatterBuilder.java:757)


Results :

Tests in error: 
  org.joda.time.TestDateMidnight_Constructors#testConstructor_badconverterObject ArrayIndexOutOfBoundsException
  org.joda.time.TestDateMidnight_Constructors#testConstructor_badconverterObject_Chronology ArrayIndexOutOfBoundsException
  org.joda.time.TestDateMidnight_Constructors#testConstructor_badconverterObject_DateTimeZone ArrayIndexOutOfBoundsException
  org.joda.time.TestDateMidnight_Constructors#testConstructor_invalidObject ArrayIndexOutOfBoundsException
  org.joda.time.TestDateMidnight_Constructors#testConstructor_invalidObject_Chronology ArrayIndexOutOfBoundsException
  org.joda.time.TestDateMidnight_Constructors#testConstructor_invalidObject_DateTimeZone ArrayIndexOutOfBoundsException
  org.joda.time.TestDateTimeComparator#testBasicComps1 ArrayIndexOutOfBoundsException
  org.joda.time.TestDateTimeComparator#testBasicComps2 ArrayIndexOutOfBoundsException
  org.joda.time.TestDateTimeComparator#testBasicComps4 ArrayIndexOutOfBoundsException
  org.joda.time.TestDateTimeComparator#testDOM ArrayIndexOutOfBoundsException 16
  org.joda.time.TestDateTimeComparator#testDOW ArrayIndexOutOfBoundsException 16
  org.joda.time.TestDateTimeComparator#testDOY ArrayIndexOutOfBoundsException 16
  org.joda.time.TestDateTimeComparator#testHour ArrayIndexOutOfBoundsException 1...
  org.joda.time.TestDateTimeComparator#testListDOM ArrayIndexOutOfBoundsException
  org.joda.time.TestDateTimeComparator#testListDOW ArrayIndexOutOfBoundsException
  org.joda.time.TestDateTimeComparator#testListDOY ArrayIndexOutOfBoundsException
  org.joda.time.TestDateTimeComparator#testListDate ArrayIndexOutOfBoundsException
  org.joda.time.TestDateTimeComparator#testListHour ArrayIndexOutOfBoundsException
  org.joda.time.TestDateTimeComparator#testListMillis ArrayIndexOutOfBoundsException
  org.joda.time.TestDateTimeComparator#testListMinute ArrayIndexOutOfBoundsException
  org.joda.time.TestDateTimeComparator#testListMonth ArrayIndexOutOfBoundsException
  org.joda.time.TestDateTimeComparator#testListSecond ArrayIndexOutOfBoundsException
  org.joda.time.TestDateTimeComparator#testListTime ArrayIndexOutOfBoundsException
  org.joda.time.TestDateTimeComparator#testListWOW ArrayIndexOutOfBoundsException
  org.joda.time.TestDateTimeComparator#testListYOYY ArrayIndexOutOfBoundsException
  org.joda.time.TestDateTimeComparator#testListYear ArrayIndexOutOfBoundsException
  org.joda.time.TestDateTimeComparator#testMillis ArrayIndexOutOfBoundsException
  org.joda.time.TestDateTimeComparator#testMinute ArrayIndexOutOfBoundsException
  org.joda.time.TestDateTimeComparator#testMonth ArrayIndexOutOfBoundsException ...
  org.joda.time.TestDateTimeComparator#testNullDT ArrayIndexOutOfBoundsException
  org.joda.time.TestDateTimeComparator#testSecond ArrayIndexOutOfBoundsException
  org.joda.time.TestDateTimeComparator#testWOW ArrayIndexOutOfBoundsException 16
  org.joda.time.TestDateTimeComparator#testWOYY ArrayIndexOutOfBoundsException 1...
  org.joda.time.TestDateTimeComparator#testYear ArrayIndexOutOfBoundsException 1...
  org.joda.time.TestDateTime_Basics#testToDateMidnight ArrayIndexOutOfBoundsException
  org.joda.time.TestDateTime_Constructors#testConstructor_badconverterObject ArrayIndexOutOfBoundsException
  org.joda.time.TestDateTime_Constructors#testConstructor_badconverterObject_Chronology ArrayIndexOutOfBoundsException
  org.joda.time.TestDateTime_Constructors#testConstructor_badconverterObject_DateTimeZone ArrayIndexOutOfBoundsException
  org.joda.time.TestDateTime_Constructors#testConstructor_invalidObject ArrayIndexOutOfBoundsException
  org.joda.time.TestDateTime_Constructors#testConstructor_invalidObject_Chronology ArrayIndexOutOfBoundsException
  org.joda.time.TestDateTime_Constructors#testConstructor_invalidObject_DateTimeZone ArrayIndexOutOfBoundsException
  org.joda.time.TestDays#testFactory_parseDays_String ArrayIndexOutOfBoundsException
  org.joda.time.TestDuration_Constructors#testConstructor_Object3 ArrayIndexOutOfBoundsException
  org.joda.time.TestHours#testFactory_parseHours_String ArrayIndexOutOfBoundsException
  org.joda.time.TestInstant_Constructors#testConstructor_badconverterObject ArrayIndexOutOfBoundsException
  org.joda.time.TestInstant_Constructors#testConstructor_invalidObject ArrayIndexOutOfBoundsException
  org.joda.time.TestInterval_Constructors#testConstructor_Object3 ArrayIndexOutOfBoundsException
  org.joda.time.TestInterval_Constructors#testConstructor_RI_RI2 ArrayIndexOutOfBoundsException
  org.joda.time.TestInterval_Constructors#testConstructor_RI_RP2 ArrayIndexOutOfBoundsException
  org.joda.time.TestInterval_Constructors#testConstructor_RP_RI2 ArrayIndexOutOfBoundsException
  org.joda.time.TestInterval_Constructors#testParse_noFormatter ArrayIndexOutOfBoundsException
  org.joda.time.TestLocalDateTime_Constructors#testConstructor_ObjectLocalDate ArrayIndexOutOfBoundsException
  org.joda.time.TestLocalDateTime_Constructors#testConstructor_ObjectLocalTime ArrayIndexOutOfBoundsException
  org.joda.time.TestLocalDate_Constructors#testConstructor_ObjectLocalDate ArrayIndexOutOfBoundsException
  org.joda.time.TestLocalDate_Constructors#testConstructor_ObjectLocalTime ArrayIndexOutOfBoundsException
  org.joda.time.TestLocalDate_Constructors#testConstructor_ObjectYearMonthDay ArrayIndexOutOfBoundsException
  org.joda.time.TestLocalDate_Constructors#testConstructor_Object_Chronology_crossChronology ArrayIndexOutOfBoundsException
  org.joda.time.TestLocalTime_Constructors#testConstructor_ObjectLocalDate ArrayIndexOutOfBoundsException
  org.joda.time.TestLocalTime_Constructors#testConstructor_ObjectLocalTime ArrayIndexOutOfBoundsException
  org.joda.time.TestMinutes#testFactory_parseMinutes_String ArrayIndexOutOfBoundsException
  org.joda.time.TestMonths#testFactory_parseMonths_String ArrayIndexOutOfBoundsException
  org.joda.time.TestMutableDateTime_Constructors#testConstructor_badconverterObject ArrayIndexOutOfBoundsException
  org.joda.time.TestMutableDateTime_Constructors#testConstructor_badconverterObject_Chronology ArrayIndexOutOfBoundsException
  org.joda.time.TestMutableDateTime_Constructors#testConstructor_badconverterObject_DateTimeZone ArrayIndexOutOfBoundsException
  org.joda.time.TestMutableDateTime_Constructors#testConstructor_invalidObject ArrayIndexOutOfBoundsException
  org.joda.time.TestMutableDateTime_Constructors#testConstructor_invalidObject_Chronology ArrayIndexOutOfBoundsException
  org.joda.time.TestMutableDateTime_Constructors#testConstructor_invalidObject_DateTimeZone ArrayIndexOutOfBoundsException
  org.joda.time.TestMutableInterval_Constructors#testConstructor_Object2 ArrayIndexOutOfBoundsException
  org.joda.time.TestMutableInterval_Constructors#testConstructor_Object4 ArrayIndexOutOfBoundsException
  org.joda.time.TestMutableInterval_Constructors#testConstructor_Object6 ArrayIndexOutOfBoundsException
  org.joda.time.TestMutableInterval_Constructors#testConstructor_RI_RI2 ArrayIndexOutOfBoundsException
  org.joda.time.TestMutableInterval_Constructors#testConstructor_RI_RP2 ArrayIndexOutOfBoundsException
  org.joda.time.TestMutableInterval_Constructors#testConstructor_RP_RI2 ArrayIndexOutOfBoundsException
  org.joda.time.TestMutableInterval_Constructors#testParse_noFormatter ArrayIndexOutOfBoundsException
  org.joda.time.TestMutablePeriod_Basics#testToMutablePeriod ArrayIndexOutOfBoundsException
  org.joda.time.TestMutablePeriod_Basics#testToPeriod ArrayIndexOutOfBoundsException
  org.joda.time.TestMutablePeriod_Constructors#testParse_noFormatter ArrayIndexOutOfBoundsException
  org.joda.time.TestPeriod_Constructors#testParse_noFormatter ArrayIndexOutOfBoundsException
  org.joda.time.TestSeconds#testFactory_parseSeconds_String ArrayIndexOutOfBoundsException
  org.joda.time.TestStringConvert#testDays ArrayIndexOutOfBoundsException 17
  org.joda.time.TestStringConvert#testHours ArrayIndexOutOfBoundsException 17
  org.joda.time.TestStringConvert#testMinutes ArrayIndexOutOfBoundsException 17
  org.joda.time.TestStringConvert#testMonths ArrayIndexOutOfBoundsException 17
  org.joda.time.TestStringConvert#testMutablePeriod ArrayIndexOutOfBoundsException
  org.joda.time.TestStringConvert#testPeriod ArrayIndexOutOfBoundsException 17
  org.joda.time.TestStringConvert#testSeconds ArrayIndexOutOfBoundsException 17
  org.joda.time.TestStringConvert#testWeeks ArrayIndexOutOfBoundsException 17
  org.joda.time.TestStringConvert#testYears ArrayIndexOutOfBoundsException 17
  org.joda.time.TestWeeks#testFactory_parseWeeks_String ArrayIndexOutOfBoundsException
  org.joda.time.TestYears#testFactory_parseYears_String ArrayIndexOutOfBoundsException
  org.joda.time.convert.TestConverterManager#testAddDurationConverter1 ArrayIndexOutOfBoundsException
  org.joda.time.convert.TestConverterManager#testAddInstantConverter1 ArrayIndexOutOfBoundsException
  org.joda.time.convert.TestConverterManager#testAddIntervalConverter1 ArrayIndexOutOfBoundsException
  org.joda.time.convert.TestConverterManager#testAddPartialConverter1 ArrayIndexOutOfBoundsException
  org.joda.time.convert.TestConverterManager#testAddPeriodConverter1 ArrayIndexOutOfBoundsException
  org.joda.time.convert.TestConverterManager#testGetDurationConverter ArrayIndexOutOfBoundsException
  org.joda.time.convert.TestConverterManager#testGetInstantConverter ArrayIndexOutOfBoundsException
  org.joda.time.convert.TestConverterManager#testGetInstantConverterBadMultipleMatches ArrayIndexOutOfBoundsException
  org.joda.time.convert.TestConverterManager#testGetInstantConverterOKMultipleMatches ArrayIndexOutOfBoundsException
  org.joda.time.convert.TestConverterManager#testGetIntervalConverter ArrayIndexOutOfBoundsException
  org.joda.time.convert.TestConverterManager#testGetPartialConverter ArrayIndexOutOfBoundsException
  org.joda.time.convert.TestConverterManager#testGetPartialConverterBadMultipleMatches ArrayIndexOutOfBoundsException
  org.joda.time.convert.TestConverterManager#testGetPartialConverterOKMultipleMatches ArrayIndexOutOfBoundsException
  org.joda.time.convert.TestConverterManager#testGetPeriodConverter ArrayIndexOutOfBoundsException
  org.joda.time.convert.TestConverterSet#testBigHashtable ArrayIndexOutOfBoundsException
  org.joda.time.convert.TestStringConverter#testSetIntoIntervalEx_Object_Chronology5 ArrayIndexOutOfBoundsException
  org.joda.time.convert.TestStringConverter#testSetIntoInterval_Object_Chronology1 ArrayIndexOutOfBoundsException
  org.joda.time.convert.TestStringConverter#testSetIntoInterval_Object_Chronology2 ArrayIndexOutOfBoundsException
  org.joda.time.convert.TestStringConverter#testSetIntoInterval_Object_Chronology4 ArrayIndexOutOfBoundsException
  org.joda.time.convert.TestStringConverter#testSetIntoInterval_Object_Chronology5 ArrayIndexOutOfBoundsException
  org.joda.time.format.TestISOPeriodFormatParsing#testParseStandard1 ArrayIndexOutOfBoundsException
  org.joda.time.format.TestISOPeriodFormatParsing#testParseStandard10 ArrayIndexOutOfBoundsException
  org.joda.time.format.TestISOPeriodFormatParsing#testParseStandard11 ArrayIndexOutOfBoundsException
  org.joda.time.format.TestISOPeriodFormatParsing#testParseStandard2 ArrayIndexOutOfBoundsException
  org.joda.time.format.TestISOPeriodFormatParsing#testParseStandard3 ArrayIndexOutOfBoundsException
  org.joda.time.format.TestISOPeriodFormatParsing#testParseStandard4 ArrayIndexOutOfBoundsException
  org.joda.time.format.TestISOPeriodFormatParsing#testParseStandard5 ArrayIndexOutOfBoundsException
  org.joda.time.format.TestISOPeriodFormatParsing#testParseStandard6 ArrayIndexOutOfBoundsException
  org.joda.time.format.TestISOPeriodFormatParsing#testParseStandard7 ArrayIndexOutOfBoundsException
  org.joda.time.format.TestISOPeriodFormatParsing#testParseStandard8 ArrayIndexOutOfBoundsException
  org.joda.time.format.TestISOPeriodFormatParsing#testParseStandard9 ArrayIndexOutOfBoundsException
  org.joda.time.format.TestPeriodFormat#test_getDefault_parseOneField ArrayIndexOutOfBoundsException
  org.joda.time.format.TestPeriodFormat#test_getDefault_parseTwoFields ArrayIndexOutOfBoundsException
  org.joda.time.format.TestPeriodFormat#test_wordBased_de_parseOneField ArrayIndexOutOfBoundsException
  org.joda.time.format.TestPeriodFormat#test_wordBased_de_parseTwoFields ArrayIndexOutOfBoundsException
  org.joda.time.format.TestPeriodFormat#test_wordBased_en_withLocale_pt ArrayIndexOutOfBoundsException
  org.joda.time.format.TestPeriodFormat#test_wordBased_es_parseOneField ArrayIndexOutOfBoundsException
  org.joda.time.format.TestPeriodFormat#test_wordBased_es_parseTwoFields ArrayIndexOutOfBoundsException
  org.joda.time.format.TestPeriodFormat#test_wordBased_fr_parseOneField ArrayIndexOutOfBoundsException
  org.joda.time.format.TestPeriodFormat#test_wordBased_fr_parseTwoFields ArrayIndexOutOfBoundsException
  org.joda.time.format.TestPeriodFormat#test_wordBased_ja_parseOneField ArrayIndexOutOfBoundsException
  org.joda.time.format.TestPeriodFormat#test_wordBased_ja_parseTwoFields ArrayIndexOutOfBoundsException
  org.joda.time.format.TestPeriodFormat#test_wordBased_nl_parseOneField ArrayIndexOutOfBoundsException
  org.joda.time.format.TestPeriodFormat#test_wordBased_nl_parseTwoFields ArrayIndexOutOfBoundsException
  org.joda.time.format.TestPeriodFormat#test_wordBased_pl_parseOneField ArrayIndexOutOfBoundsException
  org.joda.time.format.TestPeriodFormat#test_wordBased_pl_parseTwoFields ArrayIndexOutOfBoundsException
  org.joda.time.format.TestPeriodFormat#test_wordBased_pt_parseOneField ArrayIndexOutOfBoundsException
  org.joda.time.format.TestPeriodFormat#test_wordBased_pt_parseTwoFields ArrayIndexOutOfBoundsException
  org.joda.time.format.TestPeriodFormatParsing#testParseCustom1 ArrayIndexOutOfBoundsException
  org.joda.time.format.TestPeriodFormatParsing#testParseNegativeMillis1 ArrayIndexOutOfBoundsException
  org.joda.time.format.TestPeriodFormatParsing#testParseNegativeMillis2 ArrayIndexOutOfBoundsException
  org.joda.time.format.TestPeriodFormatParsing#testParseStandard1 ArrayIndexOutOfBoundsException
  org.joda.time.format.TestPeriodFormatter#testParsePeriod_parseType ArrayIndexOutOfBoundsException
  org.joda.time.format.TestPeriodFormatter#testParsePeriod_simple ArrayIndexOutOfBoundsException
  org.joda.time.format.TestPeriodFormatter#testPrinterParserMethods ArrayIndexOutOfBoundsException
  org.joda.time.format.TestPeriodFormatterBuilder#testBug2495455 ArrayIndexOutOfBoundsException
  org.joda.time.format.TestPeriodFormatterBuilder#testFormatAppend_PrinterParser_PrinterParser ArrayIndexOutOfBoundsException
  org.joda.time.format.TestPeriodFormatterBuilder#testFormatAppend_PrinterParser_null_Parser ArrayIndexOutOfBoundsException
  org.joda.time.format.TestPeriodFormatterBuilder#testFormatPrefixComposite1 ArrayIndexOutOfBoundsException
  org.joda.time.format.TestPeriodFormatterBuilder#testFormatPrefixPlural4IgnoringPrefix ArrayIndexOutOfBoundsException
  org.joda.time.format.TestPeriodFormatterBuilder#testFormatPrefixRegEx4IgnoringPrefix ArrayIndexOutOfBoundsException
  org.joda.time.format.TestPeriodFormatterBuilder#testFormatPrefixSimple4IgnoringPrefix ArrayIndexOutOfBoundsException
  org.joda.time.format.TestPeriodFormatterBuilder#testFormatPrefixSimple5IgnoringPrefix ArrayIndexOutOfBoundsException
  org.joda.time.format.TestPeriodFormatterBuilder#testFormatPrefixSimple6IgnoringPrefix ArrayIndexOutOfBoundsException
  org.joda.time.format.TestPeriodFormatterBuilder#testFormatSuffixComposite1 ArrayIndexOutOfBoundsException
  org.joda.time.format.TestPeriodFormatterBuilder#testFormatSuffixComposite5IgnoringAffix ArrayIndexOutOfBoundsException
  org.joda.time.format.TestPeriodFormatterBuilder#testFormatSuffixPlural4IgnoringPrefix ArrayIndexOutOfBoundsException
  org.joda.time.format.TestPeriodFormatterBuilder#testFormatSuffixRegEx5IgnoringAffix ArrayIndexOutOfBoundsException
  org.joda.time.format.TestPeriodFormatterBuilder#testMonthsAndMinutesAreConsideredSeparateAndCaseIsNotIgnored ArrayIndexOutOfBoundsException
  org.joda.time.format.TestPeriodFormatterBuilder#testPluralAffixParseOrder ArrayIndexOutOfBoundsException
  org.joda.time.format.TestPeriodFormatterBuilder#testRegExAffixParseOrder ArrayIndexOutOfBoundsException

Tests run: 4157, Failures: 0, Errors: 161, Skipped: 0

[INFO] ------------------------------------------------------------------------
[INFO] BUILD FAILURE
[INFO] ------------------------------------------------------------------------
[INFO] Total time: 15.987s
[INFO] Finished at: Thu Aug 06 02:57:28 BST 2015
[INFO] Final Memory: 8M/213M
[INFO] ------------------------------------------------------------------------
[ERROR] Failed to execute goal org.apache.maven.plugins:maven-surefire-plugin:2.18.1:test (default-test) on project joda-time: There are test failures.
[ERROR] 
[ERROR] Please refer to /home/perham/Study/LittleDarwin/Cases/joda-time-2.8.1/target/surefire-reports for the individual test results.
[ERROR] -> [Help 1]
[ERROR] 
[ERROR] To see the full stack trace of the errors, re-run Maven with the -e switch.
[ERROR] Re-run Maven using the -X switch to enable full debug logging.
[ERROR] 
[ERROR] For more information about the errors and possible solutions, please read the following articles:
[ERROR] [Help 1] http://cwiki.apache.org/confluence/display/MAVEN/MojoFailureException
