[INFO] Scanning for projects...
[INFO]                                                                         
[INFO] ------------------------------------------------------------------------
[INFO] Building Joda-Time 2.8.1
[INFO] ------------------------------------------------------------------------
[INFO] 
[INFO] --- maven-resources-plugin:2.7:resources (default-resources) @ joda-time ---
[INFO] Using 'UTF-8' encoding to copy filtered resources.
[INFO] Copying 2 resources to META-INF
[INFO] Copying 10 resources
[INFO] 
[INFO] --- maven-compiler-plugin:3.3:compile (default-compile) @ joda-time ---
[INFO] Changes detected - recompiling the module!
[INFO] Compiling 166 source files to /home/perham/Study/LittleDarwin/Cases/joda-time-2.8.1/target/classes
[INFO] 
[INFO] --- exec-maven-plugin:1.4.0:java (compile-tzdb) @ joda-time ---
Writing zoneinfo files
Writing ZoneInfoMap
[INFO] 
[INFO] --- maven-resources-plugin:2.7:testResources (default-testResources) @ joda-time ---
[INFO] Using 'UTF-8' encoding to copy filtered resources.
[INFO] Copying 34 resources
[INFO] 
[INFO] --- maven-compiler-plugin:3.3:testCompile (default-testCompile) @ joda-time ---
[INFO] Nothing to compile - all classes are up to date
[INFO] 
[INFO] --- maven-surefire-plugin:2.18.1:test (default-test) @ joda-time ---
[INFO] Surefire report directory: /home/perham/Study/LittleDarwin/Cases/joda-time-2.8.1/target/surefire-reports

-------------------------------------------------------
 T E S T S
-------------------------------------------------------
Running org.joda.time.TestAllPackages

TestBuddhistChronology.testCalendar

TestCopticChronology.testCalendar

TestEthiopicChronology.testCalendar

TestIslamicChronology.testCalendar

Testing Gregorian chronology over 1000 iterations
100% complete (i=1000)

Testing Julian chronology over 1000 iterations
100% complete (i=1000)
Writing zoneinfo files
Writing ZoneInfoMap
Tests run: 4157, Failures: 16, Errors: 68, Skipped: 0, Time elapsed: 5.297 sec <<< FAILURE! - in org.joda.time.TestAllPackages
testConstructor_Object6(org.joda.time.TestInterval_Constructors)  Time elapsed: 0.006 sec  <<< ERROR!
java.lang.IllegalArgumentException: No interval converter found for type: org.joda.time.Interval
	at org.joda.time.convert.ConverterManager.getIntervalConverter(ConverterManager.java:513)
	at org.joda.time.TestInterval_Constructors.testConstructor_Object6(TestInterval_Constructors.java:594)

testConstructor_Object_Chronology1(org.joda.time.TestInterval_Constructors)  Time elapsed: 0 sec  <<< ERROR!
java.lang.IllegalArgumentException: No interval converter found for type: org.joda.time.Interval
	at org.joda.time.convert.ConverterManager.getIntervalConverter(ConverterManager.java:513)
	at org.joda.time.base.BaseInterval.<init>(BaseInterval.java:190)
	at org.joda.time.Interval.<init>(Interval.java:212)
	at org.joda.time.TestInterval_Constructors.testConstructor_Object_Chronology1(TestInterval_Constructors.java:687)

testConstructor_Object_Chronology2(org.joda.time.TestInterval_Constructors)  Time elapsed: 0.001 sec  <<< ERROR!
java.lang.IllegalArgumentException: No interval converter found for type: org.joda.time.Interval
	at org.joda.time.convert.ConverterManager.getIntervalConverter(ConverterManager.java:513)
	at org.joda.time.base.BaseInterval.<init>(BaseInterval.java:190)
	at org.joda.time.Interval.<init>(Interval.java:212)
	at org.joda.time.TestInterval_Constructors.testConstructor_Object_Chronology2(TestInterval_Constructors.java:698)

testConstructor_Object2(org.joda.time.TestMutableInterval_Constructors)  Time elapsed: 0.001 sec  <<< ERROR!
java.lang.IllegalArgumentException: No interval converter found for type: org.joda.time.MutableInterval
	at org.joda.time.convert.ConverterManager.getIntervalConverter(ConverterManager.java:513)
	at org.joda.time.base.BaseInterval.<init>(BaseInterval.java:190)
	at org.joda.time.MutableInterval.<init>(MutableInterval.java:186)
	at org.joda.time.TestMutableInterval_Constructors.testConstructor_Object2(TestMutableInterval_Constructors.java:521)

testConstructor_Object3(org.joda.time.TestMutableInterval_Constructors)  Time elapsed: 0.001 sec  <<< ERROR!
java.lang.IllegalArgumentException: No interval converter found for type: org.joda.time.Interval
	at org.joda.time.convert.ConverterManager.getIntervalConverter(ConverterManager.java:513)
	at org.joda.time.base.BaseInterval.<init>(BaseInterval.java:190)
	at org.joda.time.MutableInterval.<init>(MutableInterval.java:186)
	at org.joda.time.TestMutableInterval_Constructors.testConstructor_Object3(TestMutableInterval_Constructors.java:531)

testConstructor_Object4(org.joda.time.TestMutableInterval_Constructors)  Time elapsed: 0.001 sec  <<< ERROR!
java.lang.IllegalArgumentException: No interval converter found for type: org.joda.time.TestMutableInterval_Constructors$MockInterval
	at org.joda.time.convert.ConverterManager.getIntervalConverter(ConverterManager.java:513)
	at org.joda.time.base.BaseInterval.<init>(BaseInterval.java:190)
	at org.joda.time.MutableInterval.<init>(MutableInterval.java:186)
	at org.joda.time.TestMutableInterval_Constructors.testConstructor_Object4(TestMutableInterval_Constructors.java:538)

testConstructor_Object6(org.joda.time.TestMutableInterval_Constructors)  Time elapsed: 0 sec  <<< ERROR!
java.lang.IllegalArgumentException: No interval converter found for type: org.joda.time.MutableInterval
	at org.joda.time.convert.ConverterManager.getIntervalConverter(ConverterManager.java:513)
	at org.joda.time.TestMutableInterval_Constructors.testConstructor_Object6(TestMutableInterval_Constructors.java:570)

testConstructor_Object_Chronology1(org.joda.time.TestMutableInterval_Constructors)  Time elapsed: 0.001 sec  <<< ERROR!
java.lang.IllegalArgumentException: No interval converter found for type: org.joda.time.Interval
	at org.joda.time.convert.ConverterManager.getIntervalConverter(ConverterManager.java:513)
	at org.joda.time.base.BaseInterval.<init>(BaseInterval.java:190)
	at org.joda.time.MutableInterval.<init>(MutableInterval.java:205)
	at org.joda.time.TestMutableInterval_Constructors.testConstructor_Object_Chronology1(TestMutableInterval_Constructors.java:663)

testConstructor_Object_Chronology2(org.joda.time.TestMutableInterval_Constructors)  Time elapsed: 0 sec  <<< ERROR!
java.lang.IllegalArgumentException: No interval converter found for type: org.joda.time.Interval
	at org.joda.time.convert.ConverterManager.getIntervalConverter(ConverterManager.java:513)
	at org.joda.time.base.BaseInterval.<init>(BaseInterval.java:190)
	at org.joda.time.MutableInterval.<init>(MutableInterval.java:205)
	at org.joda.time.TestMutableInterval_Constructors.testConstructor_Object_Chronology2(TestMutableInterval_Constructors.java:674)

testGetIntervalConverter(org.joda.time.convert.TestConverterManager)  Time elapsed: 0 sec  <<< ERROR!
java.lang.IllegalArgumentException: No interval converter found for type: org.joda.time.Interval
	at org.joda.time.convert.ConverterManager.getIntervalConverter(ConverterManager.java:513)
	at org.joda.time.convert.TestConverterManager.testGetIntervalConverter(TestConverterManager.java:843)

testGetIntervalConverterRemovedNull(org.joda.time.convert.TestConverterManager)  Time elapsed: 0.001 sec  <<< FAILURE!
junit.framework.AssertionFailedError: expected:<3> but was:<4>
	at junit.framework.Assert.fail(Assert.java:47)
	at junit.framework.Assert.failNotEquals(Assert.java:280)
	at junit.framework.Assert.assertEquals(Assert.java:64)
	at junit.framework.Assert.assertEquals(Assert.java:198)
	at junit.framework.Assert.assertEquals(Assert.java:204)
	at org.joda.time.convert.TestConverterManager.testGetIntervalConverterRemovedNull(TestConverterManager.java:872)

testGetIntervalConverters(org.joda.time.convert.TestConverterManager)  Time elapsed: 0.001 sec  <<< FAILURE!
junit.framework.AssertionFailedError: expected:<3> but was:<4>
	at junit.framework.Assert.fail(Assert.java:47)
	at junit.framework.Assert.failNotEquals(Assert.java:280)
	at junit.framework.Assert.assertEquals(Assert.java:64)
	at junit.framework.Assert.assertEquals(Assert.java:198)
	at junit.framework.Assert.assertEquals(Assert.java:204)
	at org.joda.time.convert.TestConverterManager.testGetIntervalConverters(TestConverterManager.java:878)

testAddIntervalConverter1(org.joda.time.convert.TestConverterManager)  Time elapsed: 0.002 sec  <<< FAILURE!
junit.framework.AssertionFailedError: expected:<4> but was:<5>
	at junit.framework.Assert.fail(Assert.java:47)
	at junit.framework.Assert.failNotEquals(Assert.java:280)
	at junit.framework.Assert.assertEquals(Assert.java:64)
	at junit.framework.Assert.assertEquals(Assert.java:198)
	at junit.framework.Assert.assertEquals(Assert.java:204)
	at org.joda.time.convert.TestConverterManager.testAddIntervalConverter1(TestConverterManager.java:892)

testAddIntervalConverter2(org.joda.time.convert.TestConverterManager)  Time elapsed: 0.001 sec  <<< FAILURE!
junit.framework.AssertionFailedError: expected:<Converter[java.lang.String]> but was:<org.joda.time.TestInterval_Constructors$1@5f2d8ca1>
	at junit.framework.Assert.fail(Assert.java:47)
	at junit.framework.Assert.failNotEquals(Assert.java:280)
	at junit.framework.Assert.assertEquals(Assert.java:64)
	at junit.framework.Assert.assertEquals(Assert.java:71)
	at org.joda.time.convert.TestConverterManager.testAddIntervalConverter2(TestConverterManager.java:907)

testAddIntervalConverter3(org.joda.time.convert.TestConverterManager)  Time elapsed: 0.001 sec  <<< FAILURE!
junit.framework.AssertionFailedError: expected:<3> but was:<4>
	at junit.framework.Assert.fail(Assert.java:47)
	at junit.framework.Assert.failNotEquals(Assert.java:280)
	at junit.framework.Assert.assertEquals(Assert.java:64)
	at junit.framework.Assert.assertEquals(Assert.java:198)
	at junit.framework.Assert.assertEquals(Assert.java:204)
	at org.joda.time.convert.TestConverterManager.testAddIntervalConverter3(TestConverterManager.java:919)

testRemoveIntervalConverter1(org.joda.time.convert.TestConverterManager)  Time elapsed: 0.001 sec  <<< FAILURE!
junit.framework.AssertionFailedError: expected:<2> but was:<3>
	at junit.framework.Assert.fail(Assert.java:47)
	at junit.framework.Assert.failNotEquals(Assert.java:280)
	at junit.framework.Assert.assertEquals(Assert.java:64)
	at junit.framework.Assert.assertEquals(Assert.java:198)
	at junit.framework.Assert.assertEquals(Assert.java:204)
	at org.joda.time.convert.TestConverterManager.testRemoveIntervalConverter1(TestConverterManager.java:945)

testAddPartialConverter3(org.joda.time.convert.TestConverterManager)  Time elapsed: 0.001 sec  <<< FAILURE!
junit.framework.AssertionFailedError: expected:<null> but was:<org.joda.time.convert.TestConverterManager$11@1c0f3a6e>
	at junit.framework.Assert.fail(Assert.java:47)
	at junit.framework.Assert.failNotEquals(Assert.java:280)
	at junit.framework.Assert.assertEquals(Assert.java:64)
	at junit.framework.Assert.assertEquals(Assert.java:71)
	at org.joda.time.convert.TestConverterManager.testAddPartialConverter3(TestConverterManager.java:462)

testRemovePartialConverter1(org.joda.time.convert.TestConverterManager)  Time elapsed: 0.001 sec  <<< FAILURE!
junit.framework.AssertionFailedError: expected:<7> but was:<6>
	at junit.framework.Assert.fail(Assert.java:47)
	at junit.framework.Assert.failNotEquals(Assert.java:280)
	at junit.framework.Assert.assertEquals(Assert.java:64)
	at junit.framework.Assert.assertEquals(Assert.java:198)
	at junit.framework.Assert.assertEquals(Assert.java:204)
	at org.joda.time.convert.TestConverterManager.testRemovePartialConverter1(TestConverterManager.java:499)

testRemovePartialConverter2(org.joda.time.convert.TestConverterManager)  Time elapsed: 0.001 sec  <<< FAILURE!
junit.framework.AssertionFailedError: expected:<7> but was:<6>
	at junit.framework.Assert.fail(Assert.java:47)
	at junit.framework.Assert.failNotEquals(Assert.java:280)
	at junit.framework.Assert.assertEquals(Assert.java:64)
	at junit.framework.Assert.assertEquals(Assert.java:198)
	at junit.framework.Assert.assertEquals(Assert.java:204)
	at org.joda.time.convert.TestConverterManager.testRemovePartialConverter2(TestConverterManager.java:512)

testRemovePartialConverter3(org.joda.time.convert.TestConverterManager)  Time elapsed: 0 sec  <<< FAILURE!
junit.framework.AssertionFailedError: expected:<7> but was:<6>
	at junit.framework.Assert.fail(Assert.java:47)
	at junit.framework.Assert.failNotEquals(Assert.java:280)
	at junit.framework.Assert.assertEquals(Assert.java:64)
	at junit.framework.Assert.assertEquals(Assert.java:198)
	at junit.framework.Assert.assertEquals(Assert.java:204)
	at org.joda.time.convert.TestConverterManager.testRemovePartialConverter3(TestConverterManager.java:518)

testRemoveDurationConverter1(org.joda.time.convert.TestConverterManager)  Time elapsed: 0.001 sec  <<< FAILURE!
junit.framework.AssertionFailedError: expected:<5> but was:<4>
	at junit.framework.Assert.fail(Assert.java:47)
	at junit.framework.Assert.failNotEquals(Assert.java:280)
	at junit.framework.Assert.assertEquals(Assert.java:64)
	at junit.framework.Assert.assertEquals(Assert.java:198)
	at junit.framework.Assert.assertEquals(Assert.java:204)
	at org.joda.time.convert.TestConverterManager.testRemoveDurationConverter1(TestConverterManager.java:650)

testRemoveDurationConverter2(org.joda.time.convert.TestConverterManager)  Time elapsed: 0.001 sec  <<< FAILURE!
junit.framework.AssertionFailedError: expected:<5> but was:<4>
	at junit.framework.Assert.fail(Assert.java:47)
	at junit.framework.Assert.failNotEquals(Assert.java:280)
	at junit.framework.Assert.assertEquals(Assert.java:64)
	at junit.framework.Assert.assertEquals(Assert.java:198)
	at junit.framework.Assert.assertEquals(Assert.java:204)
	at org.joda.time.convert.TestConverterManager.testRemoveDurationConverter2(TestConverterManager.java:660)

testRemoveDurationConverter3(org.joda.time.convert.TestConverterManager)  Time elapsed: 0.001 sec  <<< FAILURE!
junit.framework.AssertionFailedError: expected:<5> but was:<4>
	at junit.framework.Assert.fail(Assert.java:47)
	at junit.framework.Assert.failNotEquals(Assert.java:280)
	at junit.framework.Assert.assertEquals(Assert.java:64)
	at junit.framework.Assert.assertEquals(Assert.java:198)
	at junit.framework.Assert.assertEquals(Assert.java:204)
	at org.joda.time.convert.TestConverterManager.testRemoveDurationConverter3(TestConverterManager.java:666)

testRemovePeriodConverter1(org.joda.time.convert.TestConverterManager)  Time elapsed: 0.001 sec  <<< FAILURE!
junit.framework.AssertionFailedError: expected:<5> but was:<4>
	at junit.framework.Assert.fail(Assert.java:47)
	at junit.framework.Assert.failNotEquals(Assert.java:280)
	at junit.framework.Assert.assertEquals(Assert.java:64)
	at junit.framework.Assert.assertEquals(Assert.java:198)
	at junit.framework.Assert.assertEquals(Assert.java:204)
	at org.joda.time.convert.TestConverterManager.testRemovePeriodConverter1(TestConverterManager.java:800)

testAddInstantConverter3(org.joda.time.convert.TestConverterManager)  Time elapsed: 0.001 sec  <<< FAILURE!
junit.framework.AssertionFailedError: expected:<null> but was:<org.joda.time.convert.TestConverterManager$6@51f2c9bf>
	at junit.framework.Assert.fail(Assert.java:47)
	at junit.framework.Assert.failNotEquals(Assert.java:280)
	at junit.framework.Assert.assertEquals(Assert.java:64)
	at junit.framework.Assert.assertEquals(Assert.java:71)
	at org.joda.time.convert.TestConverterManager.testAddInstantConverter3(TestConverterManager.java:253)

testRemoveInstantConverter1(org.joda.time.convert.TestConverterManager)  Time elapsed: 0 sec  <<< FAILURE!
junit.framework.AssertionFailedError: expected:<6> but was:<5>
	at junit.framework.Assert.fail(Assert.java:47)
	at junit.framework.Assert.failNotEquals(Assert.java:280)
	at junit.framework.Assert.assertEquals(Assert.java:64)
	at junit.framework.Assert.assertEquals(Assert.java:198)
	at junit.framework.Assert.assertEquals(Assert.java:204)
	at org.joda.time.convert.TestConverterManager.testRemoveInstantConverter1(TestConverterManager.java:290)

testSetIntoInterval_Object_Chronology1(org.joda.time.convert.TestStringConverter)  Time elapsed: 0.001 sec  <<< ERROR!
java.lang.IllegalArgumentException: No period converter found for type: org.joda.time.MutablePeriod
	at org.joda.time.convert.ConverterManager.getPeriodConverter(ConverterManager.java:426)
	at org.joda.time.base.BasePeriod.<init>(BasePeriod.java:272)
	at org.joda.time.Period.<init>(Period.java:674)
	at org.joda.time.base.AbstractPeriod.toPeriod(AbstractPeriod.java:147)
	at org.joda.time.format.PeriodFormatter.parsePeriod(PeriodFormatter.java:308)
	at org.joda.time.convert.StringConverter.setInto(StringConverter.java:223)
	at org.joda.time.convert.TestStringConverter.testSetIntoInterval_Object_Chronology1(TestStringConverter.java:476)

testSetIntoInterval_Object_Chronology2(org.joda.time.convert.TestStringConverter)  Time elapsed: 0 sec  <<< ERROR!
java.lang.IllegalArgumentException: No period converter found for type: org.joda.time.MutablePeriod
	at org.joda.time.convert.ConverterManager.getPeriodConverter(ConverterManager.java:426)
	at org.joda.time.base.BasePeriod.<init>(BasePeriod.java:272)
	at org.joda.time.Period.<init>(Period.java:674)
	at org.joda.time.base.AbstractPeriod.toPeriod(AbstractPeriod.java:147)
	at org.joda.time.format.PeriodFormatter.parsePeriod(PeriodFormatter.java:308)
	at org.joda.time.convert.StringConverter.setInto(StringConverter.java:210)
	at org.joda.time.convert.TestStringConverter.testSetIntoInterval_Object_Chronology2(TestStringConverter.java:484)

testSetIntoInterval_Object_Chronology4(org.joda.time.convert.TestStringConverter)  Time elapsed: 0 sec  <<< ERROR!
java.lang.IllegalArgumentException: No period converter found for type: org.joda.time.MutablePeriod
	at org.joda.time.convert.ConverterManager.getPeriodConverter(ConverterManager.java:426)
	at org.joda.time.base.BasePeriod.<init>(BasePeriod.java:272)
	at org.joda.time.Period.<init>(Period.java:674)
	at org.joda.time.base.AbstractPeriod.toPeriod(AbstractPeriod.java:147)
	at org.joda.time.format.PeriodFormatter.parsePeriod(PeriodFormatter.java:308)
	at org.joda.time.convert.StringConverter.setInto(StringConverter.java:223)
	at org.joda.time.convert.TestStringConverter.testSetIntoInterval_Object_Chronology4(TestStringConverter.java:500)

testSetIntoInterval_Object_Chronology5(org.joda.time.convert.TestStringConverter)  Time elapsed: 0.001 sec  <<< ERROR!
java.lang.IllegalArgumentException: No period converter found for type: org.joda.time.MutablePeriod
	at org.joda.time.convert.ConverterManager.getPeriodConverter(ConverterManager.java:426)
	at org.joda.time.base.BasePeriod.<init>(BasePeriod.java:272)
	at org.joda.time.Period.<init>(Period.java:674)
	at org.joda.time.base.AbstractPeriod.toPeriod(AbstractPeriod.java:147)
	at org.joda.time.format.PeriodFormatter.parsePeriod(PeriodFormatter.java:308)
	at org.joda.time.convert.StringConverter.setInto(StringConverter.java:210)
	at org.joda.time.convert.TestStringConverter.testSetIntoInterval_Object_Chronology5(TestStringConverter.java:508)

testForStyle_shortDate(org.joda.time.format.TestDateTimeFormatStyle)  Time elapsed: 0.001 sec  <<< ERROR!
java.lang.IllegalArgumentException: No instant converter found for type: java.util.Date
	at org.joda.time.convert.ConverterManager.getInstantConverter(ConverterManager.java:165)
	at org.joda.time.base.BaseDateTime.<init>(BaseDateTime.java:173)
	at org.joda.time.DateTime.<init>(DateTime.java:257)
	at org.joda.time.format.TestDateTimeFormatStyle.testForStyle_shortDate(TestDateTimeFormatStyle.java:139)

testForStyle_shortTime(org.joda.time.format.TestDateTimeFormatStyle)  Time elapsed: 0.001 sec  <<< ERROR!
java.lang.IllegalArgumentException: No instant converter found for type: java.util.Date
	at org.joda.time.convert.ConverterManager.getInstantConverter(ConverterManager.java:165)
	at org.joda.time.base.BaseDateTime.<init>(BaseDateTime.java:173)
	at org.joda.time.DateTime.<init>(DateTime.java:257)
	at org.joda.time.format.TestDateTimeFormatStyle.testForStyle_shortTime(TestDateTimeFormatStyle.java:159)

testForStyle_shortDateTime(org.joda.time.format.TestDateTimeFormatStyle)  Time elapsed: 0.002 sec  <<< ERROR!
java.lang.IllegalArgumentException: No instant converter found for type: java.util.Date
	at org.joda.time.convert.ConverterManager.getInstantConverter(ConverterManager.java:165)
	at org.joda.time.base.BaseDateTime.<init>(BaseDateTime.java:173)
	at org.joda.time.DateTime.<init>(DateTime.java:257)
	at org.joda.time.format.TestDateTimeFormatStyle.testForStyle_shortDateTime(TestDateTimeFormatStyle.java:177)

testPrinterParserMethods(org.joda.time.format.TestPeriodFormatter)  Time elapsed: 0.001 sec  <<< ERROR!
java.lang.IllegalArgumentException: No period converter found for type: org.joda.time.MutablePeriod
	at org.joda.time.convert.ConverterManager.getPeriodConverter(ConverterManager.java:426)
	at org.joda.time.base.BasePeriod.<init>(BasePeriod.java:272)
	at org.joda.time.Period.<init>(Period.java:674)
	at org.joda.time.base.AbstractPeriod.toPeriod(AbstractPeriod.java:147)
	at org.joda.time.format.PeriodFormatter.parsePeriod(PeriodFormatter.java:308)
	at org.joda.time.format.TestPeriodFormatter.testPrinterParserMethods(TestPeriodFormatter.java:161)

testParsePeriod_simple(org.joda.time.format.TestPeriodFormatter)  Time elapsed: 0.001 sec  <<< ERROR!
java.lang.IllegalArgumentException: No period converter found for type: org.joda.time.MutablePeriod
	at org.joda.time.convert.ConverterManager.getPeriodConverter(ConverterManager.java:426)
	at org.joda.time.base.BasePeriod.<init>(BasePeriod.java:272)
	at org.joda.time.Period.<init>(Period.java:674)
	at org.joda.time.base.AbstractPeriod.toPeriod(AbstractPeriod.java:147)
	at org.joda.time.format.PeriodFormatter.parsePeriod(PeriodFormatter.java:308)
	at org.joda.time.format.TestPeriodFormatter.testParsePeriod_simple(TestPeriodFormatter.java:189)

testParsePeriod_parseType(org.joda.time.format.TestPeriodFormatter)  Time elapsed: 0 sec  <<< ERROR!
java.lang.IllegalArgumentException: No period converter found for type: org.joda.time.MutablePeriod
	at org.joda.time.convert.ConverterManager.getPeriodConverter(ConverterManager.java:426)
	at org.joda.time.base.BasePeriod.<init>(BasePeriod.java:272)
	at org.joda.time.Period.<init>(Period.java:674)
	at org.joda.time.base.AbstractPeriod.toPeriod(AbstractPeriod.java:147)
	at org.joda.time.format.PeriodFormatter.parsePeriod(PeriodFormatter.java:308)
	at org.joda.time.format.TestPeriodFormatter.testParsePeriod_parseType(TestPeriodFormatter.java:199)

test_wordBased_fr_parseOneField(org.joda.time.format.TestPeriodFormat)  Time elapsed: 0.001 sec  <<< ERROR!
java.lang.IllegalArgumentException: No period converter found for type: org.joda.time.MutablePeriod
	at org.joda.time.convert.ConverterManager.getPeriodConverter(ConverterManager.java:426)
	at org.joda.time.base.BasePeriod.<init>(BasePeriod.java:272)
	at org.joda.time.Period.<init>(Period.java:674)
	at org.joda.time.base.AbstractPeriod.toPeriod(AbstractPeriod.java:147)
	at org.joda.time.format.PeriodFormatter.parsePeriod(PeriodFormatter.java:308)
	at org.joda.time.format.TestPeriodFormat.test_wordBased_fr_parseOneField(TestPeriodFormat.java:152)

test_wordBased_fr_parseTwoFields(org.joda.time.format.TestPeriodFormat)  Time elapsed: 0 sec  <<< ERROR!
java.lang.IllegalArgumentException: No period converter found for type: org.joda.time.MutablePeriod
	at org.joda.time.convert.ConverterManager.getPeriodConverter(ConverterManager.java:426)
	at org.joda.time.base.BasePeriod.<init>(BasePeriod.java:272)
	at org.joda.time.Period.<init>(Period.java:674)
	at org.joda.time.base.AbstractPeriod.toPeriod(AbstractPeriod.java:147)
	at org.joda.time.format.PeriodFormatter.parsePeriod(PeriodFormatter.java:308)
	at org.joda.time.format.TestPeriodFormat.test_wordBased_fr_parseTwoFields(TestPeriodFormat.java:158)

test_wordBased_pt_parseOneField(org.joda.time.format.TestPeriodFormat)  Time elapsed: 0.001 sec  <<< ERROR!
java.lang.IllegalArgumentException: No period converter found for type: org.joda.time.MutablePeriod
	at org.joda.time.convert.ConverterManager.getPeriodConverter(ConverterManager.java:426)
	at org.joda.time.base.BasePeriod.<init>(BasePeriod.java:272)
	at org.joda.time.Period.<init>(Period.java:674)
	at org.joda.time.base.AbstractPeriod.toPeriod(AbstractPeriod.java:147)
	at org.joda.time.format.PeriodFormatter.parsePeriod(PeriodFormatter.java:308)
	at org.joda.time.format.TestPeriodFormat.test_wordBased_pt_parseOneField(TestPeriodFormat.java:189)

test_wordBased_pt_parseTwoFields(org.joda.time.format.TestPeriodFormat)  Time elapsed: 0 sec  <<< ERROR!
java.lang.IllegalArgumentException: No period converter found for type: org.joda.time.MutablePeriod
	at org.joda.time.convert.ConverterManager.getPeriodConverter(ConverterManager.java:426)
	at org.joda.time.base.BasePeriod.<init>(BasePeriod.java:272)
	at org.joda.time.Period.<init>(Period.java:674)
	at org.joda.time.base.AbstractPeriod.toPeriod(AbstractPeriod.java:147)
	at org.joda.time.format.PeriodFormatter.parsePeriod(PeriodFormatter.java:308)
	at org.joda.time.format.TestPeriodFormat.test_wordBased_pt_parseTwoFields(TestPeriodFormat.java:195)

test_wordBased_es_parseOneField(org.joda.time.format.TestPeriodFormat)  Time elapsed: 0.001 sec  <<< ERROR!
java.lang.IllegalArgumentException: No period converter found for type: org.joda.time.MutablePeriod
	at org.joda.time.convert.ConverterManager.getPeriodConverter(ConverterManager.java:426)
	at org.joda.time.base.BasePeriod.<init>(BasePeriod.java:272)
	at org.joda.time.Period.<init>(Period.java:674)
	at org.joda.time.base.AbstractPeriod.toPeriod(AbstractPeriod.java:147)
	at org.joda.time.format.PeriodFormatter.parsePeriod(PeriodFormatter.java:308)
	at org.joda.time.format.TestPeriodFormat.test_wordBased_es_parseOneField(TestPeriodFormat.java:226)

test_wordBased_es_parseTwoFields(org.joda.time.format.TestPeriodFormat)  Time elapsed: 0 sec  <<< ERROR!
java.lang.IllegalArgumentException: No period converter found for type: org.joda.time.MutablePeriod
	at org.joda.time.convert.ConverterManager.getPeriodConverter(ConverterManager.java:426)
	at org.joda.time.base.BasePeriod.<init>(BasePeriod.java:272)
	at org.joda.time.Period.<init>(Period.java:674)
	at org.joda.time.base.AbstractPeriod.toPeriod(AbstractPeriod.java:147)
	at org.joda.time.format.PeriodFormatter.parsePeriod(PeriodFormatter.java:308)
	at org.joda.time.format.TestPeriodFormat.test_wordBased_es_parseTwoFields(TestPeriodFormat.java:232)

test_wordBased_de_parseOneField(org.joda.time.format.TestPeriodFormat)  Time elapsed: 0 sec  <<< ERROR!
java.lang.IllegalArgumentException: No period converter found for type: org.joda.time.MutablePeriod
	at org.joda.time.convert.ConverterManager.getPeriodConverter(ConverterManager.java:426)
	at org.joda.time.base.BasePeriod.<init>(BasePeriod.java:272)
	at org.joda.time.Period.<init>(Period.java:674)
	at org.joda.time.base.AbstractPeriod.toPeriod(AbstractPeriod.java:147)
	at org.joda.time.format.PeriodFormatter.parsePeriod(PeriodFormatter.java:308)
	at org.joda.time.format.TestPeriodFormat.test_wordBased_de_parseOneField(TestPeriodFormat.java:263)

test_wordBased_de_parseTwoFields(org.joda.time.format.TestPeriodFormat)  Time elapsed: 0 sec  <<< ERROR!
java.lang.IllegalArgumentException: No period converter found for type: org.joda.time.MutablePeriod
	at org.joda.time.convert.ConverterManager.getPeriodConverter(ConverterManager.java:426)
	at org.joda.time.base.BasePeriod.<init>(BasePeriod.java:272)
	at org.joda.time.Period.<init>(Period.java:674)
	at org.joda.time.base.AbstractPeriod.toPeriod(AbstractPeriod.java:147)
	at org.joda.time.format.PeriodFormatter.parsePeriod(PeriodFormatter.java:308)
	at org.joda.time.format.TestPeriodFormat.test_wordBased_de_parseTwoFields(TestPeriodFormat.java:269)

test_wordBased_nl_parseOneField(org.joda.time.format.TestPeriodFormat)  Time elapsed: 0.001 sec  <<< ERROR!
java.lang.IllegalArgumentException: No period converter found for type: org.joda.time.MutablePeriod
	at org.joda.time.convert.ConverterManager.getPeriodConverter(ConverterManager.java:426)
	at org.joda.time.base.BasePeriod.<init>(BasePeriod.java:272)
	at org.joda.time.Period.<init>(Period.java:674)
	at org.joda.time.base.AbstractPeriod.toPeriod(AbstractPeriod.java:147)
	at org.joda.time.format.PeriodFormatter.parsePeriod(PeriodFormatter.java:308)
	at org.joda.time.format.TestPeriodFormat.test_wordBased_nl_parseOneField(TestPeriodFormat.java:300)

test_wordBased_nl_parseTwoFields(org.joda.time.format.TestPeriodFormat)  Time elapsed: 0.001 sec  <<< ERROR!
java.lang.IllegalArgumentException: No period converter found for type: org.joda.time.MutablePeriod
	at org.joda.time.convert.ConverterManager.getPeriodConverter(ConverterManager.java:426)
	at org.joda.time.base.BasePeriod.<init>(BasePeriod.java:272)
	at org.joda.time.Period.<init>(Period.java:674)
	at org.joda.time.base.AbstractPeriod.toPeriod(AbstractPeriod.java:147)
	at org.joda.time.format.PeriodFormatter.parsePeriod(PeriodFormatter.java:308)
	at org.joda.time.format.TestPeriodFormat.test_wordBased_nl_parseTwoFields(TestPeriodFormat.java:306)

test_wordBased_ja_parseOneField(org.joda.time.format.TestPeriodFormat)  Time elapsed: 0.001 sec  <<< ERROR!
java.lang.IllegalArgumentException: No period converter found for type: org.joda.time.MutablePeriod
	at org.joda.time.convert.ConverterManager.getPeriodConverter(ConverterManager.java:426)
	at org.joda.time.base.BasePeriod.<init>(BasePeriod.java:272)
	at org.joda.time.Period.<init>(Period.java:674)
	at org.joda.time.base.AbstractPeriod.toPeriod(AbstractPeriod.java:147)
	at org.joda.time.format.PeriodFormatter.parsePeriod(PeriodFormatter.java:308)
	at org.joda.time.format.TestPeriodFormat.test_wordBased_ja_parseOneField(TestPeriodFormat.java:355)

test_wordBased_ja_parseTwoFields(org.joda.time.format.TestPeriodFormat)  Time elapsed: 0 sec  <<< ERROR!
java.lang.IllegalArgumentException: No period converter found for type: org.joda.time.MutablePeriod
	at org.joda.time.convert.ConverterManager.getPeriodConverter(ConverterManager.java:426)
	at org.joda.time.base.BasePeriod.<init>(BasePeriod.java:272)
	at org.joda.time.Period.<init>(Period.java:674)
	at org.joda.time.base.AbstractPeriod.toPeriod(AbstractPeriod.java:147)
	at org.joda.time.format.PeriodFormatter.parsePeriod(PeriodFormatter.java:308)
	at org.joda.time.format.TestPeriodFormat.test_wordBased_ja_parseTwoFields(TestPeriodFormat.java:361)

test_wordBased_pl_parseOneField(org.joda.time.format.TestPeriodFormat)  Time elapsed: 0.001 sec  <<< ERROR!
java.lang.IllegalArgumentException: No period converter found for type: org.joda.time.MutablePeriod
	at org.joda.time.convert.ConverterManager.getPeriodConverter(ConverterManager.java:426)
	at org.joda.time.base.BasePeriod.<init>(BasePeriod.java:272)
	at org.joda.time.Period.<init>(Period.java:674)
	at org.joda.time.base.AbstractPeriod.toPeriod(AbstractPeriod.java:147)
	at org.joda.time.format.PeriodFormatter.parsePeriod(PeriodFormatter.java:308)
	at org.joda.time.format.TestPeriodFormat.test_wordBased_pl_parseOneField(TestPeriodFormat.java:398)

test_wordBased_pl_parseTwoFields(org.joda.time.format.TestPeriodFormat)  Time elapsed: 0 sec  <<< ERROR!
java.lang.IllegalArgumentException: No period converter found for type: org.joda.time.MutablePeriod
	at org.joda.time.convert.ConverterManager.getPeriodConverter(ConverterManager.java:426)
	at org.joda.time.base.BasePeriod.<init>(BasePeriod.java:272)
	at org.joda.time.Period.<init>(Period.java:674)
	at org.joda.time.base.AbstractPeriod.toPeriod(AbstractPeriod.java:147)
	at org.joda.time.format.PeriodFormatter.parsePeriod(PeriodFormatter.java:308)
	at org.joda.time.format.TestPeriodFormat.test_wordBased_pl_parseTwoFields(TestPeriodFormat.java:404)

test_wordBased_en_withLocale_pt(org.joda.time.format.TestPeriodFormat)  Time elapsed: 0.001 sec  <<< ERROR!
java.lang.IllegalArgumentException: No period converter found for type: org.joda.time.MutablePeriod
	at org.joda.time.convert.ConverterManager.getPeriodConverter(ConverterManager.java:426)
	at org.joda.time.base.BasePeriod.<init>(BasePeriod.java:272)
	at org.joda.time.Period.<init>(Period.java:674)
	at org.joda.time.base.AbstractPeriod.toPeriod(AbstractPeriod.java:147)
	at org.joda.time.format.PeriodFormatter.parsePeriod(PeriodFormatter.java:308)
	at org.joda.time.format.TestPeriodFormat.test_wordBased_en_withLocale_pt(TestPeriodFormat.java:634)

test_getDefault_parseOneField(org.joda.time.format.TestPeriodFormat)  Time elapsed: 0.001 sec  <<< ERROR!
java.lang.IllegalArgumentException: No period converter found for type: org.joda.time.MutablePeriod
	at org.joda.time.convert.ConverterManager.getPeriodConverter(ConverterManager.java:426)
	at org.joda.time.base.BasePeriod.<init>(BasePeriod.java:272)
	at org.joda.time.Period.<init>(Period.java:674)
	at org.joda.time.base.AbstractPeriod.toPeriod(AbstractPeriod.java:147)
	at org.joda.time.format.PeriodFormatter.parsePeriod(PeriodFormatter.java:308)
	at org.joda.time.format.TestPeriodFormat.test_getDefault_parseOneField(TestPeriodFormat.java:97)

test_getDefault_parseTwoFields(org.joda.time.format.TestPeriodFormat)  Time elapsed: 0 sec  <<< ERROR!
java.lang.IllegalArgumentException: No period converter found for type: org.joda.time.MutablePeriod
	at org.joda.time.convert.ConverterManager.getPeriodConverter(ConverterManager.java:426)
	at org.joda.time.base.BasePeriod.<init>(BasePeriod.java:272)
	at org.joda.time.Period.<init>(Period.java:674)
	at org.joda.time.base.AbstractPeriod.toPeriod(AbstractPeriod.java:147)
	at org.joda.time.format.PeriodFormatter.parsePeriod(PeriodFormatter.java:308)
	at org.joda.time.format.TestPeriodFormat.test_getDefault_parseTwoFields(TestPeriodFormat.java:103)

testParseStandard1(org.joda.time.format.TestISOPeriodFormatParsing)  Time elapsed: 0.001 sec  <<< ERROR!
java.lang.IllegalArgumentException: No period converter found for type: org.joda.time.MutablePeriod
	at org.joda.time.convert.ConverterManager.getPeriodConverter(ConverterManager.java:426)
	at org.joda.time.base.BasePeriod.<init>(BasePeriod.java:272)
	at org.joda.time.Period.<init>(Period.java:674)
	at org.joda.time.base.AbstractPeriod.toPeriod(AbstractPeriod.java:147)
	at org.joda.time.format.PeriodFormatter.parsePeriod(PeriodFormatter.java:308)
	at org.joda.time.format.TestISOPeriodFormatParsing.testParseStandard1(TestISOPeriodFormatParsing.java:94)

testParseStandard2(org.joda.time.format.TestISOPeriodFormatParsing)  Time elapsed: 0 sec  <<< ERROR!
java.lang.IllegalArgumentException: No period converter found for type: org.joda.time.MutablePeriod
	at org.joda.time.convert.ConverterManager.getPeriodConverter(ConverterManager.java:426)
	at org.joda.time.base.BasePeriod.<init>(BasePeriod.java:272)
	at org.joda.time.Period.<init>(Period.java:674)
	at org.joda.time.base.AbstractPeriod.toPeriod(AbstractPeriod.java:147)
	at org.joda.time.format.PeriodFormatter.parsePeriod(PeriodFormatter.java:308)
	at org.joda.time.format.TestISOPeriodFormatParsing.testParseStandard2(TestISOPeriodFormatParsing.java:101)

testParseStandard3(org.joda.time.format.TestISOPeriodFormatParsing)  Time elapsed: 0 sec  <<< ERROR!
java.lang.IllegalArgumentException: No period converter found for type: org.joda.time.MutablePeriod
	at org.joda.time.convert.ConverterManager.getPeriodConverter(ConverterManager.java:426)
	at org.joda.time.base.BasePeriod.<init>(BasePeriod.java:272)
	at org.joda.time.Period.<init>(Period.java:674)
	at org.joda.time.base.AbstractPeriod.toPeriod(AbstractPeriod.java:147)
	at org.joda.time.format.PeriodFormatter.parsePeriod(PeriodFormatter.java:308)
	at org.joda.time.format.TestISOPeriodFormatParsing.testParseStandard3(TestISOPeriodFormatParsing.java:108)

testParseStandard4(org.joda.time.format.TestISOPeriodFormatParsing)  Time elapsed: 0.001 sec  <<< ERROR!
java.lang.IllegalArgumentException: No period converter found for type: org.joda.time.MutablePeriod
	at org.joda.time.convert.ConverterManager.getPeriodConverter(ConverterManager.java:426)
	at org.joda.time.base.BasePeriod.<init>(BasePeriod.java:272)
	at org.joda.time.Period.<init>(Period.java:674)
	at org.joda.time.base.AbstractPeriod.toPeriod(AbstractPeriod.java:147)
	at org.joda.time.format.PeriodFormatter.parsePeriod(PeriodFormatter.java:308)
	at org.joda.time.format.TestISOPeriodFormatParsing.testParseStandard4(TestISOPeriodFormatParsing.java:115)

testParseStandard5(org.joda.time.format.TestISOPeriodFormatParsing)  Time elapsed: 0 sec  <<< ERROR!
java.lang.IllegalArgumentException: No period converter found for type: org.joda.time.MutablePeriod
	at org.joda.time.convert.ConverterManager.getPeriodConverter(ConverterManager.java:426)
	at org.joda.time.base.BasePeriod.<init>(BasePeriod.java:272)
	at org.joda.time.Period.<init>(Period.java:674)
	at org.joda.time.base.AbstractPeriod.toPeriod(AbstractPeriod.java:147)
	at org.joda.time.format.PeriodFormatter.parsePeriod(PeriodFormatter.java:308)
	at org.joda.time.format.TestISOPeriodFormatParsing.testParseStandard5(TestISOPeriodFormatParsing.java:122)

testParseStandard6(org.joda.time.format.TestISOPeriodFormatParsing)  Time elapsed: 0.001 sec  <<< ERROR!
java.lang.IllegalArgumentException: No period converter found for type: org.joda.time.MutablePeriod
	at org.joda.time.convert.ConverterManager.getPeriodConverter(ConverterManager.java:426)
	at org.joda.time.base.BasePeriod.<init>(BasePeriod.java:272)
	at org.joda.time.Period.<init>(Period.java:674)
	at org.joda.time.base.AbstractPeriod.toPeriod(AbstractPeriod.java:147)
	at org.joda.time.format.PeriodFormatter.parsePeriod(PeriodFormatter.java:308)
	at org.joda.time.format.TestISOPeriodFormatParsing.testParseStandard6(TestISOPeriodFormatParsing.java:129)

testParseStandard7(org.joda.time.format.TestISOPeriodFormatParsing)  Time elapsed: 0 sec  <<< ERROR!
java.lang.IllegalArgumentException: No period converter found for type: org.joda.time.MutablePeriod
	at org.joda.time.convert.ConverterManager.getPeriodConverter(ConverterManager.java:426)
	at org.joda.time.base.BasePeriod.<init>(BasePeriod.java:272)
	at org.joda.time.Period.<init>(Period.java:674)
	at org.joda.time.base.AbstractPeriod.toPeriod(AbstractPeriod.java:147)
	at org.joda.time.format.PeriodFormatter.parsePeriod(PeriodFormatter.java:308)
	at org.joda.time.format.TestISOPeriodFormatParsing.testParseStandard7(TestISOPeriodFormatParsing.java:136)

testParseStandard8(org.joda.time.format.TestISOPeriodFormatParsing)  Time elapsed: 0.001 sec  <<< ERROR!
java.lang.IllegalArgumentException: No period converter found for type: org.joda.time.MutablePeriod
	at org.joda.time.convert.ConverterManager.getPeriodConverter(ConverterManager.java:426)
	at org.joda.time.base.BasePeriod.<init>(BasePeriod.java:272)
	at org.joda.time.Period.<init>(Period.java:674)
	at org.joda.time.base.AbstractPeriod.toPeriod(AbstractPeriod.java:147)
	at org.joda.time.format.PeriodFormatter.parsePeriod(PeriodFormatter.java:308)
	at org.joda.time.format.TestISOPeriodFormatParsing.testParseStandard8(TestISOPeriodFormatParsing.java:143)

testParseStandard9(org.joda.time.format.TestISOPeriodFormatParsing)  Time elapsed: 0 sec  <<< ERROR!
java.lang.IllegalArgumentException: No period converter found for type: org.joda.time.MutablePeriod
	at org.joda.time.convert.ConverterManager.getPeriodConverter(ConverterManager.java:426)
	at org.joda.time.base.BasePeriod.<init>(BasePeriod.java:272)
	at org.joda.time.Period.<init>(Period.java:674)
	at org.joda.time.base.AbstractPeriod.toPeriod(AbstractPeriod.java:147)
	at org.joda.time.format.PeriodFormatter.parsePeriod(PeriodFormatter.java:308)
	at org.joda.time.format.TestISOPeriodFormatParsing.testParseStandard9(TestISOPeriodFormatParsing.java:150)

testParseStandard10(org.joda.time.format.TestISOPeriodFormatParsing)  Time elapsed: 0 sec  <<< ERROR!
java.lang.IllegalArgumentException: No period converter found for type: org.joda.time.MutablePeriod
	at org.joda.time.convert.ConverterManager.getPeriodConverter(ConverterManager.java:426)
	at org.joda.time.base.BasePeriod.<init>(BasePeriod.java:272)
	at org.joda.time.Period.<init>(Period.java:674)
	at org.joda.time.base.AbstractPeriod.toPeriod(AbstractPeriod.java:147)
	at org.joda.time.format.PeriodFormatter.parsePeriod(PeriodFormatter.java:308)
	at org.joda.time.format.TestISOPeriodFormatParsing.testParseStandard10(TestISOPeriodFormatParsing.java:157)

testParseStandard11(org.joda.time.format.TestISOPeriodFormatParsing)  Time elapsed: 0.001 sec  <<< ERROR!
java.lang.IllegalArgumentException: No period converter found for type: org.joda.time.MutablePeriod
	at org.joda.time.convert.ConverterManager.getPeriodConverter(ConverterManager.java:426)
	at org.joda.time.base.BasePeriod.<init>(BasePeriod.java:272)
	at org.joda.time.Period.<init>(Period.java:674)
	at org.joda.time.base.AbstractPeriod.toPeriod(AbstractPeriod.java:147)
	at org.joda.time.format.PeriodFormatter.parsePeriod(PeriodFormatter.java:308)
	at org.joda.time.format.TestISOPeriodFormatParsing.testParseStandard11(TestISOPeriodFormatParsing.java:164)

testParseNegativeMillis1(org.joda.time.format.TestPeriodFormatParsing)  Time elapsed: 0.001 sec  <<< ERROR!
java.lang.IllegalArgumentException: No period converter found for type: org.joda.time.MutablePeriod
	at org.joda.time.convert.ConverterManager.getPeriodConverter(ConverterManager.java:426)
	at org.joda.time.base.BasePeriod.<init>(BasePeriod.java:272)
	at org.joda.time.Period.<init>(Period.java:674)
	at org.joda.time.base.AbstractPeriod.toPeriod(AbstractPeriod.java:147)
	at org.joda.time.format.PeriodFormatter.parsePeriod(PeriodFormatter.java:308)
	at org.joda.time.Period.parse(Period.java:92)
	at org.joda.time.Period.parse(Period.java:81)
	at org.joda.time.format.TestPeriodFormatParsing.testParseNegativeMillis1(TestPeriodFormatParsing.java:102)

testParseNegativeMillis2(org.joda.time.format.TestPeriodFormatParsing)  Time elapsed: 0 sec  <<< ERROR!
java.lang.IllegalArgumentException: No period converter found for type: org.joda.time.MutablePeriod
	at org.joda.time.convert.ConverterManager.getPeriodConverter(ConverterManager.java:426)
	at org.joda.time.base.BasePeriod.<init>(BasePeriod.java:272)
	at org.joda.time.Period.<init>(Period.java:674)
	at org.joda.time.base.AbstractPeriod.toPeriod(AbstractPeriod.java:147)
	at org.joda.time.format.PeriodFormatter.parsePeriod(PeriodFormatter.java:308)
	at org.joda.time.Period.parse(Period.java:92)
	at org.joda.time.Period.parse(Period.java:81)
	at org.joda.time.format.TestPeriodFormatParsing.testParseNegativeMillis2(TestPeriodFormatParsing.java:110)

testParseCustom1(org.joda.time.format.TestPeriodFormatParsing)  Time elapsed: 0.001 sec  <<< ERROR!
java.lang.IllegalArgumentException: No period converter found for type: org.joda.time.MutablePeriod
	at org.joda.time.convert.ConverterManager.getPeriodConverter(ConverterManager.java:426)
	at org.joda.time.base.BasePeriod.<init>(BasePeriod.java:272)
	at org.joda.time.Period.<init>(Period.java:674)
	at org.joda.time.base.AbstractPeriod.toPeriod(AbstractPeriod.java:147)
	at org.joda.time.format.PeriodFormatter.parsePeriod(PeriodFormatter.java:308)
	at org.joda.time.format.TestPeriodFormatParsing.testParseCustom1(TestPeriodFormatParsing.java:127)

testParseStandard1(org.joda.time.format.TestPeriodFormatParsing)  Time elapsed: 0 sec  <<< ERROR!
java.lang.IllegalArgumentException: No period converter found for type: org.joda.time.MutablePeriod
	at org.joda.time.convert.ConverterManager.getPeriodConverter(ConverterManager.java:426)
	at org.joda.time.base.BasePeriod.<init>(BasePeriod.java:272)
	at org.joda.time.Period.<init>(Period.java:674)
	at org.joda.time.base.AbstractPeriod.toPeriod(AbstractPeriod.java:147)
	at org.joda.time.format.PeriodFormatter.parsePeriod(PeriodFormatter.java:308)
	at org.joda.time.format.TestPeriodFormatParsing.testParseStandard1(TestPeriodFormatParsing.java:94)

testFormatPrefixSimple4IgnoringPrefix(org.joda.time.format.TestPeriodFormatterBuilder)  Time elapsed: 0.001 sec  <<< ERROR!
java.lang.IllegalArgumentException: No period converter found for type: org.joda.time.MutablePeriod
	at org.joda.time.convert.ConverterManager.getPeriodConverter(ConverterManager.java:426)
	at org.joda.time.base.BasePeriod.<init>(BasePeriod.java:272)
	at org.joda.time.Period.<init>(Period.java:674)
	at org.joda.time.base.AbstractPeriod.toPeriod(AbstractPeriod.java:147)
	at org.joda.time.format.PeriodFormatter.parsePeriod(PeriodFormatter.java:308)
	at org.joda.time.format.TestPeriodFormatterBuilder.testFormatPrefixSimple4IgnoringPrefix(TestPeriodFormatterBuilder.java:348)

testPluralAffixParseOrder(org.joda.time.format.TestPeriodFormatterBuilder)  Time elapsed: 0 sec  <<< ERROR!
java.lang.IllegalArgumentException: No period converter found for type: org.joda.time.MutablePeriod
	at org.joda.time.convert.ConverterManager.getPeriodConverter(ConverterManager.java:426)
	at org.joda.time.base.BasePeriod.<init>(BasePeriod.java:272)
	at org.joda.time.Period.<init>(Period.java:674)
	at org.joda.time.base.AbstractPeriod.toPeriod(AbstractPeriod.java:147)
	at org.joda.time.format.PeriodFormatter.parsePeriod(PeriodFormatter.java:308)
	at org.joda.time.format.TestPeriodFormatterBuilder.testPluralAffixParseOrder(TestPeriodFormatterBuilder.java:357)

testFormatPrefixPlural4IgnoringPrefix(org.joda.time.format.TestPeriodFormatterBuilder)  Time elapsed: 0.001 sec  <<< ERROR!
java.lang.IllegalArgumentException: No period converter found for type: org.joda.time.MutablePeriod
	at org.joda.time.convert.ConverterManager.getPeriodConverter(ConverterManager.java:426)
	at org.joda.time.base.BasePeriod.<init>(BasePeriod.java:272)
	at org.joda.time.Period.<init>(Period.java:674)
	at org.joda.time.base.AbstractPeriod.toPeriod(AbstractPeriod.java:147)
	at org.joda.time.format.PeriodFormatter.parsePeriod(PeriodFormatter.java:308)
	at org.joda.time.format.TestPeriodFormatterBuilder.testFormatPrefixPlural4IgnoringPrefix(TestPeriodFormatterBuilder.java:407)

testRegExAffixParseOrder(org.joda.time.format.TestPeriodFormatterBuilder)  Time elapsed: 0 sec  <<< ERROR!
java.lang.IllegalArgumentException: No period converter found for type: org.joda.time.MutablePeriod
	at org.joda.time.convert.ConverterManager.getPeriodConverter(ConverterManager.java:426)
	at org.joda.time.base.BasePeriod.<init>(BasePeriod.java:272)
	at org.joda.time.Period.<init>(Period.java:674)
	at org.joda.time.base.AbstractPeriod.toPeriod(AbstractPeriod.java:147)
	at org.joda.time.format.PeriodFormatter.parsePeriod(PeriodFormatter.java:308)
	at org.joda.time.format.TestPeriodFormatterBuilder.testRegExAffixParseOrder(TestPeriodFormatterBuilder.java:424)

testFormatPrefixRegEx4IgnoringPrefix(org.joda.time.format.TestPeriodFormatterBuilder)  Time elapsed: 0 sec  <<< ERROR!
java.lang.IllegalArgumentException: No period converter found for type: org.joda.time.MutablePeriod
	at org.joda.time.convert.ConverterManager.getPeriodConverter(ConverterManager.java:426)
	at org.joda.time.base.BasePeriod.<init>(BasePeriod.java:272)
	at org.joda.time.Period.<init>(Period.java:674)
	at org.joda.time.base.AbstractPeriod.toPeriod(AbstractPeriod.java:147)
	at org.joda.time.format.PeriodFormatter.parsePeriod(PeriodFormatter.java:308)
	at org.joda.time.format.TestPeriodFormatterBuilder.testFormatPrefixRegEx4IgnoringPrefix(TestPeriodFormatterBuilder.java:492)

testFormatPrefixComposite1(org.joda.time.format.TestPeriodFormatterBuilder)  Time elapsed: 0.002 sec  <<< ERROR!
java.lang.IllegalArgumentException: No period converter found for type: org.joda.time.MutablePeriod
	at org.joda.time.convert.ConverterManager.getPeriodConverter(ConverterManager.java:426)
	at org.joda.time.base.BasePeriod.<init>(BasePeriod.java:272)
	at org.joda.time.Period.<init>(Period.java:674)
	at org.joda.time.base.AbstractPeriod.toPeriod(AbstractPeriod.java:147)
	at org.joda.time.format.PeriodFormatter.parsePeriod(PeriodFormatter.java:308)
	at org.joda.time.format.TestPeriodFormatterBuilder.testFormatPrefixComposite1(TestPeriodFormatterBuilder.java:513)

testFormatPrefixSimple5IgnoringPrefix(org.joda.time.format.TestPeriodFormatterBuilder)  Time elapsed: 0.001 sec  <<< ERROR!
java.lang.IllegalArgumentException: No period converter found for type: org.joda.time.MutablePeriod
	at org.joda.time.convert.ConverterManager.getPeriodConverter(ConverterManager.java:426)
	at org.joda.time.base.BasePeriod.<init>(BasePeriod.java:272)
	at org.joda.time.Period.<init>(Period.java:674)
	at org.joda.time.base.AbstractPeriod.toPeriod(AbstractPeriod.java:147)
	at org.joda.time.format.PeriodFormatter.parsePeriod(PeriodFormatter.java:308)
	at org.joda.time.format.TestPeriodFormatterBuilder.testFormatPrefixSimple5IgnoringPrefix(TestPeriodFormatterBuilder.java:563)

testFormatPrefixSimple6IgnoringPrefix(org.joda.time.format.TestPeriodFormatterBuilder)  Time elapsed: 0 sec  <<< ERROR!
java.lang.IllegalArgumentException: No period converter found for type: org.joda.time.MutablePeriod
	at org.joda.time.convert.ConverterManager.getPeriodConverter(ConverterManager.java:426)
	at org.joda.time.base.BasePeriod.<init>(BasePeriod.java:272)
	at org.joda.time.Period.<init>(Period.java:674)
	at org.joda.time.base.AbstractPeriod.toPeriod(AbstractPeriod.java:147)
	at org.joda.time.format.PeriodFormatter.parsePeriod(PeriodFormatter.java:308)
	at org.joda.time.format.TestPeriodFormatterBuilder.testFormatPrefixSimple6IgnoringPrefix(TestPeriodFormatterBuilder.java:574)

testFormatSuffixPlural4IgnoringPrefix(org.joda.time.format.TestPeriodFormatterBuilder)  Time elapsed: 0.001 sec  <<< ERROR!
java.lang.IllegalArgumentException: No period converter found for type: org.joda.time.MutablePeriod
	at org.joda.time.convert.ConverterManager.getPeriodConverter(ConverterManager.java:426)
	at org.joda.time.base.BasePeriod.<init>(BasePeriod.java:272)
	at org.joda.time.Period.<init>(Period.java:674)
	at org.joda.time.base.AbstractPeriod.toPeriod(AbstractPeriod.java:147)
	at org.joda.time.format.PeriodFormatter.parsePeriod(PeriodFormatter.java:308)
	at org.joda.time.format.TestPeriodFormatterBuilder.testFormatSuffixPlural4IgnoringPrefix(TestPeriodFormatterBuilder.java:631)

testFormatSuffixRegEx5IgnoringAffix(org.joda.time.format.TestPeriodFormatterBuilder)  Time elapsed: 0.001 sec  <<< ERROR!
java.lang.IllegalArgumentException: No period converter found for type: org.joda.time.MutablePeriod
	at org.joda.time.convert.ConverterManager.getPeriodConverter(ConverterManager.java:426)
	at org.joda.time.base.BasePeriod.<init>(BasePeriod.java:272)
	at org.joda.time.Period.<init>(Period.java:674)
	at org.joda.time.base.AbstractPeriod.toPeriod(AbstractPeriod.java:147)
	at org.joda.time.format.PeriodFormatter.parsePeriod(PeriodFormatter.java:308)
	at org.joda.time.format.TestPeriodFormatterBuilder.testFormatSuffixRegEx5IgnoringAffix(TestPeriodFormatterBuilder.java:723)

testFormatSuffixComposite1(org.joda.time.format.TestPeriodFormatterBuilder)  Time elapsed: 0.001 sec  <<< ERROR!
java.lang.IllegalArgumentException: No period converter found for type: org.joda.time.MutablePeriod
	at org.joda.time.convert.ConverterManager.getPeriodConverter(ConverterManager.java:426)
	at org.joda.time.base.BasePeriod.<init>(BasePeriod.java:272)
	at org.joda.time.Period.<init>(Period.java:674)
	at org.joda.time.base.AbstractPeriod.toPeriod(AbstractPeriod.java:147)
	at org.joda.time.format.PeriodFormatter.parsePeriod(PeriodFormatter.java:308)
	at org.joda.time.format.TestPeriodFormatterBuilder.testFormatSuffixComposite1(TestPeriodFormatterBuilder.java:743)

testFormatSuffixComposite5IgnoringAffix(org.joda.time.format.TestPeriodFormatterBuilder)  Time elapsed: 0.001 sec  <<< ERROR!
java.lang.IllegalArgumentException: No period converter found for type: org.joda.time.MutablePeriod
	at org.joda.time.convert.ConverterManager.getPeriodConverter(ConverterManager.java:426)
	at org.joda.time.base.BasePeriod.<init>(BasePeriod.java:272)
	at org.joda.time.Period.<init>(Period.java:674)
	at org.joda.time.base.AbstractPeriod.toPeriod(AbstractPeriod.java:147)
	at org.joda.time.format.PeriodFormatter.parsePeriod(PeriodFormatter.java:308)
	at org.joda.time.format.TestPeriodFormatterBuilder.testFormatSuffixComposite5IgnoringAffix(TestPeriodFormatterBuilder.java:757)

testFormatAppend_PrinterParser_null_Parser(org.joda.time.format.TestPeriodFormatterBuilder)  Time elapsed: 0 sec  <<< ERROR!
java.lang.IllegalArgumentException: No period converter found for type: org.joda.time.MutablePeriod
	at org.joda.time.convert.ConverterManager.getPeriodConverter(ConverterManager.java:426)
	at org.joda.time.base.BasePeriod.<init>(BasePeriod.java:272)
	at org.joda.time.Period.<init>(Period.java:674)
	at org.joda.time.base.AbstractPeriod.toPeriod(AbstractPeriod.java:147)
	at org.joda.time.format.PeriodFormatter.parsePeriod(PeriodFormatter.java:308)
	at org.joda.time.format.TestPeriodFormatterBuilder.testFormatAppend_PrinterParser_null_Parser(TestPeriodFormatterBuilder.java:1104)

testFormatAppend_PrinterParser_PrinterParser(org.joda.time.format.TestPeriodFormatterBuilder)  Time elapsed: 0 sec  <<< ERROR!
java.lang.IllegalArgumentException: No period converter found for type: org.joda.time.MutablePeriod
	at org.joda.time.convert.ConverterManager.getPeriodConverter(ConverterManager.java:426)
	at org.joda.time.base.BasePeriod.<init>(BasePeriod.java:272)
	at org.joda.time.Period.<init>(Period.java:674)
	at org.joda.time.base.AbstractPeriod.toPeriod(AbstractPeriod.java:147)
	at org.joda.time.format.PeriodFormatter.parsePeriod(PeriodFormatter.java:308)
	at org.joda.time.format.TestPeriodFormatterBuilder.testFormatAppend_PrinterParser_PrinterParser(TestPeriodFormatterBuilder.java:1116)

testBug2495455(org.joda.time.format.TestPeriodFormatterBuilder)  Time elapsed: 0.001 sec  <<< ERROR!
java.lang.IllegalArgumentException: No period converter found for type: org.joda.time.MutablePeriod
	at org.joda.time.convert.ConverterManager.getPeriodConverter(ConverterManager.java:426)
	at org.joda.time.base.BasePeriod.<init>(BasePeriod.java:272)
	at org.joda.time.Period.<init>(Period.java:674)
	at org.joda.time.base.AbstractPeriod.toPeriod(AbstractPeriod.java:147)
	at org.joda.time.format.PeriodFormatter.parsePeriod(PeriodFormatter.java:308)
	at org.joda.time.format.TestPeriodFormatterBuilder.testBug2495455(TestPeriodFormatterBuilder.java:1166)

testMonthsAndMinutesAreConsideredSeparateAndCaseIsNotIgnored(org.joda.time.format.TestPeriodFormatterBuilder)  Time elapsed: 0.001 sec  <<< ERROR!
java.lang.IllegalArgumentException: No period converter found for type: org.joda.time.MutablePeriod
	at org.joda.time.convert.ConverterManager.getPeriodConverter(ConverterManager.java:426)
	at org.joda.time.base.BasePeriod.<init>(BasePeriod.java:272)
	at org.joda.time.Period.<init>(Period.java:674)
	at org.joda.time.base.AbstractPeriod.toPeriod(AbstractPeriod.java:147)
	at org.joda.time.format.PeriodFormatter.parsePeriod(PeriodFormatter.java:308)
	at org.joda.time.format.TestPeriodFormatterBuilder.testMonthsAndMinutesAreConsideredSeparateAndCaseIsNotIgnored(TestPeriodFormatterBuilder.java:1179)


Results :

Failed tests: 
  org.joda.time.convert.TestConverterManager#testAddInstantConverter3 AssertionFailedError
  org.joda.time.convert.TestConverterManager#testAddIntervalConverter1 AssertionFailedError
  org.joda.time.convert.TestConverterManager#testAddIntervalConverter2 AssertionFailedError
  org.joda.time.convert.TestConverterManager#testAddIntervalConverter3 AssertionFailedError
  org.joda.time.convert.TestConverterManager#testAddPartialConverter3 AssertionFailedError
  org.joda.time.convert.TestConverterManager#testGetIntervalConverterRemovedNull AssertionFailedError
  org.joda.time.convert.TestConverterManager#testGetIntervalConverters AssertionFailedError
  org.joda.time.convert.TestConverterManager#testRemoveDurationConverter1 AssertionFailedError
  org.joda.time.convert.TestConverterManager#testRemoveDurationConverter2 AssertionFailedError
  org.joda.time.convert.TestConverterManager#testRemoveDurationConverter3 AssertionFailedError
  org.joda.time.convert.TestConverterManager#testRemoveInstantConverter1 AssertionFailedError
  org.joda.time.convert.TestConverterManager#testRemoveIntervalConverter1 AssertionFailedError
  org.joda.time.convert.TestConverterManager#testRemovePartialConverter1 AssertionFailedError
  org.joda.time.convert.TestConverterManager#testRemovePartialConverter2 AssertionFailedError
  org.joda.time.convert.TestConverterManager#testRemovePartialConverter3 AssertionFailedError
  org.joda.time.convert.TestConverterManager#testRemovePeriodConverter1 AssertionFailedError
Tests in error: 
  org.joda.time.TestInterval_Constructors#testConstructor_Object6 IllegalArgumentException
  org.joda.time.TestInterval_Constructors#testConstructor_Object_Chronology1 IllegalArgumentException
  org.joda.time.TestInterval_Constructors#testConstructor_Object_Chronology2 IllegalArgumentException
  org.joda.time.TestMutableInterval_Constructors#testConstructor_Object2 IllegalArgumentException
  org.joda.time.TestMutableInterval_Constructors#testConstructor_Object3 IllegalArgumentException
  org.joda.time.TestMutableInterval_Constructors#testConstructor_Object4 IllegalArgumentException
  org.joda.time.TestMutableInterval_Constructors#testConstructor_Object6 IllegalArgumentException
  org.joda.time.TestMutableInterval_Constructors#testConstructor_Object_Chronology1 IllegalArgumentException
  org.joda.time.TestMutableInterval_Constructors#testConstructor_Object_Chronology2 IllegalArgumentException
  org.joda.time.convert.TestConverterManager#testGetIntervalConverter IllegalArgumentException
  org.joda.time.convert.TestStringConverter#testSetIntoInterval_Object_Chronology1 IllegalArgumentException
  org.joda.time.convert.TestStringConverter#testSetIntoInterval_Object_Chronology2 IllegalArgumentException
  org.joda.time.convert.TestStringConverter#testSetIntoInterval_Object_Chronology4 IllegalArgumentException
  org.joda.time.convert.TestStringConverter#testSetIntoInterval_Object_Chronology5 IllegalArgumentException
  org.joda.time.format.TestDateTimeFormatStyle#testForStyle_shortDate IllegalArgumentException
  org.joda.time.format.TestDateTimeFormatStyle#testForStyle_shortDateTime IllegalArgumentException
  org.joda.time.format.TestDateTimeFormatStyle#testForStyle_shortTime IllegalArgumentException
  org.joda.time.format.TestISOPeriodFormatParsing#testParseStandard1 IllegalArgumentException
  org.joda.time.format.TestISOPeriodFormatParsing#testParseStandard10 IllegalArgumentException
  org.joda.time.format.TestISOPeriodFormatParsing#testParseStandard11 IllegalArgumentException
  org.joda.time.format.TestISOPeriodFormatParsing#testParseStandard2 IllegalArgumentException
  org.joda.time.format.TestISOPeriodFormatParsing#testParseStandard3 IllegalArgumentException
  org.joda.time.format.TestISOPeriodFormatParsing#testParseStandard4 IllegalArgumentException
  org.joda.time.format.TestISOPeriodFormatParsing#testParseStandard5 IllegalArgumentException
  org.joda.time.format.TestISOPeriodFormatParsing#testParseStandard6 IllegalArgumentException
  org.joda.time.format.TestISOPeriodFormatParsing#testParseStandard7 IllegalArgumentException
  org.joda.time.format.TestISOPeriodFormatParsing#testParseStandard8 IllegalArgumentException
  org.joda.time.format.TestISOPeriodFormatParsing#testParseStandard9 IllegalArgumentException
  org.joda.time.format.TestPeriodFormat#test_getDefault_parseOneField IllegalArgumentException
  org.joda.time.format.TestPeriodFormat#test_getDefault_parseTwoFields IllegalArgumentException
  org.joda.time.format.TestPeriodFormat#test_wordBased_de_parseOneField IllegalArgumentException
  org.joda.time.format.TestPeriodFormat#test_wordBased_de_parseTwoFields IllegalArgumentException
  org.joda.time.format.TestPeriodFormat#test_wordBased_en_withLocale_pt IllegalArgumentException
  org.joda.time.format.TestPeriodFormat#test_wordBased_es_parseOneField IllegalArgumentException
  org.joda.time.format.TestPeriodFormat#test_wordBased_es_parseTwoFields IllegalArgumentException
  org.joda.time.format.TestPeriodFormat#test_wordBased_fr_parseOneField IllegalArgumentException
  org.joda.time.format.TestPeriodFormat#test_wordBased_fr_parseTwoFields IllegalArgumentException
  org.joda.time.format.TestPeriodFormat#test_wordBased_ja_parseOneField IllegalArgumentException
  org.joda.time.format.TestPeriodFormat#test_wordBased_ja_parseTwoFields IllegalArgumentException
  org.joda.time.format.TestPeriodFormat#test_wordBased_nl_parseOneField IllegalArgumentException
  org.joda.time.format.TestPeriodFormat#test_wordBased_nl_parseTwoFields IllegalArgumentException
  org.joda.time.format.TestPeriodFormat#test_wordBased_pl_parseOneField IllegalArgumentException
  org.joda.time.format.TestPeriodFormat#test_wordBased_pl_parseTwoFields IllegalArgumentException
  org.joda.time.format.TestPeriodFormat#test_wordBased_pt_parseOneField IllegalArgumentException
  org.joda.time.format.TestPeriodFormat#test_wordBased_pt_parseTwoFields IllegalArgumentException
  org.joda.time.format.TestPeriodFormatParsing#testParseCustom1 IllegalArgumentException
  org.joda.time.format.TestPeriodFormatParsing#testParseNegativeMillis1 IllegalArgumentException
  org.joda.time.format.TestPeriodFormatParsing#testParseNegativeMillis2 IllegalArgumentException
  org.joda.time.format.TestPeriodFormatParsing#testParseStandard1 IllegalArgumentException
  org.joda.time.format.TestPeriodFormatter#testParsePeriod_parseType IllegalArgumentException
  org.joda.time.format.TestPeriodFormatter#testParsePeriod_simple IllegalArgumentException
  org.joda.time.format.TestPeriodFormatter#testPrinterParserMethods IllegalArgumentException
  org.joda.time.format.TestPeriodFormatterBuilder#testBug2495455 IllegalArgumentException
  org.joda.time.format.TestPeriodFormatterBuilder#testFormatAppend_PrinterParser_PrinterParser IllegalArgumentException
  org.joda.time.format.TestPeriodFormatterBuilder#testFormatAppend_PrinterParser_null_Parser IllegalArgumentException
  org.joda.time.format.TestPeriodFormatterBuilder#testFormatPrefixComposite1 IllegalArgumentException
  org.joda.time.format.TestPeriodFormatterBuilder#testFormatPrefixPlural4IgnoringPrefix IllegalArgumentException
  org.joda.time.format.TestPeriodFormatterBuilder#testFormatPrefixRegEx4IgnoringPrefix IllegalArgumentException
  org.joda.time.format.TestPeriodFormatterBuilder#testFormatPrefixSimple4IgnoringPrefix IllegalArgumentException
  org.joda.time.format.TestPeriodFormatterBuilder#testFormatPrefixSimple5IgnoringPrefix IllegalArgumentException
  org.joda.time.format.TestPeriodFormatterBuilder#testFormatPrefixSimple6IgnoringPrefix IllegalArgumentException
  org.joda.time.format.TestPeriodFormatterBuilder#testFormatSuffixComposite1 IllegalArgumentException
  org.joda.time.format.TestPeriodFormatterBuilder#testFormatSuffixComposite5IgnoringAffix IllegalArgumentException
  org.joda.time.format.TestPeriodFormatterBuilder#testFormatSuffixPlural4IgnoringPrefix IllegalArgumentException
  org.joda.time.format.TestPeriodFormatterBuilder#testFormatSuffixRegEx5IgnoringAffix IllegalArgumentException
  org.joda.time.format.TestPeriodFormatterBuilder#testMonthsAndMinutesAreConsideredSeparateAndCaseIsNotIgnored IllegalArgumentException
  org.joda.time.format.TestPeriodFormatterBuilder#testPluralAffixParseOrder IllegalArgumentException
  org.joda.time.format.TestPeriodFormatterBuilder#testRegExAffixParseOrder IllegalArgumentException

Tests run: 4157, Failures: 16, Errors: 68, Skipped: 0

[INFO] ------------------------------------------------------------------------
[INFO] BUILD FAILURE
[INFO] ------------------------------------------------------------------------
[INFO] Total time: 15.307s
[INFO] Finished at: Thu Aug 06 03:09:27 BST 2015
[INFO] Final Memory: 9M/209M
[INFO] ------------------------------------------------------------------------
[ERROR] Failed to execute goal org.apache.maven.plugins:maven-surefire-plugin:2.18.1:test (default-test) on project joda-time: There are test failures.
[ERROR] 
[ERROR] Please refer to /home/perham/Study/LittleDarwin/Cases/joda-time-2.8.1/target/surefire-reports for the individual test results.
[ERROR] -> [Help 1]
[ERROR] 
[ERROR] To see the full stack trace of the errors, re-run Maven with the -e switch.
[ERROR] Re-run Maven using the -X switch to enable full debug logging.
[ERROR] 
[ERROR] For more information about the errors and possible solutions, please read the following articles:
[ERROR] [Help 1] http://cwiki.apache.org/confluence/display/MAVEN/MojoFailureException
