[INFO] Scanning for projects...
[INFO]                                                                         
[INFO] ------------------------------------------------------------------------
[INFO] Building Joda-Time 2.8.1
[INFO] ------------------------------------------------------------------------
[INFO] 
[INFO] --- maven-resources-plugin:2.7:resources (default-resources) @ joda-time ---
[INFO] Using 'UTF-8' encoding to copy filtered resources.
[INFO] Copying 2 resources to META-INF
[INFO] Copying 10 resources
[INFO] 
[INFO] --- maven-compiler-plugin:3.3:compile (default-compile) @ joda-time ---
[INFO] Changes detected - recompiling the module!
[INFO] Compiling 166 source files to /home/perham/Study/LittleDarwin/Cases/joda-time-2.8.1/target/classes
[INFO] 
[INFO] --- exec-maven-plugin:1.4.0:java (compile-tzdb) @ joda-time ---
Writing zoneinfo files
Writing ZoneInfoMap
[INFO] 
[INFO] --- maven-resources-plugin:2.7:testResources (default-testResources) @ joda-time ---
[INFO] Using 'UTF-8' encoding to copy filtered resources.
[INFO] Copying 34 resources
[INFO] 
[INFO] --- maven-compiler-plugin:3.3:testCompile (default-testCompile) @ joda-time ---
[INFO] Nothing to compile - all classes are up to date
[INFO] 
[INFO] --- maven-surefire-plugin:2.18.1:test (default-test) @ joda-time ---
[INFO] Surefire report directory: /home/perham/Study/LittleDarwin/Cases/joda-time-2.8.1/target/surefire-reports

-------------------------------------------------------
 T E S T S
-------------------------------------------------------
Running org.joda.time.TestAllPackages

TestBuddhistChronology.testCalendar

TestCopticChronology.testCalendar

TestEthiopicChronology.testCalendar

TestIslamicChronology.testCalendar

Testing Gregorian chronology over 1000 iterations
100% complete (i=1000)

Testing Julian chronology over 1000 iterations
100% complete (i=1000)
Writing zoneinfo files
Writing ZoneInfoMap
Tests run: 4157, Failures: 44, Errors: 0, Skipped: 0, Time elapsed: 5.518 sec <<< FAILURE! - in org.joda.time.TestAllPackages
testToString(org.joda.time.convert.TestConverterManager)  Time elapsed: 0.007 sec  <<< FAILURE!
junit.framework.ComparisonFailure: expected:<ConverterManager[[6] instant,7 partial,5...> but was:<ConverterManager[[7] instant,7 partial,5...>
	at junit.framework.Assert.assertEquals(Assert.java:81)
	at junit.framework.Assert.assertEquals(Assert.java:87)
	at org.joda.time.convert.TestConverterManager.testToString(TestConverterManager.java:989)

testAddInstantConverter1(org.joda.time.convert.TestConverterManager)  Time elapsed: 0.001 sec  <<< FAILURE!
junit.framework.AssertionFailedError: expected:<7> but was:<8>
	at junit.framework.Assert.fail(Assert.java:47)
	at junit.framework.Assert.failNotEquals(Assert.java:280)
	at junit.framework.Assert.assertEquals(Assert.java:64)
	at junit.framework.Assert.assertEquals(Assert.java:198)
	at junit.framework.Assert.assertEquals(Assert.java:204)
	at org.joda.time.convert.TestConverterManager.testAddInstantConverter1(TestConverterManager.java:226)

testAddInstantConverter2(org.joda.time.convert.TestConverterManager)  Time elapsed: 0.002 sec  <<< FAILURE!
junit.framework.AssertionFailedError: expected:<6> but was:<8>
	at junit.framework.Assert.fail(Assert.java:47)
	at junit.framework.Assert.failNotEquals(Assert.java:280)
	at junit.framework.Assert.assertEquals(Assert.java:64)
	at junit.framework.Assert.assertEquals(Assert.java:198)
	at junit.framework.Assert.assertEquals(Assert.java:204)
	at org.joda.time.convert.TestConverterManager.testAddInstantConverter2(TestConverterManager.java:244)

testAddInstantConverter3(org.joda.time.convert.TestConverterManager)  Time elapsed: 0.001 sec  <<< FAILURE!
junit.framework.AssertionFailedError: expected:<6> but was:<8>
	at junit.framework.Assert.fail(Assert.java:47)
	at junit.framework.Assert.failNotEquals(Assert.java:280)
	at junit.framework.Assert.assertEquals(Assert.java:64)
	at junit.framework.Assert.assertEquals(Assert.java:198)
	at junit.framework.Assert.assertEquals(Assert.java:204)
	at org.joda.time.convert.TestConverterManager.testAddInstantConverter3(TestConverterManager.java:254)

testAddInstantConverter4(org.joda.time.convert.TestConverterManager)  Time elapsed: 0.001 sec  <<< FAILURE!
junit.framework.AssertionFailedError: expected:<6> but was:<8>
	at junit.framework.Assert.fail(Assert.java:47)
	at junit.framework.Assert.failNotEquals(Assert.java:280)
	at junit.framework.Assert.assertEquals(Assert.java:64)
	at junit.framework.Assert.assertEquals(Assert.java:198)
	at junit.framework.Assert.assertEquals(Assert.java:204)
	at org.joda.time.convert.TestConverterManager.testAddInstantConverter4(TestConverterManager.java:260)

testRemoveInstantConverter1(org.joda.time.convert.TestConverterManager)  Time elapsed: 0.002 sec  <<< FAILURE!
junit.framework.AssertionFailedError: expected:<Converter[java.lang.String]> but was:<null>
	at junit.framework.Assert.fail(Assert.java:47)
	at junit.framework.Assert.failNotEquals(Assert.java:280)
	at junit.framework.Assert.assertEquals(Assert.java:64)
	at junit.framework.Assert.assertEquals(Assert.java:71)
	at org.joda.time.convert.TestConverterManager.testRemoveInstantConverter1(TestConverterManager.java:285)

testRemoveInstantConverter2(org.joda.time.convert.TestConverterManager)  Time elapsed: 0.001 sec  <<< FAILURE!
junit.framework.AssertionFailedError: expected:<6> but was:<8>
	at junit.framework.Assert.fail(Assert.java:47)
	at junit.framework.Assert.failNotEquals(Assert.java:280)
	at junit.framework.Assert.assertEquals(Assert.java:64)
	at junit.framework.Assert.assertEquals(Assert.java:198)
	at junit.framework.Assert.assertEquals(Assert.java:204)
	at org.joda.time.convert.TestConverterManager.testRemoveInstantConverter2(TestConverterManager.java:302)

testRemoveInstantConverter3(org.joda.time.convert.TestConverterManager)  Time elapsed: 0.001 sec  <<< FAILURE!
junit.framework.AssertionFailedError: expected:<6> but was:<8>
	at junit.framework.Assert.fail(Assert.java:47)
	at junit.framework.Assert.failNotEquals(Assert.java:280)
	at junit.framework.Assert.assertEquals(Assert.java:64)
	at junit.framework.Assert.assertEquals(Assert.java:198)
	at junit.framework.Assert.assertEquals(Assert.java:204)
	at org.joda.time.convert.TestConverterManager.testRemoveInstantConverter3(TestConverterManager.java:308)

testGetPartialConverterRemovedNull(org.joda.time.convert.TestConverterManager)  Time elapsed: 0 sec  <<< FAILURE!
junit.framework.AssertionFailedError
	at junit.framework.Assert.fail(Assert.java:47)
	at junit.framework.Assert.fail(Assert.java:53)
	at org.joda.time.convert.TestConverterManager.testGetPartialConverterRemovedNull(TestConverterManager.java:366)

testRemoveIntervalConverter1(org.joda.time.convert.TestConverterManager)  Time elapsed: 0.001 sec  <<< FAILURE!
junit.framework.AssertionFailedError: expected:<Converter[java.lang.String]> but was:<null>
	at junit.framework.Assert.fail(Assert.java:47)
	at junit.framework.Assert.failNotEquals(Assert.java:280)
	at junit.framework.Assert.assertEquals(Assert.java:64)
	at junit.framework.Assert.assertEquals(Assert.java:71)
	at org.joda.time.convert.TestConverterManager.testRemoveIntervalConverter1(TestConverterManager.java:944)

testGetPartialConverterOKMultipleMatches(org.joda.time.convert.TestConverterManager)  Time elapsed: 0.001 sec  <<< FAILURE!
junit.framework.AssertionFailedError: expected:<7> but was:<8>
	at junit.framework.Assert.fail(Assert.java:47)
	at junit.framework.Assert.failNotEquals(Assert.java:280)
	at junit.framework.Assert.assertEquals(Assert.java:64)
	at junit.framework.Assert.assertEquals(Assert.java:198)
	at junit.framework.Assert.assertEquals(Assert.java:204)
	at org.joda.time.convert.TestConverterManager.testGetPartialConverterOKMultipleMatches(TestConverterManager.java:390)

testGetPartialConverterBadMultipleMatches(org.joda.time.convert.TestConverterManager)  Time elapsed: 0.001 sec  <<< FAILURE!
junit.framework.AssertionFailedError: expected:<7> but was:<9>
	at junit.framework.Assert.fail(Assert.java:47)
	at junit.framework.Assert.failNotEquals(Assert.java:280)
	at junit.framework.Assert.assertEquals(Assert.java:64)
	at junit.framework.Assert.assertEquals(Assert.java:198)
	at junit.framework.Assert.assertEquals(Assert.java:204)
	at org.joda.time.convert.TestConverterManager.testGetPartialConverterBadMultipleMatches(TestConverterManager.java:412)

testGetPartialConverters(org.joda.time.convert.TestConverterManager)  Time elapsed: 0.001 sec  <<< FAILURE!
junit.framework.AssertionFailedError: expected:<7> but was:<9>
	at junit.framework.Assert.fail(Assert.java:47)
	at junit.framework.Assert.failNotEquals(Assert.java:280)
	at junit.framework.Assert.assertEquals(Assert.java:64)
	at junit.framework.Assert.assertEquals(Assert.java:198)
	at junit.framework.Assert.assertEquals(Assert.java:204)
	at org.joda.time.convert.TestConverterManager.testGetPartialConverters(TestConverterManager.java:418)

testAddPartialConverter1(org.joda.time.convert.TestConverterManager)  Time elapsed: 0 sec  <<< FAILURE!
junit.framework.AssertionFailedError: expected:<8> but was:<10>
	at junit.framework.Assert.fail(Assert.java:47)
	at junit.framework.Assert.failNotEquals(Assert.java:280)
	at junit.framework.Assert.assertEquals(Assert.java:64)
	at junit.framework.Assert.assertEquals(Assert.java:198)
	at junit.framework.Assert.assertEquals(Assert.java:204)
	at org.joda.time.convert.TestConverterManager.testAddPartialConverter1(TestConverterManager.java:434)

testAddPartialConverter2(org.joda.time.convert.TestConverterManager)  Time elapsed: 0.002 sec  <<< FAILURE!
junit.framework.AssertionFailedError: expected:<7> but was:<10>
	at junit.framework.Assert.fail(Assert.java:47)
	at junit.framework.Assert.failNotEquals(Assert.java:280)
	at junit.framework.Assert.assertEquals(Assert.java:64)
	at junit.framework.Assert.assertEquals(Assert.java:198)
	at junit.framework.Assert.assertEquals(Assert.java:204)
	at org.joda.time.convert.TestConverterManager.testAddPartialConverter2(TestConverterManager.java:453)

testAddPartialConverter3(org.joda.time.convert.TestConverterManager)  Time elapsed: 0.001 sec  <<< FAILURE!
junit.framework.AssertionFailedError: expected:<7> but was:<10>
	at junit.framework.Assert.fail(Assert.java:47)
	at junit.framework.Assert.failNotEquals(Assert.java:280)
	at junit.framework.Assert.assertEquals(Assert.java:64)
	at junit.framework.Assert.assertEquals(Assert.java:198)
	at junit.framework.Assert.assertEquals(Assert.java:204)
	at org.joda.time.convert.TestConverterManager.testAddPartialConverter3(TestConverterManager.java:463)

testAddPartialConverter4(org.joda.time.convert.TestConverterManager)  Time elapsed: 0.001 sec  <<< FAILURE!
junit.framework.AssertionFailedError: expected:<7> but was:<10>
	at junit.framework.Assert.fail(Assert.java:47)
	at junit.framework.Assert.failNotEquals(Assert.java:280)
	at junit.framework.Assert.assertEquals(Assert.java:64)
	at junit.framework.Assert.assertEquals(Assert.java:198)
	at junit.framework.Assert.assertEquals(Assert.java:204)
	at org.joda.time.convert.TestConverterManager.testAddPartialConverter4(TestConverterManager.java:469)

testRemovePartialConverter1(org.joda.time.convert.TestConverterManager)  Time elapsed: 0 sec  <<< FAILURE!
junit.framework.AssertionFailedError: expected:<Converter[java.lang.String]> but was:<null>
	at junit.framework.Assert.fail(Assert.java:47)
	at junit.framework.Assert.failNotEquals(Assert.java:280)
	at junit.framework.Assert.assertEquals(Assert.java:64)
	at junit.framework.Assert.assertEquals(Assert.java:71)
	at org.joda.time.convert.TestConverterManager.testRemovePartialConverter1(TestConverterManager.java:494)

testRemovePartialConverter2(org.joda.time.convert.TestConverterManager)  Time elapsed: 0.001 sec  <<< FAILURE!
junit.framework.AssertionFailedError: expected:<7> but was:<10>
	at junit.framework.Assert.fail(Assert.java:47)
	at junit.framework.Assert.failNotEquals(Assert.java:280)
	at junit.framework.Assert.assertEquals(Assert.java:64)
	at junit.framework.Assert.assertEquals(Assert.java:198)
	at junit.framework.Assert.assertEquals(Assert.java:204)
	at org.joda.time.convert.TestConverterManager.testRemovePartialConverter2(TestConverterManager.java:512)

testRemovePartialConverter3(org.joda.time.convert.TestConverterManager)  Time elapsed: 0 sec  <<< FAILURE!
junit.framework.AssertionFailedError: expected:<7> but was:<10>
	at junit.framework.Assert.fail(Assert.java:47)
	at junit.framework.Assert.failNotEquals(Assert.java:280)
	at junit.framework.Assert.assertEquals(Assert.java:64)
	at junit.framework.Assert.assertEquals(Assert.java:198)
	at junit.framework.Assert.assertEquals(Assert.java:204)
	at org.joda.time.convert.TestConverterManager.testRemovePartialConverter3(TestConverterManager.java:518)

testGetDurationConverterRemovedNull(org.joda.time.convert.TestConverterManager)  Time elapsed: 0 sec  <<< FAILURE!
junit.framework.AssertionFailedError
	at junit.framework.Assert.fail(Assert.java:47)
	at junit.framework.Assert.fail(Assert.java:53)
	at org.joda.time.convert.TestConverterManager.testGetDurationConverterRemovedNull(TestConverterManager.java:570)

testAddDurationConverter1(org.joda.time.convert.TestConverterManager)  Time elapsed: 0.001 sec  <<< FAILURE!
junit.framework.AssertionFailedError: expected:<5> but was:<6>
	at junit.framework.Assert.fail(Assert.java:47)
	at junit.framework.Assert.failNotEquals(Assert.java:280)
	at junit.framework.Assert.assertEquals(Assert.java:64)
	at junit.framework.Assert.assertEquals(Assert.java:198)
	at junit.framework.Assert.assertEquals(Assert.java:204)
	at org.joda.time.convert.TestConverterManager.testAddDurationConverter1(TestConverterManager.java:598)

testAddDurationConverter2(org.joda.time.convert.TestConverterManager)  Time elapsed: 0.001 sec  <<< FAILURE!
junit.framework.AssertionFailedError: expected:<5> but was:<6>
	at junit.framework.Assert.fail(Assert.java:47)
	at junit.framework.Assert.failNotEquals(Assert.java:280)
	at junit.framework.Assert.assertEquals(Assert.java:64)
	at junit.framework.Assert.assertEquals(Assert.java:198)
	at junit.framework.Assert.assertEquals(Assert.java:204)
	at org.joda.time.convert.TestConverterManager.testAddDurationConverter2(TestConverterManager.java:610)

testAddDurationConverter3(org.joda.time.convert.TestConverterManager)  Time elapsed: 0 sec  <<< FAILURE!
junit.framework.AssertionFailedError: expected:<5> but was:<6>
	at junit.framework.Assert.fail(Assert.java:47)
	at junit.framework.Assert.failNotEquals(Assert.java:280)
	at junit.framework.Assert.assertEquals(Assert.java:64)
	at junit.framework.Assert.assertEquals(Assert.java:198)
	at junit.framework.Assert.assertEquals(Assert.java:204)
	at org.joda.time.convert.TestConverterManager.testAddDurationConverter3(TestConverterManager.java:620)

testRemoveDurationConverter1(org.joda.time.convert.TestConverterManager)  Time elapsed: 0.001 sec  <<< FAILURE!
junit.framework.AssertionFailedError: expected:<Converter[java.lang.String]> but was:<null>
	at junit.framework.Assert.fail(Assert.java:47)
	at junit.framework.Assert.failNotEquals(Assert.java:280)
	at junit.framework.Assert.assertEquals(Assert.java:64)
	at junit.framework.Assert.assertEquals(Assert.java:71)
	at org.joda.time.convert.TestConverterManager.testRemoveDurationConverter1(TestConverterManager.java:645)

testRemoveDurationConverter2(org.joda.time.convert.TestConverterManager)  Time elapsed: 0 sec  <<< FAILURE!
junit.framework.AssertionFailedError: expected:<5> but was:<6>
	at junit.framework.Assert.fail(Assert.java:47)
	at junit.framework.Assert.failNotEquals(Assert.java:280)
	at junit.framework.Assert.assertEquals(Assert.java:64)
	at junit.framework.Assert.assertEquals(Assert.java:198)
	at junit.framework.Assert.assertEquals(Assert.java:204)
	at org.joda.time.convert.TestConverterManager.testRemoveDurationConverter2(TestConverterManager.java:660)

testRemoveDurationConverter3(org.joda.time.convert.TestConverterManager)  Time elapsed: 0.001 sec  <<< FAILURE!
junit.framework.AssertionFailedError: expected:<5> but was:<6>
	at junit.framework.Assert.fail(Assert.java:47)
	at junit.framework.Assert.failNotEquals(Assert.java:280)
	at junit.framework.Assert.assertEquals(Assert.java:64)
	at junit.framework.Assert.assertEquals(Assert.java:198)
	at junit.framework.Assert.assertEquals(Assert.java:204)
	at org.joda.time.convert.TestConverterManager.testRemoveDurationConverter3(TestConverterManager.java:666)

testGetPeriodConverterRemovedNull(org.joda.time.convert.TestConverterManager)  Time elapsed: 0 sec  <<< FAILURE!
junit.framework.AssertionFailedError
	at junit.framework.Assert.fail(Assert.java:47)
	at junit.framework.Assert.fail(Assert.java:53)
	at org.joda.time.convert.TestConverterManager.testGetPeriodConverterRemovedNull(TestConverterManager.java:718)

testAddPeriodConverter1(org.joda.time.convert.TestConverterManager)  Time elapsed: 0.001 sec  <<< FAILURE!
junit.framework.AssertionFailedError: expected:<5> but was:<6>
	at junit.framework.Assert.fail(Assert.java:47)
	at junit.framework.Assert.failNotEquals(Assert.java:280)
	at junit.framework.Assert.assertEquals(Assert.java:64)
	at junit.framework.Assert.assertEquals(Assert.java:198)
	at junit.framework.Assert.assertEquals(Assert.java:204)
	at org.joda.time.convert.TestConverterManager.testAddPeriodConverter1(TestConverterManager.java:747)

testAddPeriodConverter2(org.joda.time.convert.TestConverterManager)  Time elapsed: 0.001 sec  <<< FAILURE!
junit.framework.AssertionFailedError: expected:<5> but was:<6>
	at junit.framework.Assert.fail(Assert.java:47)
	at junit.framework.Assert.failNotEquals(Assert.java:280)
	at junit.framework.Assert.assertEquals(Assert.java:64)
	at junit.framework.Assert.assertEquals(Assert.java:198)
	at junit.framework.Assert.assertEquals(Assert.java:204)
	at org.joda.time.convert.TestConverterManager.testAddPeriodConverter2(TestConverterManager.java:760)

testAddPeriodConverter3(org.joda.time.convert.TestConverterManager)  Time elapsed: 0 sec  <<< FAILURE!
junit.framework.AssertionFailedError: expected:<5> but was:<6>
	at junit.framework.Assert.fail(Assert.java:47)
	at junit.framework.Assert.failNotEquals(Assert.java:280)
	at junit.framework.Assert.assertEquals(Assert.java:64)
	at junit.framework.Assert.assertEquals(Assert.java:198)
	at junit.framework.Assert.assertEquals(Assert.java:204)
	at org.joda.time.convert.TestConverterManager.testAddPeriodConverter3(TestConverterManager.java:770)

testRemovePeriodConverter1(org.joda.time.convert.TestConverterManager)  Time elapsed: 0.001 sec  <<< FAILURE!
junit.framework.AssertionFailedError: expected:<Converter[java.lang.String]> but was:<null>
	at junit.framework.Assert.fail(Assert.java:47)
	at junit.framework.Assert.failNotEquals(Assert.java:280)
	at junit.framework.Assert.assertEquals(Assert.java:64)
	at junit.framework.Assert.assertEquals(Assert.java:71)
	at org.joda.time.convert.TestConverterManager.testRemovePeriodConverter1(TestConverterManager.java:795)

testRemovePeriodConverter2(org.joda.time.convert.TestConverterManager)  Time elapsed: 0 sec  <<< FAILURE!
junit.framework.AssertionFailedError: expected:<5> but was:<6>
	at junit.framework.Assert.fail(Assert.java:47)
	at junit.framework.Assert.failNotEquals(Assert.java:280)
	at junit.framework.Assert.assertEquals(Assert.java:64)
	at junit.framework.Assert.assertEquals(Assert.java:198)
	at junit.framework.Assert.assertEquals(Assert.java:204)
	at org.joda.time.convert.TestConverterManager.testRemovePeriodConverter2(TestConverterManager.java:811)

testRemovePeriodConverter3(org.joda.time.convert.TestConverterManager)  Time elapsed: 0.001 sec  <<< FAILURE!
junit.framework.AssertionFailedError: expected:<5> but was:<6>
	at junit.framework.Assert.fail(Assert.java:47)
	at junit.framework.Assert.failNotEquals(Assert.java:280)
	at junit.framework.Assert.assertEquals(Assert.java:64)
	at junit.framework.Assert.assertEquals(Assert.java:198)
	at junit.framework.Assert.assertEquals(Assert.java:204)
	at org.joda.time.convert.TestConverterManager.testRemovePeriodConverter3(TestConverterManager.java:817)

testGetIntervalConverterRemovedNull(org.joda.time.convert.TestConverterManager)  Time elapsed: 0 sec  <<< FAILURE!
junit.framework.AssertionFailedError
	at junit.framework.Assert.fail(Assert.java:47)
	at junit.framework.Assert.fail(Assert.java:53)
	at org.joda.time.convert.TestConverterManager.testGetIntervalConverterRemovedNull(TestConverterManager.java:867)

testAddIntervalConverter1(org.joda.time.convert.TestConverterManager)  Time elapsed: 0 sec  <<< FAILURE!
junit.framework.AssertionFailedError: expected:<3> but was:<4>
	at junit.framework.Assert.fail(Assert.java:47)
	at junit.framework.Assert.failNotEquals(Assert.java:280)
	at junit.framework.Assert.assertEquals(Assert.java:64)
	at junit.framework.Assert.assertEquals(Assert.java:198)
	at junit.framework.Assert.assertEquals(Assert.java:204)
	at org.joda.time.convert.TestConverterManager.testAddIntervalConverter1(TestConverterManager.java:896)

testAddIntervalConverter2(org.joda.time.convert.TestConverterManager)  Time elapsed: 0.001 sec  <<< FAILURE!
junit.framework.AssertionFailedError: expected:<3> but was:<4>
	at junit.framework.Assert.fail(Assert.java:47)
	at junit.framework.Assert.failNotEquals(Assert.java:280)
	at junit.framework.Assert.assertEquals(Assert.java:64)
	at junit.framework.Assert.assertEquals(Assert.java:198)
	at junit.framework.Assert.assertEquals(Assert.java:204)
	at org.joda.time.convert.TestConverterManager.testAddIntervalConverter2(TestConverterManager.java:909)

testAddIntervalConverter3(org.joda.time.convert.TestConverterManager)  Time elapsed: 0 sec  <<< FAILURE!
junit.framework.AssertionFailedError: expected:<3> but was:<4>
	at junit.framework.Assert.fail(Assert.java:47)
	at junit.framework.Assert.failNotEquals(Assert.java:280)
	at junit.framework.Assert.assertEquals(Assert.java:64)
	at junit.framework.Assert.assertEquals(Assert.java:198)
	at junit.framework.Assert.assertEquals(Assert.java:204)
	at org.joda.time.convert.TestConverterManager.testAddIntervalConverter3(TestConverterManager.java:919)

testGetInstantConverter(org.joda.time.convert.TestConverterManager)  Time elapsed: 0 sec  <<< FAILURE!
junit.framework.AssertionFailedError
	at junit.framework.Assert.fail(Assert.java:47)
	at junit.framework.Assert.fail(Assert.java:53)
	at org.joda.time.convert.TestConverterManager.testGetInstantConverter(TestConverterManager.java:152)

testGetInstantConverterRemovedNull(org.joda.time.convert.TestConverterManager)  Time elapsed: 0 sec  <<< FAILURE!
junit.framework.AssertionFailedError
	at junit.framework.Assert.fail(Assert.java:47)
	at junit.framework.Assert.fail(Assert.java:53)
	at org.joda.time.convert.TestConverterManager.testGetInstantConverterRemovedNull(TestConverterManager.java:161)

testGetInstantConverterOKMultipleMatches(org.joda.time.convert.TestConverterManager)  Time elapsed: 0.001 sec  <<< FAILURE!
junit.framework.AssertionFailedError: expected:<6> but was:<9>
	at junit.framework.Assert.fail(Assert.java:47)
	at junit.framework.Assert.failNotEquals(Assert.java:280)
	at junit.framework.Assert.assertEquals(Assert.java:64)
	at junit.framework.Assert.assertEquals(Assert.java:198)
	at junit.framework.Assert.assertEquals(Assert.java:204)
	at org.joda.time.convert.TestConverterManager.testGetInstantConverterOKMultipleMatches(TestConverterManager.java:184)

testGetInstantConverterBadMultipleMatches(org.joda.time.convert.TestConverterManager)  Time elapsed: 0.001 sec  <<< FAILURE!
junit.framework.AssertionFailedError: expected:<6> but was:<10>
	at junit.framework.Assert.fail(Assert.java:47)
	at junit.framework.Assert.failNotEquals(Assert.java:280)
	at junit.framework.Assert.assertEquals(Assert.java:64)
	at junit.framework.Assert.assertEquals(Assert.java:198)
	at junit.framework.Assert.assertEquals(Assert.java:204)
	at org.joda.time.convert.TestConverterManager.testGetInstantConverterBadMultipleMatches(TestConverterManager.java:205)

testGetInstantConverters(org.joda.time.convert.TestConverterManager)  Time elapsed: 0.001 sec  <<< FAILURE!
junit.framework.AssertionFailedError: expected:<6> but was:<10>
	at junit.framework.Assert.fail(Assert.java:47)
	at junit.framework.Assert.failNotEquals(Assert.java:280)
	at junit.framework.Assert.assertEquals(Assert.java:64)
	at junit.framework.Assert.assertEquals(Assert.java:198)
	at junit.framework.Assert.assertEquals(Assert.java:204)
	at org.joda.time.convert.TestConverterManager.testGetInstantConverters(TestConverterManager.java:211)

testRemoveNullRemoved1(org.joda.time.convert.TestConverterSet)  Time elapsed: 0 sec  <<< FAILURE!
junit.framework.AssertionFailedError: expected:<3> but was:<4>
	at junit.framework.Assert.fail(Assert.java:47)
	at junit.framework.Assert.failNotEquals(Assert.java:280)
	at junit.framework.Assert.assertEquals(Assert.java:64)
	at junit.framework.Assert.assertEquals(Assert.java:198)
	at junit.framework.Assert.assertEquals(Assert.java:204)
	at org.joda.time.convert.TestConverterSet.testRemoveNullRemoved1(TestConverterSet.java:152)


Results :

Failed tests: 
  org.joda.time.convert.TestConverterManager#testAddDurationConverter1 AssertionFailedError
  org.joda.time.convert.TestConverterManager#testAddDurationConverter2 AssertionFailedError
  org.joda.time.convert.TestConverterManager#testAddDurationConverter3 AssertionFailedError
  org.joda.time.convert.TestConverterManager#testAddInstantConverter1 AssertionFailedError
  org.joda.time.convert.TestConverterManager#testAddInstantConverter2 AssertionFailedError
  org.joda.time.convert.TestConverterManager#testAddInstantConverter3 AssertionFailedError
  org.joda.time.convert.TestConverterManager#testAddInstantConverter4 AssertionFailedError
  org.joda.time.convert.TestConverterManager#testAddIntervalConverter1 AssertionFailedError
  org.joda.time.convert.TestConverterManager#testAddIntervalConverter2 AssertionFailedError
  org.joda.time.convert.TestConverterManager#testAddIntervalConverter3 AssertionFailedError
  org.joda.time.convert.TestConverterManager#testAddPartialConverter1 AssertionFailedError
  org.joda.time.convert.TestConverterManager#testAddPartialConverter2 AssertionFailedError
  org.joda.time.convert.TestConverterManager#testAddPartialConverter3 AssertionFailedError
  org.joda.time.convert.TestConverterManager#testAddPartialConverter4 AssertionFailedError
  org.joda.time.convert.TestConverterManager#testAddPeriodConverter1 AssertionFailedError
  org.joda.time.convert.TestConverterManager#testAddPeriodConverter2 AssertionFailedError
  org.joda.time.convert.TestConverterManager#testAddPeriodConverter3 AssertionFailedError
  org.joda.time.convert.TestConverterManager#testGetDurationConverterRemovedNull AssertionFailedError
  org.joda.time.convert.TestConverterManager#testGetInstantConverter AssertionFailedError
  org.joda.time.convert.TestConverterManager#testGetInstantConverterBadMultipleMatches AssertionFailedError
  org.joda.time.convert.TestConverterManager#testGetInstantConverterOKMultipleMatches AssertionFailedError
  org.joda.time.convert.TestConverterManager#testGetInstantConverterRemovedNull AssertionFailedError
  org.joda.time.convert.TestConverterManager#testGetInstantConverters AssertionFailedError
  org.joda.time.convert.TestConverterManager#testGetIntervalConverterRemovedNull AssertionFailedError
  org.joda.time.convert.TestConverterManager#testGetPartialConverterBadMultipleMatches AssertionFailedError
  org.joda.time.convert.TestConverterManager#testGetPartialConverterOKMultipleMatches AssertionFailedError
  org.joda.time.convert.TestConverterManager#testGetPartialConverterRemovedNull AssertionFailedError
  org.joda.time.convert.TestConverterManager#testGetPartialConverters AssertionFailedError
  org.joda.time.convert.TestConverterManager#testGetPeriodConverterRemovedNull AssertionFailedError
  org.joda.time.convert.TestConverterManager#testRemoveDurationConverter1 AssertionFailedError
  org.joda.time.convert.TestConverterManager#testRemoveDurationConverter2 AssertionFailedError
  org.joda.time.convert.TestConverterManager#testRemoveDurationConverter3 AssertionFailedError
  org.joda.time.convert.TestConverterManager#testRemoveInstantConverter1 AssertionFailedError
  org.joda.time.convert.TestConverterManager#testRemoveInstantConverter2 AssertionFailedError
  org.joda.time.convert.TestConverterManager#testRemoveInstantConverter3 AssertionFailedError
  org.joda.time.convert.TestConverterManager#testRemoveIntervalConverter1 AssertionFailedError
  org.joda.time.convert.TestConverterManager#testRemovePartialConverter1 AssertionFailedError
  org.joda.time.convert.TestConverterManager#testRemovePartialConverter2 AssertionFailedError
  org.joda.time.convert.TestConverterManager#testRemovePartialConverter3 AssertionFailedError
  org.joda.time.convert.TestConverterManager#testRemovePeriodConverter1 AssertionFailedError
  org.joda.time.convert.TestConverterManager#testRemovePeriodConverter2 AssertionFailedError
  org.joda.time.convert.TestConverterManager#testRemovePeriodConverter3 AssertionFailedError
  org.joda.time.convert.TestConverterManager#testToString ComparisonFailure expe...
  org.joda.time.convert.TestConverterSet#testRemoveNullRemoved1 AssertionFailedError

Tests run: 4157, Failures: 44, Errors: 0, Skipped: 0

[INFO] ------------------------------------------------------------------------
[INFO] BUILD FAILURE
[INFO] ------------------------------------------------------------------------
[INFO] Total time: 15.519s
[INFO] Finished at: Thu Aug 06 03:08:35 BST 2015
[INFO] Final Memory: 10M/338M
[INFO] ------------------------------------------------------------------------
[ERROR] Failed to execute goal org.apache.maven.plugins:maven-surefire-plugin:2.18.1:test (default-test) on project joda-time: There are test failures.
[ERROR] 
[ERROR] Please refer to /home/perham/Study/LittleDarwin/Cases/joda-time-2.8.1/target/surefire-reports for the individual test results.
[ERROR] -> [Help 1]
[ERROR] 
[ERROR] To see the full stack trace of the errors, re-run Maven with the -e switch.
[ERROR] Re-run Maven using the -X switch to enable full debug logging.
[ERROR] 
[ERROR] For more information about the errors and possible solutions, please read the following articles:
[ERROR] [Help 1] http://cwiki.apache.org/confluence/display/MAVEN/MojoFailureException
