[INFO] Scanning for projects...
[INFO]                                                                         
[INFO] ------------------------------------------------------------------------
[INFO] Building Joda-Time 2.8.1
[INFO] ------------------------------------------------------------------------
[INFO] 
[INFO] --- maven-resources-plugin:2.7:resources (default-resources) @ joda-time ---
[INFO] Using 'UTF-8' encoding to copy filtered resources.
[INFO] Copying 2 resources to META-INF
[INFO] Copying 10 resources
[INFO] 
[INFO] --- maven-compiler-plugin:3.3:compile (default-compile) @ joda-time ---
[INFO] Changes detected - recompiling the module!
[INFO] Compiling 166 source files to /home/perham/Study/LittleDarwin/Cases/joda-time-2.8.1/target/classes
[INFO] 
[INFO] --- exec-maven-plugin:1.4.0:java (compile-tzdb) @ joda-time ---
Writing zoneinfo files
Writing ZoneInfoMap
[INFO] 
[INFO] --- maven-resources-plugin:2.7:testResources (default-testResources) @ joda-time ---
[INFO] Using 'UTF-8' encoding to copy filtered resources.
[INFO] Copying 34 resources
[INFO] 
[INFO] --- maven-compiler-plugin:3.3:testCompile (default-testCompile) @ joda-time ---
[INFO] Nothing to compile - all classes are up to date
[INFO] 
[INFO] --- maven-surefire-plugin:2.18.1:test (default-test) @ joda-time ---
[INFO] Surefire report directory: /home/perham/Study/LittleDarwin/Cases/joda-time-2.8.1/target/surefire-reports

-------------------------------------------------------
 T E S T S
-------------------------------------------------------
Running org.joda.time.TestAllPackages

TestBuddhistChronology.testCalendar

TestCopticChronology.testCalendar

TestEthiopicChronology.testCalendar

TestIslamicChronology.testCalendar

Testing Gregorian chronology over 1000 iterations
100% complete (i=1000)

Testing Julian chronology over 1000 iterations
100% complete (i=1000)
Writing zoneinfo files
Writing ZoneInfoMap
Tests run: 4157, Failures: 22, Errors: 44, Skipped: 0, Time elapsed: 5.335 sec <<< FAILURE! - in org.joda.time.TestAllPackages
testConstructor_badconverterObject(org.joda.time.TestInstant_Constructors)  Time elapsed: 0.006 sec  <<< ERROR!
java.lang.ArrayIndexOutOfBoundsException
	at java.lang.System.arraycopy(Native Method)
	at org.joda.time.convert.ConverterSet.add(ConverterSet.java:55)
	at org.joda.time.convert.ConverterManager.addInstantConverter(ConverterManager.java:201)
	at org.joda.time.TestInstant_Constructors.testConstructor_badconverterObject(TestInstant_Constructors.java:173)

testConstructor_badconverterObject(org.joda.time.TestDateTime_Constructors)  Time elapsed: 0.001 sec  <<< ERROR!
java.lang.ArrayIndexOutOfBoundsException
	at java.lang.System.arraycopy(Native Method)
	at org.joda.time.convert.ConverterSet.add(ConverterSet.java:55)
	at org.joda.time.convert.ConverterManager.addInstantConverter(ConverterManager.java:201)
	at org.joda.time.TestDateTime_Constructors.testConstructor_badconverterObject(TestDateTime_Constructors.java:365)

testConstructor_badconverterObject_DateTimeZone(org.joda.time.TestDateTime_Constructors)  Time elapsed: 0.001 sec  <<< ERROR!
java.lang.ArrayIndexOutOfBoundsException
	at java.lang.System.arraycopy(Native Method)
	at org.joda.time.convert.ConverterSet.add(ConverterSet.java:55)
	at org.joda.time.convert.ConverterManager.addInstantConverter(ConverterManager.java:201)
	at org.joda.time.TestDateTime_Constructors.testConstructor_badconverterObject_DateTimeZone(TestDateTime_Constructors.java:530)

testConstructor_badconverterObject_Chronology(org.joda.time.TestDateTime_Constructors)  Time elapsed: 0.001 sec  <<< ERROR!
java.lang.ArrayIndexOutOfBoundsException
	at java.lang.System.arraycopy(Native Method)
	at org.joda.time.convert.ConverterSet.add(ConverterSet.java:55)
	at org.joda.time.convert.ConverterManager.addInstantConverter(ConverterManager.java:201)
	at org.joda.time.TestDateTime_Constructors.testConstructor_badconverterObject_Chronology(TestDateTime_Constructors.java:592)

testConstructor_badconverterObject(org.joda.time.TestMutableDateTime_Constructors)  Time elapsed: 0.001 sec  <<< ERROR!
java.lang.ArrayIndexOutOfBoundsException
	at java.lang.System.arraycopy(Native Method)
	at org.joda.time.convert.ConverterSet.add(ConverterSet.java:55)
	at org.joda.time.convert.ConverterManager.addInstantConverter(ConverterManager.java:201)
	at org.joda.time.TestMutableDateTime_Constructors.testConstructor_badconverterObject(TestMutableDateTime_Constructors.java:320)

testConstructor_badconverterObject_DateTimeZone(org.joda.time.TestMutableDateTime_Constructors)  Time elapsed: 0 sec  <<< ERROR!
java.lang.ArrayIndexOutOfBoundsException
	at java.lang.System.arraycopy(Native Method)
	at org.joda.time.convert.ConverterSet.add(ConverterSet.java:55)
	at org.joda.time.convert.ConverterManager.addInstantConverter(ConverterManager.java:201)
	at org.joda.time.TestMutableDateTime_Constructors.testConstructor_badconverterObject_DateTimeZone(TestMutableDateTime_Constructors.java:382)

testConstructor_badconverterObject_Chronology(org.joda.time.TestMutableDateTime_Constructors)  Time elapsed: 0.001 sec  <<< ERROR!
java.lang.ArrayIndexOutOfBoundsException
	at java.lang.System.arraycopy(Native Method)
	at org.joda.time.convert.ConverterSet.add(ConverterSet.java:55)
	at org.joda.time.convert.ConverterManager.addInstantConverter(ConverterManager.java:201)
	at org.joda.time.TestMutableDateTime_Constructors.testConstructor_badconverterObject_Chronology(TestMutableDateTime_Constructors.java:444)

testConstructor_badconverterObject(org.joda.time.TestDateMidnight_Constructors)  Time elapsed: 0.001 sec  <<< ERROR!
java.lang.ArrayIndexOutOfBoundsException
	at java.lang.System.arraycopy(Native Method)
	at org.joda.time.convert.ConverterSet.add(ConverterSet.java:55)
	at org.joda.time.convert.ConverterManager.addInstantConverter(ConverterManager.java:201)
	at org.joda.time.TestDateMidnight_Constructors.testConstructor_badconverterObject(TestDateMidnight_Constructors.java:339)

testConstructor_badconverterObject_DateTimeZone(org.joda.time.TestDateMidnight_Constructors)  Time elapsed: 0.001 sec  <<< ERROR!
java.lang.ArrayIndexOutOfBoundsException
	at java.lang.System.arraycopy(Native Method)
	at org.joda.time.convert.ConverterSet.add(ConverterSet.java:55)
	at org.joda.time.convert.ConverterManager.addInstantConverter(ConverterManager.java:201)
	at org.joda.time.TestDateMidnight_Constructors.testConstructor_badconverterObject_DateTimeZone(TestDateMidnight_Constructors.java:401)

testConstructor_badconverterObject_Chronology(org.joda.time.TestDateMidnight_Constructors)  Time elapsed: 0.001 sec  <<< ERROR!
java.lang.ArrayIndexOutOfBoundsException
	at java.lang.System.arraycopy(Native Method)
	at org.joda.time.convert.ConverterSet.add(ConverterSet.java:55)
	at org.joda.time.convert.ConverterManager.addInstantConverter(ConverterManager.java:201)
	at org.joda.time.TestDateMidnight_Constructors.testConstructor_badconverterObject_Chronology(TestDateMidnight_Constructors.java:463)

testGetInstantConverterBadMultipleMatches(org.joda.time.convert.TestConverterManager)  Time elapsed: 0.001 sec  <<< ERROR!
java.lang.ArrayIndexOutOfBoundsException
	at java.lang.System.arraycopy(Native Method)
	at org.joda.time.convert.ConverterSet.add(ConverterSet.java:55)
	at org.joda.time.convert.ConverterManager.addInstantConverter(ConverterManager.java:201)
	at org.joda.time.convert.TestConverterManager.testGetInstantConverterBadMultipleMatches(TestConverterManager.java:195)

testAddInstantConverter1(org.joda.time.convert.TestConverterManager)  Time elapsed: 0.001 sec  <<< ERROR!
java.lang.ArrayIndexOutOfBoundsException
	at java.lang.System.arraycopy(Native Method)
	at org.joda.time.convert.ConverterSet.add(ConverterSet.java:55)
	at org.joda.time.convert.ConverterManager.addInstantConverter(ConverterManager.java:201)
	at org.joda.time.convert.TestConverterManager.testAddInstantConverter1(TestConverterManager.java:223)

testRemoveInstantConverter1(org.joda.time.convert.TestConverterManager)  Time elapsed: 0 sec  <<< ERROR!
java.lang.ArrayIndexOutOfBoundsException
	at java.lang.System.arraycopy(Native Method)
	at org.joda.time.convert.ConverterSet.add(ConverterSet.java:55)
	at org.joda.time.convert.ConverterManager.addInstantConverter(ConverterManager.java:201)
	at org.joda.time.convert.TestConverterManager.testRemoveInstantConverter1(TestConverterManager.java:288)

testRemoveInstantConverter2(org.joda.time.convert.TestConverterManager)  Time elapsed: 0 sec  <<< FAILURE!
junit.framework.AssertionFailedError: expected:<6> but was:<5>
	at junit.framework.Assert.fail(Assert.java:47)
	at junit.framework.Assert.failNotEquals(Assert.java:280)
	at junit.framework.Assert.assertEquals(Assert.java:64)
	at junit.framework.Assert.assertEquals(Assert.java:198)
	at junit.framework.Assert.assertEquals(Assert.java:204)
	at org.joda.time.convert.TestConverterManager.testRemoveInstantConverter2(TestConverterManager.java:302)

testGetPeriodConverterRemovedNull(org.joda.time.convert.TestConverterManager)  Time elapsed: 0 sec  <<< ERROR!
java.lang.ArrayIndexOutOfBoundsException
	at java.lang.System.arraycopy(Native Method)
	at org.joda.time.convert.ConverterSet.add(ConverterSet.java:55)
	at org.joda.time.convert.ConverterManager.addPeriodConverter(ConverterManager.java:462)
	at org.joda.time.convert.TestConverterManager.testGetPeriodConverterRemovedNull(TestConverterManager.java:721)

testGetPeriodConverters(org.joda.time.convert.TestConverterManager)  Time elapsed: 0 sec  <<< FAILURE!
junit.framework.AssertionFailedError: expected:<5> but was:<4>
	at junit.framework.Assert.fail(Assert.java:47)
	at junit.framework.Assert.failNotEquals(Assert.java:280)
	at junit.framework.Assert.assertEquals(Assert.java:64)
	at junit.framework.Assert.assertEquals(Assert.java:198)
	at junit.framework.Assert.assertEquals(Assert.java:204)
	at org.joda.time.convert.TestConverterManager.testGetPeriodConverters(TestConverterManager.java:729)

testAddPeriodConverter1(org.joda.time.convert.TestConverterManager)  Time elapsed: 0.001 sec  <<< ERROR!
java.lang.ArrayIndexOutOfBoundsException
	at java.lang.System.arraycopy(Native Method)
	at org.joda.time.convert.ConverterSet.add(ConverterSet.java:55)
	at org.joda.time.convert.ConverterManager.addPeriodConverter(ConverterManager.java:462)
	at org.joda.time.convert.TestConverterManager.testAddPeriodConverter1(TestConverterManager.java:740)

testAddPeriodConverter2(org.joda.time.convert.TestConverterManager)  Time elapsed: 0 sec  <<< FAILURE!
junit.framework.AssertionFailedError: expected:<5> but was:<4>
	at junit.framework.Assert.fail(Assert.java:47)
	at junit.framework.Assert.failNotEquals(Assert.java:280)
	at junit.framework.Assert.assertEquals(Assert.java:64)
	at junit.framework.Assert.assertEquals(Assert.java:198)
	at junit.framework.Assert.assertEquals(Assert.java:204)
	at org.joda.time.convert.TestConverterManager.testAddPeriodConverter2(TestConverterManager.java:760)

testAddPeriodConverter3(org.joda.time.convert.TestConverterManager)  Time elapsed: 0 sec  <<< FAILURE!
junit.framework.AssertionFailedError: expected:<5> but was:<4>
	at junit.framework.Assert.fail(Assert.java:47)
	at junit.framework.Assert.failNotEquals(Assert.java:280)
	at junit.framework.Assert.assertEquals(Assert.java:64)
	at junit.framework.Assert.assertEquals(Assert.java:198)
	at junit.framework.Assert.assertEquals(Assert.java:204)
	at org.joda.time.convert.TestConverterManager.testAddPeriodConverter3(TestConverterManager.java:770)

testRemovePeriodConverter1(org.joda.time.convert.TestConverterManager)  Time elapsed: 0.001 sec  <<< ERROR!
java.lang.ArrayIndexOutOfBoundsException
	at java.lang.System.arraycopy(Native Method)
	at org.joda.time.convert.ConverterSet.add(ConverterSet.java:55)
	at org.joda.time.convert.ConverterManager.addPeriodConverter(ConverterManager.java:462)
	at org.joda.time.convert.TestConverterManager.testRemovePeriodConverter1(TestConverterManager.java:798)

testRemovePeriodConverter2(org.joda.time.convert.TestConverterManager)  Time elapsed: 0.001 sec  <<< FAILURE!
junit.framework.AssertionFailedError: expected:<5> but was:<3>
	at junit.framework.Assert.fail(Assert.java:47)
	at junit.framework.Assert.failNotEquals(Assert.java:280)
	at junit.framework.Assert.assertEquals(Assert.java:64)
	at junit.framework.Assert.assertEquals(Assert.java:198)
	at junit.framework.Assert.assertEquals(Assert.java:204)
	at org.joda.time.convert.TestConverterManager.testRemovePeriodConverter2(TestConverterManager.java:811)

testRemovePeriodConverter3(org.joda.time.convert.TestConverterManager)  Time elapsed: 0 sec  <<< FAILURE!
junit.framework.AssertionFailedError: expected:<5> but was:<3>
	at junit.framework.Assert.fail(Assert.java:47)
	at junit.framework.Assert.failNotEquals(Assert.java:280)
	at junit.framework.Assert.assertEquals(Assert.java:64)
	at junit.framework.Assert.assertEquals(Assert.java:198)
	at junit.framework.Assert.assertEquals(Assert.java:204)
	at org.joda.time.convert.TestConverterManager.testRemovePeriodConverter3(TestConverterManager.java:817)

testGetIntervalConverterRemovedNull(org.joda.time.convert.TestConverterManager)  Time elapsed: 0 sec  <<< ERROR!
java.lang.ArrayIndexOutOfBoundsException
	at java.lang.System.arraycopy(Native Method)
	at org.joda.time.convert.ConverterSet.add(ConverterSet.java:55)
	at org.joda.time.convert.ConverterManager.addIntervalConverter(ConverterManager.java:549)
	at org.joda.time.convert.TestConverterManager.testGetIntervalConverterRemovedNull(TestConverterManager.java:870)

testGetIntervalConverters(org.joda.time.convert.TestConverterManager)  Time elapsed: 0.001 sec  <<< FAILURE!
junit.framework.AssertionFailedError: expected:<3> but was:<2>
	at junit.framework.Assert.fail(Assert.java:47)
	at junit.framework.Assert.failNotEquals(Assert.java:280)
	at junit.framework.Assert.assertEquals(Assert.java:64)
	at junit.framework.Assert.assertEquals(Assert.java:198)
	at junit.framework.Assert.assertEquals(Assert.java:204)
	at org.joda.time.convert.TestConverterManager.testGetIntervalConverters(TestConverterManager.java:878)

testAddIntervalConverter1(org.joda.time.convert.TestConverterManager)  Time elapsed: 0.001 sec  <<< ERROR!
java.lang.ArrayIndexOutOfBoundsException
	at java.lang.System.arraycopy(Native Method)
	at org.joda.time.convert.ConverterSet.add(ConverterSet.java:55)
	at org.joda.time.convert.ConverterManager.addIntervalConverter(ConverterManager.java:549)
	at org.joda.time.convert.TestConverterManager.testAddIntervalConverter1(TestConverterManager.java:889)

testAddIntervalConverter2(org.joda.time.convert.TestConverterManager)  Time elapsed: 0.001 sec  <<< FAILURE!
junit.framework.AssertionFailedError: expected:<3> but was:<2>
	at junit.framework.Assert.fail(Assert.java:47)
	at junit.framework.Assert.failNotEquals(Assert.java:280)
	at junit.framework.Assert.assertEquals(Assert.java:64)
	at junit.framework.Assert.assertEquals(Assert.java:198)
	at junit.framework.Assert.assertEquals(Assert.java:204)
	at org.joda.time.convert.TestConverterManager.testAddIntervalConverter2(TestConverterManager.java:909)

testAddIntervalConverter3(org.joda.time.convert.TestConverterManager)  Time elapsed: 0.001 sec  <<< FAILURE!
junit.framework.AssertionFailedError: expected:<3> but was:<2>
	at junit.framework.Assert.fail(Assert.java:47)
	at junit.framework.Assert.failNotEquals(Assert.java:280)
	at junit.framework.Assert.assertEquals(Assert.java:64)
	at junit.framework.Assert.assertEquals(Assert.java:198)
	at junit.framework.Assert.assertEquals(Assert.java:204)
	at org.joda.time.convert.TestConverterManager.testAddIntervalConverter3(TestConverterManager.java:919)

testRemoveIntervalConverter1(org.joda.time.convert.TestConverterManager)  Time elapsed: 0.001 sec  <<< ERROR!
java.lang.ArrayIndexOutOfBoundsException
	at java.lang.System.arraycopy(Native Method)
	at org.joda.time.convert.ConverterSet.add(ConverterSet.java:55)
	at org.joda.time.convert.ConverterManager.addIntervalConverter(ConverterManager.java:549)
	at org.joda.time.convert.TestConverterManager.testRemoveIntervalConverter1(TestConverterManager.java:947)

testRemoveIntervalConverter2(org.joda.time.convert.TestConverterManager)  Time elapsed: 0.001 sec  <<< FAILURE!
junit.framework.AssertionFailedError: expected:<3> but was:<1>
	at junit.framework.Assert.fail(Assert.java:47)
	at junit.framework.Assert.failNotEquals(Assert.java:280)
	at junit.framework.Assert.assertEquals(Assert.java:64)
	at junit.framework.Assert.assertEquals(Assert.java:198)
	at junit.framework.Assert.assertEquals(Assert.java:204)
	at org.joda.time.convert.TestConverterManager.testRemoveIntervalConverter2(TestConverterManager.java:960)

testRemoveIntervalConverter3(org.joda.time.convert.TestConverterManager)  Time elapsed: 0 sec  <<< FAILURE!
junit.framework.AssertionFailedError: expected:<3> but was:<1>
	at junit.framework.Assert.fail(Assert.java:47)
	at junit.framework.Assert.failNotEquals(Assert.java:280)
	at junit.framework.Assert.assertEquals(Assert.java:64)
	at junit.framework.Assert.assertEquals(Assert.java:198)
	at junit.framework.Assert.assertEquals(Assert.java:204)
	at org.joda.time.convert.TestConverterManager.testRemoveIntervalConverter3(TestConverterManager.java:966)

testGetInstantConverter(org.joda.time.convert.TestConverterManager)  Time elapsed: 0.001 sec  <<< ERROR!
java.lang.IllegalArgumentException: No instant converter found for type: java.lang.String
	at org.joda.time.convert.ConverterManager.getInstantConverter(ConverterManager.java:165)
	at org.joda.time.convert.TestConverterManager.testGetInstantConverter(TestConverterManager.java:138)

testGetInstantConverterRemovedNull(org.joda.time.convert.TestConverterManager)  Time elapsed: 0.001 sec  <<< ERROR!
java.lang.ArrayIndexOutOfBoundsException
	at java.lang.System.arraycopy(Native Method)
	at org.joda.time.convert.ConverterSet.add(ConverterSet.java:55)
	at org.joda.time.convert.ConverterManager.addInstantConverter(ConverterManager.java:201)
	at org.joda.time.convert.TestConverterManager.testGetInstantConverterRemovedNull(TestConverterManager.java:164)

testGetInstantConverterOKMultipleMatches(org.joda.time.convert.TestConverterManager)  Time elapsed: 0.001 sec  <<< ERROR!
java.lang.ArrayIndexOutOfBoundsException
	at java.lang.System.arraycopy(Native Method)
	at org.joda.time.convert.ConverterSet.add(ConverterSet.java:55)
	at org.joda.time.convert.ConverterManager.addInstantConverter(ConverterManager.java:201)
	at org.joda.time.convert.TestConverterManager.testGetInstantConverterOKMultipleMatches(TestConverterManager.java:177)

testRemoveInstantConverter3(org.joda.time.convert.TestConverterManager)  Time elapsed: 0 sec  <<< FAILURE!
junit.framework.AssertionFailedError: expected:<6> but was:<4>
	at junit.framework.Assert.fail(Assert.java:47)
	at junit.framework.Assert.failNotEquals(Assert.java:280)
	at junit.framework.Assert.assertEquals(Assert.java:64)
	at junit.framework.Assert.assertEquals(Assert.java:198)
	at junit.framework.Assert.assertEquals(Assert.java:204)
	at org.joda.time.convert.TestConverterManager.testRemoveInstantConverter3(TestConverterManager.java:308)

testGetPartialConverterRemovedNull(org.joda.time.convert.TestConverterManager)  Time elapsed: 0.003 sec  <<< ERROR!
java.lang.ArrayIndexOutOfBoundsException
	at java.lang.System.arraycopy(Native Method)
	at org.joda.time.convert.ConverterSet.add(ConverterSet.java:55)
	at org.joda.time.convert.ConverterManager.addPartialConverter(ConverterManager.java:288)
	at org.joda.time.convert.TestConverterManager.testGetPartialConverterRemovedNull(TestConverterManager.java:369)

testGetPartialConverterOKMultipleMatches(org.joda.time.convert.TestConverterManager)  Time elapsed: 0 sec  <<< ERROR!
java.lang.ArrayIndexOutOfBoundsException
	at java.lang.System.arraycopy(Native Method)
	at org.joda.time.convert.ConverterSet.add(ConverterSet.java:55)
	at org.joda.time.convert.ConverterManager.addPartialConverter(ConverterManager.java:288)
	at org.joda.time.convert.TestConverterManager.testGetPartialConverterOKMultipleMatches(TestConverterManager.java:383)

testGetPartialConverterBadMultipleMatches(org.joda.time.convert.TestConverterManager)  Time elapsed: 0 sec  <<< ERROR!
java.lang.ArrayIndexOutOfBoundsException
	at java.lang.System.arraycopy(Native Method)
	at org.joda.time.convert.ConverterSet.add(ConverterSet.java:55)
	at org.joda.time.convert.ConverterManager.addPartialConverter(ConverterManager.java:288)
	at org.joda.time.convert.TestConverterManager.testGetPartialConverterBadMultipleMatches(TestConverterManager.java:402)

testGetPartialConverters(org.joda.time.convert.TestConverterManager)  Time elapsed: 0.001 sec  <<< FAILURE!
junit.framework.AssertionFailedError: expected:<7> but was:<6>
	at junit.framework.Assert.fail(Assert.java:47)
	at junit.framework.Assert.failNotEquals(Assert.java:280)
	at junit.framework.Assert.assertEquals(Assert.java:64)
	at junit.framework.Assert.assertEquals(Assert.java:198)
	at junit.framework.Assert.assertEquals(Assert.java:204)
	at org.joda.time.convert.TestConverterManager.testGetPartialConverters(TestConverterManager.java:418)

testAddPartialConverter1(org.joda.time.convert.TestConverterManager)  Time elapsed: 0.001 sec  <<< ERROR!
java.lang.ArrayIndexOutOfBoundsException
	at java.lang.System.arraycopy(Native Method)
	at org.joda.time.convert.ConverterSet.add(ConverterSet.java:55)
	at org.joda.time.convert.ConverterManager.addPartialConverter(ConverterManager.java:288)
	at org.joda.time.convert.TestConverterManager.testAddPartialConverter1(TestConverterManager.java:431)

testAddPartialConverter2(org.joda.time.convert.TestConverterManager)  Time elapsed: 0 sec  <<< FAILURE!
junit.framework.AssertionFailedError: expected:<7> but was:<6>
	at junit.framework.Assert.fail(Assert.java:47)
	at junit.framework.Assert.failNotEquals(Assert.java:280)
	at junit.framework.Assert.assertEquals(Assert.java:64)
	at junit.framework.Assert.assertEquals(Assert.java:198)
	at junit.framework.Assert.assertEquals(Assert.java:204)
	at org.joda.time.convert.TestConverterManager.testAddPartialConverter2(TestConverterManager.java:453)

testAddPartialConverter3(org.joda.time.convert.TestConverterManager)  Time elapsed: 0.001 sec  <<< FAILURE!
junit.framework.AssertionFailedError: expected:<7> but was:<6>
	at junit.framework.Assert.fail(Assert.java:47)
	at junit.framework.Assert.failNotEquals(Assert.java:280)
	at junit.framework.Assert.assertEquals(Assert.java:64)
	at junit.framework.Assert.assertEquals(Assert.java:198)
	at junit.framework.Assert.assertEquals(Assert.java:204)
	at org.joda.time.convert.TestConverterManager.testAddPartialConverter3(TestConverterManager.java:463)

testAddPartialConverter4(org.joda.time.convert.TestConverterManager)  Time elapsed: 0 sec  <<< FAILURE!
junit.framework.AssertionFailedError: expected:<7> but was:<6>
	at junit.framework.Assert.fail(Assert.java:47)
	at junit.framework.Assert.failNotEquals(Assert.java:280)
	at junit.framework.Assert.assertEquals(Assert.java:64)
	at junit.framework.Assert.assertEquals(Assert.java:198)
	at junit.framework.Assert.assertEquals(Assert.java:204)
	at org.joda.time.convert.TestConverterManager.testAddPartialConverter4(TestConverterManager.java:469)

testRemovePartialConverter1(org.joda.time.convert.TestConverterManager)  Time elapsed: 0.001 sec  <<< ERROR!
java.lang.ArrayIndexOutOfBoundsException
	at java.lang.System.arraycopy(Native Method)
	at org.joda.time.convert.ConverterSet.add(ConverterSet.java:55)
	at org.joda.time.convert.ConverterManager.addPartialConverter(ConverterManager.java:288)
	at org.joda.time.convert.TestConverterManager.testRemovePartialConverter1(TestConverterManager.java:497)

testRemovePartialConverter2(org.joda.time.convert.TestConverterManager)  Time elapsed: 0 sec  <<< FAILURE!
junit.framework.AssertionFailedError: expected:<7> but was:<5>
	at junit.framework.Assert.fail(Assert.java:47)
	at junit.framework.Assert.failNotEquals(Assert.java:280)
	at junit.framework.Assert.assertEquals(Assert.java:64)
	at junit.framework.Assert.assertEquals(Assert.java:198)
	at junit.framework.Assert.assertEquals(Assert.java:204)
	at org.joda.time.convert.TestConverterManager.testRemovePartialConverter2(TestConverterManager.java:512)

testRemovePartialConverter3(org.joda.time.convert.TestConverterManager)  Time elapsed: 0.001 sec  <<< FAILURE!
junit.framework.AssertionFailedError: expected:<7> but was:<5>
	at junit.framework.Assert.fail(Assert.java:47)
	at junit.framework.Assert.failNotEquals(Assert.java:280)
	at junit.framework.Assert.assertEquals(Assert.java:64)
	at junit.framework.Assert.assertEquals(Assert.java:198)
	at junit.framework.Assert.assertEquals(Assert.java:204)
	at org.joda.time.convert.TestConverterManager.testRemovePartialConverter3(TestConverterManager.java:518)

testGetDurationConverterRemovedNull(org.joda.time.convert.TestConverterManager)  Time elapsed: 0 sec  <<< ERROR!
java.lang.ArrayIndexOutOfBoundsException
	at java.lang.System.arraycopy(Native Method)
	at org.joda.time.convert.ConverterSet.add(ConverterSet.java:55)
	at org.joda.time.convert.ConverterManager.addDurationConverter(ConverterManager.java:375)
	at org.joda.time.convert.TestConverterManager.testGetDurationConverterRemovedNull(TestConverterManager.java:573)

testGetDurationConverters(org.joda.time.convert.TestConverterManager)  Time elapsed: 0.001 sec  <<< FAILURE!
junit.framework.AssertionFailedError: expected:<5> but was:<4>
	at junit.framework.Assert.fail(Assert.java:47)
	at junit.framework.Assert.failNotEquals(Assert.java:280)
	at junit.framework.Assert.assertEquals(Assert.java:64)
	at junit.framework.Assert.assertEquals(Assert.java:198)
	at junit.framework.Assert.assertEquals(Assert.java:204)
	at org.joda.time.convert.TestConverterManager.testGetDurationConverters(TestConverterManager.java:581)

testAddDurationConverter1(org.joda.time.convert.TestConverterManager)  Time elapsed: 0 sec  <<< ERROR!
java.lang.ArrayIndexOutOfBoundsException
	at java.lang.System.arraycopy(Native Method)
	at org.joda.time.convert.ConverterSet.add(ConverterSet.java:55)
	at org.joda.time.convert.ConverterManager.addDurationConverter(ConverterManager.java:375)
	at org.joda.time.convert.TestConverterManager.testAddDurationConverter1(TestConverterManager.java:591)

testAddDurationConverter2(org.joda.time.convert.TestConverterManager)  Time elapsed: 0.001 sec  <<< FAILURE!
junit.framework.AssertionFailedError: expected:<5> but was:<4>
	at junit.framework.Assert.fail(Assert.java:47)
	at junit.framework.Assert.failNotEquals(Assert.java:280)
	at junit.framework.Assert.assertEquals(Assert.java:64)
	at junit.framework.Assert.assertEquals(Assert.java:198)
	at junit.framework.Assert.assertEquals(Assert.java:204)
	at org.joda.time.convert.TestConverterManager.testAddDurationConverter2(TestConverterManager.java:610)

testAddDurationConverter3(org.joda.time.convert.TestConverterManager)  Time elapsed: 0.001 sec  <<< FAILURE!
junit.framework.AssertionFailedError: expected:<5> but was:<4>
	at junit.framework.Assert.fail(Assert.java:47)
	at junit.framework.Assert.failNotEquals(Assert.java:280)
	at junit.framework.Assert.assertEquals(Assert.java:64)
	at junit.framework.Assert.assertEquals(Assert.java:198)
	at junit.framework.Assert.assertEquals(Assert.java:204)
	at org.joda.time.convert.TestConverterManager.testAddDurationConverter3(TestConverterManager.java:620)

testRemoveDurationConverter1(org.joda.time.convert.TestConverterManager)  Time elapsed: 0 sec  <<< ERROR!
java.lang.ArrayIndexOutOfBoundsException
	at java.lang.System.arraycopy(Native Method)
	at org.joda.time.convert.ConverterSet.add(ConverterSet.java:55)
	at org.joda.time.convert.ConverterManager.addDurationConverter(ConverterManager.java:375)
	at org.joda.time.convert.TestConverterManager.testRemoveDurationConverter1(TestConverterManager.java:648)

testRemoveDurationConverter2(org.joda.time.convert.TestConverterManager)  Time elapsed: 0.001 sec  <<< FAILURE!
junit.framework.AssertionFailedError: expected:<5> but was:<3>
	at junit.framework.Assert.fail(Assert.java:47)
	at junit.framework.Assert.failNotEquals(Assert.java:280)
	at junit.framework.Assert.assertEquals(Assert.java:64)
	at junit.framework.Assert.assertEquals(Assert.java:198)
	at junit.framework.Assert.assertEquals(Assert.java:204)
	at org.joda.time.convert.TestConverterManager.testRemoveDurationConverter2(TestConverterManager.java:660)

testAddNullRemoved1(org.joda.time.convert.TestConverterSet)  Time elapsed: 0 sec  <<< ERROR!
java.lang.ArrayIndexOutOfBoundsException
	at java.lang.System.arraycopy(Native Method)
	at org.joda.time.convert.ConverterSet.add(ConverterSet.java:55)
	at org.joda.time.convert.TestConverterSet.testAddNullRemoved1(TestConverterSet.java:119)

testGetDateTime(org.joda.time.convert.TestStringConverter)  Time elapsed: 0.001 sec  <<< ERROR!
java.lang.IllegalArgumentException: No instant converter found for type: java.lang.String
	at org.joda.time.convert.ConverterManager.getInstantConverter(ConverterManager.java:165)
	at org.joda.time.base.BaseDateTime.<init>(BaseDateTime.java:151)
	at org.joda.time.DateTime.<init>(DateTime.java:281)
	at org.joda.time.convert.TestStringConverter.testGetDateTime(TestStringConverter.java:212)

testGetDateTime1(org.joda.time.convert.TestStringConverter)  Time elapsed: 0 sec  <<< ERROR!
java.lang.IllegalArgumentException: No instant converter found for type: java.lang.String
	at org.joda.time.convert.ConverterManager.getInstantConverter(ConverterManager.java:165)
	at org.joda.time.base.BaseDateTime.<init>(BaseDateTime.java:173)
	at org.joda.time.DateTime.<init>(DateTime.java:257)
	at org.joda.time.convert.TestStringConverter.testGetDateTime1(TestStringConverter.java:217)

testGetDateTime2(org.joda.time.convert.TestStringConverter)  Time elapsed: 0.001 sec  <<< ERROR!
java.lang.IllegalArgumentException: No instant converter found for type: java.lang.String
	at org.joda.time.convert.ConverterManager.getInstantConverter(ConverterManager.java:165)
	at org.joda.time.base.BaseDateTime.<init>(BaseDateTime.java:173)
	at org.joda.time.DateTime.<init>(DateTime.java:257)
	at org.joda.time.convert.TestStringConverter.testGetDateTime2(TestStringConverter.java:229)

testGetDateTime3(org.joda.time.convert.TestStringConverter)  Time elapsed: 0 sec  <<< ERROR!
java.lang.IllegalArgumentException: No instant converter found for type: java.lang.String
	at org.joda.time.convert.ConverterManager.getInstantConverter(ConverterManager.java:165)
	at org.joda.time.base.BaseDateTime.<init>(BaseDateTime.java:151)
	at org.joda.time.DateTime.<init>(DateTime.java:281)
	at org.joda.time.convert.TestStringConverter.testGetDateTime3(TestStringConverter.java:241)

testGetDateTime4(org.joda.time.convert.TestStringConverter)  Time elapsed: 0 sec  <<< ERROR!
java.lang.IllegalArgumentException: No instant converter found for type: java.lang.String
	at org.joda.time.convert.ConverterManager.getInstantConverter(ConverterManager.java:165)
	at org.joda.time.base.BaseDateTime.<init>(BaseDateTime.java:151)
	at org.joda.time.DateTime.<init>(DateTime.java:281)
	at org.joda.time.convert.TestStringConverter.testGetDateTime4(TestStringConverter.java:253)

testGetDateTime5(org.joda.time.convert.TestStringConverter)  Time elapsed: 0.001 sec  <<< ERROR!
java.lang.IllegalArgumentException: No instant converter found for type: java.lang.String
	at org.joda.time.convert.ConverterManager.getInstantConverter(ConverterManager.java:165)
	at org.joda.time.base.BaseDateTime.<init>(BaseDateTime.java:173)
	at org.joda.time.DateTime.<init>(DateTime.java:302)
	at org.joda.time.convert.TestStringConverter.testGetDateTime5(TestStringConverter.java:265)

testGetDateTime6(org.joda.time.convert.TestStringConverter)  Time elapsed: 0 sec  <<< ERROR!
java.lang.IllegalArgumentException: No instant converter found for type: java.lang.String
	at org.joda.time.convert.ConverterManager.getInstantConverter(ConverterManager.java:165)
	at org.joda.time.base.BaseDateTime.<init>(BaseDateTime.java:173)
	at org.joda.time.DateTime.<init>(DateTime.java:302)
	at org.joda.time.convert.TestStringConverter.testGetDateTime6(TestStringConverter.java:277)

test_appendFixedDecimal(org.joda.time.format.TestDateTimeFormatterBuilder)  Time elapsed: 0.001 sec  <<< ERROR!
java.lang.IllegalArgumentException: No instant converter found for type: java.lang.String
	at org.joda.time.convert.ConverterManager.getInstantConverter(ConverterManager.java:165)
	at org.joda.time.base.BaseDateTime.<init>(BaseDateTime.java:173)
	at org.joda.time.DateTime.<init>(DateTime.java:257)
	at org.joda.time.format.TestDateTimeFormatterBuilder.test_appendFixedDecimal(TestDateTimeFormatterBuilder.java:246)

test_appendFixedSignedDecimal(org.joda.time.format.TestDateTimeFormatterBuilder)  Time elapsed: 0 sec  <<< ERROR!
java.lang.IllegalArgumentException: No instant converter found for type: java.lang.String
	at org.joda.time.convert.ConverterManager.getInstantConverter(ConverterManager.java:165)
	at org.joda.time.base.BaseDateTime.<init>(BaseDateTime.java:173)
	at org.joda.time.DateTime.<init>(DateTime.java:257)
	at org.joda.time.format.TestDateTimeFormatterBuilder.test_appendFixedSignedDecimal(TestDateTimeFormatterBuilder.java:303)

testSerialization(org.joda.time.tz.TestBuilder)  Time elapsed: 0.007 sec  <<< ERROR!
java.lang.IllegalArgumentException: No instant converter found for type: java.lang.String
	at org.joda.time.convert.ConverterManager.getInstantConverter(ConverterManager.java:165)
	at org.joda.time.base.BaseDateTime.<init>(BaseDateTime.java:173)
	at org.joda.time.DateTime.<init>(DateTime.java:257)
	at org.joda.time.tz.TestBuilder.testForwardTransitions(TestBuilder.java:241)
	at org.joda.time.tz.TestBuilder.testSerialization(TestBuilder.java:282)

testForwardTransitions(org.joda.time.tz.TestBuilder)  Time elapsed: 0.005 sec  <<< ERROR!
java.lang.IllegalArgumentException: No instant converter found for type: java.lang.String
	at org.joda.time.convert.ConverterManager.getInstantConverter(ConverterManager.java:165)
	at org.joda.time.base.BaseDateTime.<init>(BaseDateTime.java:173)
	at org.joda.time.DateTime.<init>(DateTime.java:257)
	at org.joda.time.tz.TestBuilder.testForwardTransitions(TestBuilder.java:241)
	at org.joda.time.tz.TestBuilder.testForwardTransitions(TestBuilder.java:217)

testReverseTransitions(org.joda.time.tz.TestBuilder)  Time elapsed: 0.005 sec  <<< ERROR!
java.lang.IllegalArgumentException: No instant converter found for type: java.lang.String
	at org.joda.time.convert.ConverterManager.getInstantConverter(ConverterManager.java:165)
	at org.joda.time.base.BaseDateTime.<init>(BaseDateTime.java:173)
	at org.joda.time.DateTime.<init>(DateTime.java:257)
	at org.joda.time.tz.TestBuilder.testReverseTransitions(TestBuilder.java:259)
	at org.joda.time.tz.TestBuilder.testReverseTransitions(TestBuilder.java:255)

testCompile(org.joda.time.tz.TestCompiler)  Time elapsed: 0.024 sec  <<< ERROR!
java.lang.IllegalArgumentException: No instant converter found for type: java.lang.String
	at org.joda.time.convert.ConverterManager.getInstantConverter(ConverterManager.java:165)
	at org.joda.time.base.BaseDateTime.<init>(BaseDateTime.java:173)
	at org.joda.time.DateTime.<init>(DateTime.java:257)
	at org.joda.time.tz.TestBuilder.testForwardTransitions(TestBuilder.java:241)
	at org.joda.time.tz.TestCompiler.testCompile(TestCompiler.java:117)


Results :

Failed tests: 
  org.joda.time.convert.TestConverterManager#testAddDurationConverter2 AssertionFailedError
  org.joda.time.convert.TestConverterManager#testAddDurationConverter3 AssertionFailedError
  org.joda.time.convert.TestConverterManager#testAddIntervalConverter2 AssertionFailedError
  org.joda.time.convert.TestConverterManager#testAddIntervalConverter3 AssertionFailedError
  org.joda.time.convert.TestConverterManager#testAddPartialConverter2 AssertionFailedError
  org.joda.time.convert.TestConverterManager#testAddPartialConverter3 AssertionFailedError
  org.joda.time.convert.TestConverterManager#testAddPartialConverter4 AssertionFailedError
  org.joda.time.convert.TestConverterManager#testAddPeriodConverter2 AssertionFailedError
  org.joda.time.convert.TestConverterManager#testAddPeriodConverter3 AssertionFailedError
  org.joda.time.convert.TestConverterManager#testGetDurationConverters AssertionFailedError
  org.joda.time.convert.TestConverterManager#testGetIntervalConverters AssertionFailedError
  org.joda.time.convert.TestConverterManager#testGetPartialConverters AssertionFailedError
  org.joda.time.convert.TestConverterManager#testGetPeriodConverters AssertionFailedError
  org.joda.time.convert.TestConverterManager#testRemoveDurationConverter2 AssertionFailedError
  org.joda.time.convert.TestConverterManager#testRemoveInstantConverter2 AssertionFailedError
  org.joda.time.convert.TestConverterManager#testRemoveInstantConverter3 AssertionFailedError
  org.joda.time.convert.TestConverterManager#testRemoveIntervalConverter2 AssertionFailedError
  org.joda.time.convert.TestConverterManager#testRemoveIntervalConverter3 AssertionFailedError
  org.joda.time.convert.TestConverterManager#testRemovePartialConverter2 AssertionFailedError
  org.joda.time.convert.TestConverterManager#testRemovePartialConverter3 AssertionFailedError
  org.joda.time.convert.TestConverterManager#testRemovePeriodConverter2 AssertionFailedError
  org.joda.time.convert.TestConverterManager#testRemovePeriodConverter3 AssertionFailedError
Tests in error: 
  org.joda.time.TestDateMidnight_Constructors#testConstructor_badconverterObject ArrayIndexOutOfBoundsException
  org.joda.time.TestDateMidnight_Constructors#testConstructor_badconverterObject_Chronology ArrayIndexOutOfBoundsException
  org.joda.time.TestDateMidnight_Constructors#testConstructor_badconverterObject_DateTimeZone ArrayIndexOutOfBoundsException
  org.joda.time.TestDateTime_Constructors#testConstructor_badconverterObject ArrayIndexOutOfBoundsException
  org.joda.time.TestDateTime_Constructors#testConstructor_badconverterObject_Chronology ArrayIndexOutOfBoundsException
  org.joda.time.TestDateTime_Constructors#testConstructor_badconverterObject_DateTimeZone ArrayIndexOutOfBoundsException
  org.joda.time.TestInstant_Constructors#testConstructor_badconverterObject ArrayIndexOutOfBoundsException
  org.joda.time.TestMutableDateTime_Constructors#testConstructor_badconverterObject ArrayIndexOutOfBoundsException
  org.joda.time.TestMutableDateTime_Constructors#testConstructor_badconverterObject_Chronology ArrayIndexOutOfBoundsException
  org.joda.time.TestMutableDateTime_Constructors#testConstructor_badconverterObject_DateTimeZone ArrayIndexOutOfBoundsException
  org.joda.time.convert.TestConverterManager#testAddDurationConverter1 ArrayIndexOutOfBoundsException
  org.joda.time.convert.TestConverterManager#testAddInstantConverter1 ArrayIndexOutOfBoundsException
  org.joda.time.convert.TestConverterManager#testAddIntervalConverter1 ArrayIndexOutOfBoundsException
  org.joda.time.convert.TestConverterManager#testAddPartialConverter1 ArrayIndexOutOfBoundsException
  org.joda.time.convert.TestConverterManager#testAddPeriodConverter1 ArrayIndexOutOfBoundsException
  org.joda.time.convert.TestConverterManager#testGetDurationConverterRemovedNull ArrayIndexOutOfBoundsException
  org.joda.time.convert.TestConverterManager#testGetInstantConverter IllegalArgumentException
  org.joda.time.convert.TestConverterManager#testGetInstantConverterBadMultipleMatches ArrayIndexOutOfBoundsException
  org.joda.time.convert.TestConverterManager#testGetInstantConverterOKMultipleMatches ArrayIndexOutOfBoundsException
  org.joda.time.convert.TestConverterManager#testGetInstantConverterRemovedNull ArrayIndexOutOfBoundsException
  org.joda.time.convert.TestConverterManager#testGetIntervalConverterRemovedNull ArrayIndexOutOfBoundsException
  org.joda.time.convert.TestConverterManager#testGetPartialConverterBadMultipleMatches ArrayIndexOutOfBoundsException
  org.joda.time.convert.TestConverterManager#testGetPartialConverterOKMultipleMatches ArrayIndexOutOfBoundsException
  org.joda.time.convert.TestConverterManager#testGetPartialConverterRemovedNull ArrayIndexOutOfBoundsException
  org.joda.time.convert.TestConverterManager#testGetPeriodConverterRemovedNull ArrayIndexOutOfBoundsException
  org.joda.time.convert.TestConverterManager#testRemoveDurationConverter1 ArrayIndexOutOfBoundsException
  org.joda.time.convert.TestConverterManager#testRemoveInstantConverter1 ArrayIndexOutOfBoundsException
  org.joda.time.convert.TestConverterManager#testRemoveIntervalConverter1 ArrayIndexOutOfBoundsException
  org.joda.time.convert.TestConverterManager#testRemovePartialConverter1 ArrayIndexOutOfBoundsException
  org.joda.time.convert.TestConverterManager#testRemovePeriodConverter1 ArrayIndexOutOfBoundsException
  org.joda.time.convert.TestConverterSet#testAddNullRemoved1 ArrayIndexOutOfBoundsException
  org.joda.time.convert.TestStringConverter#testGetDateTime IllegalArgumentException
  org.joda.time.convert.TestStringConverter#testGetDateTime1 IllegalArgumentException
  org.joda.time.convert.TestStringConverter#testGetDateTime2 IllegalArgumentException
  org.joda.time.convert.TestStringConverter#testGetDateTime3 IllegalArgumentException
  org.joda.time.convert.TestStringConverter#testGetDateTime4 IllegalArgumentException
  org.joda.time.convert.TestStringConverter#testGetDateTime5 IllegalArgumentException
  org.joda.time.convert.TestStringConverter#testGetDateTime6 IllegalArgumentException
  org.joda.time.format.TestDateTimeFormatterBuilder#test_appendFixedDecimal IllegalArgumentException
  org.joda.time.format.TestDateTimeFormatterBuilder#test_appendFixedSignedDecimal IllegalArgumentException
  org.joda.time.tz.TestBuilder#testForwardTransitions IllegalArgumentException N...
  org.joda.time.tz.TestBuilder#testReverseTransitions IllegalArgumentException N...
  org.joda.time.tz.TestBuilder#testSerialization IllegalArgumentException No ins...
  org.joda.time.tz.TestCompiler#testCompile IllegalArgumentException No instant ...

Tests run: 4157, Failures: 22, Errors: 44, Skipped: 0

[INFO] ------------------------------------------------------------------------
[INFO] BUILD FAILURE
[INFO] ------------------------------------------------------------------------
[INFO] Total time: 15.207s
[INFO] Finished at: Thu Aug 06 02:56:52 BST 2015
[INFO] Final Memory: 8M/217M
[INFO] ------------------------------------------------------------------------
[ERROR] Failed to execute goal org.apache.maven.plugins:maven-surefire-plugin:2.18.1:test (default-test) on project joda-time: There are test failures.
[ERROR] 
[ERROR] Please refer to /home/perham/Study/LittleDarwin/Cases/joda-time-2.8.1/target/surefire-reports for the individual test results.
[ERROR] -> [Help 1]
[ERROR] 
[ERROR] To see the full stack trace of the errors, re-run Maven with the -e switch.
[ERROR] Re-run Maven using the -X switch to enable full debug logging.
[ERROR] 
[ERROR] For more information about the errors and possible solutions, please read the following articles:
[ERROR] [Help 1] http://cwiki.apache.org/confluence/display/MAVEN/MojoFailureException
