[INFO] Scanning for projects...
[INFO]                                                                         
[INFO] ------------------------------------------------------------------------
[INFO] Building Joda-Time 2.8.1
[INFO] ------------------------------------------------------------------------
[INFO] 
[INFO] --- maven-resources-plugin:2.7:resources (default-resources) @ joda-time ---
[INFO] Using 'UTF-8' encoding to copy filtered resources.
[INFO] Copying 2 resources to META-INF
[INFO] Copying 10 resources
[INFO] 
[INFO] --- maven-compiler-plugin:3.3:compile (default-compile) @ joda-time ---
[INFO] Changes detected - recompiling the module!
[INFO] Compiling 166 source files to /home/perham/Study/LittleDarwin/Cases/joda-time-2.8.1/target/classes
[INFO] 
[INFO] --- exec-maven-plugin:1.4.0:java (compile-tzdb) @ joda-time ---
Writing zoneinfo files
Writing ZoneInfoMap
[INFO] 
[INFO] --- maven-resources-plugin:2.7:testResources (default-testResources) @ joda-time ---
[INFO] Using 'UTF-8' encoding to copy filtered resources.
[INFO] Copying 34 resources
[INFO] 
[INFO] --- maven-compiler-plugin:3.3:testCompile (default-testCompile) @ joda-time ---
[INFO] Nothing to compile - all classes are up to date
[INFO] 
[INFO] --- maven-surefire-plugin:2.18.1:test (default-test) @ joda-time ---
[INFO] Surefire report directory: /home/perham/Study/LittleDarwin/Cases/joda-time-2.8.1/target/surefire-reports

-------------------------------------------------------
 T E S T S
-------------------------------------------------------
Running org.joda.time.TestAllPackages

TestBuddhistChronology.testCalendar

TestCopticChronology.testCalendar

TestEthiopicChronology.testCalendar

TestIslamicChronology.testCalendar

Testing Gregorian chronology over 1000 iterations
100% complete (i=1000)

Testing Julian chronology over 1000 iterations
100% complete (i=1000)
Writing zoneinfo files
Writing ZoneInfoMap
Tests run: 4157, Failures: 0, Errors: 2, Skipped: 0, Time elapsed: 5.443 sec <<< FAILURE! - in org.joda.time.TestAllPackages
testGetInstantConverterOKMultipleMatches(org.joda.time.convert.TestConverterManager)  Time elapsed: 0.007 sec  <<< ERROR!
java.lang.IllegalStateException: Unable to find best converter for type "org.joda.time.DateTime" from remaining set: org.joda.time.convert.ReadableInstantConverter[org.joda.time.ReadableInstant], org.joda.time.convert.TestConverterManager$3[org.joda.time.ReadableDateTime], 
	at org.joda.time.convert.ConverterSet.selectSlow(ConverterSet.java:112)
	at org.joda.time.convert.ConverterSet.select(ConverterSet.java:19)
	at org.joda.time.convert.ConverterManager.getInstantConverter(ConverterManager.java:160)
	at org.joda.time.convert.TestConverterManager.testGetInstantConverterOKMultipleMatches(TestConverterManager.java:178)

testGetPartialConverterOKMultipleMatches(org.joda.time.convert.TestConverterManager)  Time elapsed: 0.001 sec  <<< ERROR!
java.lang.IllegalStateException: Unable to find best converter for type "org.joda.time.DateTime" from remaining set: org.joda.time.convert.ReadableInstantConverter[org.joda.time.ReadableInstant], org.joda.time.convert.TestConverterManager$8[org.joda.time.ReadableDateTime], 
	at org.joda.time.convert.ConverterSet.selectSlow(ConverterSet.java:112)
	at org.joda.time.convert.ConverterSet.select(ConverterSet.java:19)
	at org.joda.time.convert.ConverterManager.getPartialConverter(ConverterManager.java:247)
	at org.joda.time.convert.TestConverterManager.testGetPartialConverterOKMultipleMatches(TestConverterManager.java:384)


Results :

Tests in error: 
  org.joda.time.convert.TestConverterManager#testGetInstantConverterOKMultipleMatches IllegalStateException
  org.joda.time.convert.TestConverterManager#testGetPartialConverterOKMultipleMatches IllegalStateException

Tests run: 4157, Failures: 0, Errors: 2, Skipped: 0

[INFO] ------------------------------------------------------------------------
[INFO] BUILD FAILURE
[INFO] ------------------------------------------------------------------------
[INFO] Total time: 15.512s
[INFO] Finished at: Thu Aug 06 03:04:34 BST 2015
[INFO] Final Memory: 9M/207M
[INFO] ------------------------------------------------------------------------
[ERROR] Failed to execute goal org.apache.maven.plugins:maven-surefire-plugin:2.18.1:test (default-test) on project joda-time: There are test failures.
[ERROR] 
[ERROR] Please refer to /home/perham/Study/LittleDarwin/Cases/joda-time-2.8.1/target/surefire-reports for the individual test results.
[ERROR] -> [Help 1]
[ERROR] 
[ERROR] To see the full stack trace of the errors, re-run Maven with the -e switch.
[ERROR] Re-run Maven using the -X switch to enable full debug logging.
[ERROR] 
[ERROR] For more information about the errors and possible solutions, please read the following articles:
[ERROR] [Help 1] http://cwiki.apache.org/confluence/display/MAVEN/MojoFailureException
