[INFO] Scanning for projects...
[INFO]                                                                         
[INFO] ------------------------------------------------------------------------
[INFO] Building Joda-Time 2.8.1
[INFO] ------------------------------------------------------------------------
[INFO] 
[INFO] --- maven-resources-plugin:2.7:resources (default-resources) @ joda-time ---
[INFO] Using 'UTF-8' encoding to copy filtered resources.
[INFO] Copying 2 resources to META-INF
[INFO] Copying 10 resources
[INFO] 
[INFO] --- maven-compiler-plugin:3.3:compile (default-compile) @ joda-time ---
[INFO] Changes detected - recompiling the module!
[INFO] Compiling 166 source files to /home/perham/Study/LittleDarwin/Cases/joda-time-2.8.1/target/classes
[INFO] 
[INFO] --- exec-maven-plugin:1.4.0:java (compile-tzdb) @ joda-time ---
Writing zoneinfo files
Writing ZoneInfoMap
[INFO] 
[INFO] --- maven-resources-plugin:2.7:testResources (default-testResources) @ joda-time ---
[INFO] Using 'UTF-8' encoding to copy filtered resources.
[INFO] Copying 34 resources
[INFO] 
[INFO] --- maven-compiler-plugin:3.3:testCompile (default-testCompile) @ joda-time ---
[INFO] Nothing to compile - all classes are up to date
[INFO] 
[INFO] --- maven-surefire-plugin:2.18.1:test (default-test) @ joda-time ---
[INFO] Surefire report directory: /home/perham/Study/LittleDarwin/Cases/joda-time-2.8.1/target/surefire-reports

-------------------------------------------------------
 T E S T S
-------------------------------------------------------
Running org.joda.time.TestAllPackages

TestBuddhistChronology.testCalendar

TestCopticChronology.testCalendar

TestEthiopicChronology.testCalendar

TestIslamicChronology.testCalendar

Testing Gregorian chronology over 1000 iterations
100% complete (i=1000)

Testing Julian chronology over 1000 iterations
100% complete (i=1000)
Writing zoneinfo files
Writing ZoneInfoMap
Tests run: 4157, Failures: 0, Errors: 10, Skipped: 0, Time elapsed: 5.169 sec <<< FAILURE! - in org.joda.time.TestAllPackages
testConstructor_Object4(org.joda.time.TestDuration_Constructors)  Time elapsed: 0.005 sec  <<< ERROR!
java.lang.ArrayIndexOutOfBoundsException: -1
	at org.joda.time.convert.ConverterSet.select(ConverterSet.java:17)
	at org.joda.time.convert.ConverterManager.getDurationConverter(ConverterManager.java:334)
	at org.joda.time.base.BaseDuration.<init>(BaseDuration.java:104)
	at org.joda.time.Duration.<init>(Duration.java:210)
	at org.joda.time.TestDuration_Constructors.testConstructor_Object4(TestDuration_Constructors.java:247)

testConstructor_ObjectLocalTime(org.joda.time.TestLocalDateTime_Constructors)  Time elapsed: 0.001 sec  <<< ERROR!
java.lang.ArrayIndexOutOfBoundsException: -1
	at org.joda.time.convert.ConverterSet.select(ConverterSet.java:17)
	at org.joda.time.convert.ConverterManager.getPartialConverter(ConverterManager.java:247)
	at org.joda.time.LocalDateTime.<init>(LocalDateTime.java:410)
	at org.joda.time.LocalDateTime.<init>(LocalDateTime.java:358)
	at org.joda.time.TestLocalDateTime_Constructors.testConstructor_ObjectLocalTime(TestLocalDateTime_Constructors.java:493)

testConstructor_ObjectLocalTime(org.joda.time.TestLocalDate_Constructors)  Time elapsed: 0 sec  <<< ERROR!
java.lang.ArrayIndexOutOfBoundsException: -1
	at org.joda.time.convert.ConverterSet.select(ConverterSet.java:17)
	at org.joda.time.convert.ConverterManager.getPartialConverter(ConverterManager.java:247)
	at org.joda.time.LocalDate.<init>(LocalDate.java:415)
	at org.joda.time.LocalDate.<init>(LocalDate.java:363)
	at org.joda.time.TestLocalDate_Constructors.testConstructor_ObjectLocalTime(TestLocalDate_Constructors.java:417)

testConstructor_ObjectLocalTime(org.joda.time.TestLocalTime_Constructors)  Time elapsed: 0.001 sec  <<< ERROR!
java.lang.ArrayIndexOutOfBoundsException: -1
	at org.joda.time.convert.ConverterSet.select(ConverterSet.java:17)
	at org.joda.time.convert.ConverterManager.getPartialConverter(ConverterManager.java:247)
	at org.joda.time.LocalTime.<init>(LocalTime.java:431)
	at org.joda.time.LocalTime.<init>(LocalTime.java:383)
	at org.joda.time.TestLocalTime_Constructors.testConstructor_ObjectLocalTime(TestLocalTime_Constructors.java:462)

testConstructor_Object2(org.joda.time.TestPeriod_Constructors)  Time elapsed: 0 sec  <<< ERROR!
java.lang.ArrayIndexOutOfBoundsException: -1
	at org.joda.time.convert.ConverterSet.select(ConverterSet.java:17)
	at org.joda.time.convert.ConverterManager.getPeriodConverter(ConverterManager.java:421)
	at org.joda.time.base.BasePeriod.<init>(BasePeriod.java:272)
	at org.joda.time.Period.<init>(Period.java:674)
	at org.joda.time.TestPeriod_Constructors.testConstructor_Object2(TestPeriod_Constructors.java:1158)

testConstructor_Object_PeriodType2(org.joda.time.TestPeriod_Constructors)  Time elapsed: 0 sec  <<< ERROR!
java.lang.ArrayIndexOutOfBoundsException: -1
	at org.joda.time.convert.ConverterSet.select(ConverterSet.java:17)
	at org.joda.time.convert.ConverterManager.getPeriodConverter(ConverterManager.java:421)
	at org.joda.time.base.BasePeriod.<init>(BasePeriod.java:272)
	at org.joda.time.Period.<init>(Period.java:691)
	at org.joda.time.TestPeriod_Constructors.testConstructor_Object_PeriodType2(TestPeriod_Constructors.java:1215)

testConstructor_Object2(org.joda.time.TestMutablePeriod_Constructors)  Time elapsed: 0.001 sec  <<< ERROR!
java.lang.ArrayIndexOutOfBoundsException: -1
	at org.joda.time.convert.ConverterSet.select(ConverterSet.java:17)
	at org.joda.time.convert.ConverterManager.getPeriodConverter(ConverterManager.java:421)
	at org.joda.time.base.BasePeriod.<init>(BasePeriod.java:272)
	at org.joda.time.MutablePeriod.<init>(MutablePeriod.java:374)
	at org.joda.time.TestMutablePeriod_Constructors.testConstructor_Object2(TestMutablePeriod_Constructors.java:840)

testConstructor_Object_PeriodType2(org.joda.time.TestMutablePeriod_Constructors)  Time elapsed: 0 sec  <<< ERROR!
java.lang.ArrayIndexOutOfBoundsException: -1
	at org.joda.time.convert.ConverterSet.select(ConverterSet.java:17)
	at org.joda.time.convert.ConverterManager.getPeriodConverter(ConverterManager.java:421)
	at org.joda.time.base.BasePeriod.<init>(BasePeriod.java:272)
	at org.joda.time.MutablePeriod.<init>(MutablePeriod.java:391)
	at org.joda.time.TestMutablePeriod_Constructors.testConstructor_Object_PeriodType2(TestMutablePeriod_Constructors.java:897)

testGetDurationConverter(org.joda.time.convert.TestConverterManager)  Time elapsed: 0 sec  <<< ERROR!
java.lang.ArrayIndexOutOfBoundsException: -1
	at org.joda.time.convert.ConverterSet.select(ConverterSet.java:17)
	at org.joda.time.convert.ConverterManager.getDurationConverter(ConverterManager.java:334)
	at org.joda.time.convert.TestConverterManager.testGetDurationConverter(TestConverterManager.java:547)

testGetPeriodConverter(org.joda.time.convert.TestConverterManager)  Time elapsed: 0 sec  <<< ERROR!
java.lang.ArrayIndexOutOfBoundsException: -1
	at org.joda.time.convert.ConverterSet.select(ConverterSet.java:17)
	at org.joda.time.convert.ConverterManager.getPeriodConverter(ConverterManager.java:421)
	at org.joda.time.convert.TestConverterManager.testGetPeriodConverter(TestConverterManager.java:704)


Results :

Tests in error: 
  org.joda.time.TestDuration_Constructors#testConstructor_Object4 ArrayIndexOutOfBoundsException
  org.joda.time.TestLocalDateTime_Constructors#testConstructor_ObjectLocalTime ArrayIndexOutOfBoundsException
  org.joda.time.TestLocalDate_Constructors#testConstructor_ObjectLocalTime ArrayIndexOutOfBoundsException
  org.joda.time.TestLocalTime_Constructors#testConstructor_ObjectLocalTime ArrayIndexOutOfBoundsException
  org.joda.time.TestMutablePeriod_Constructors#testConstructor_Object2 ArrayIndexOutOfBoundsException
  org.joda.time.TestMutablePeriod_Constructors#testConstructor_Object_PeriodType2 ArrayIndexOutOfBoundsException
  org.joda.time.TestPeriod_Constructors#testConstructor_Object2 ArrayIndexOutOfBoundsException
  org.joda.time.TestPeriod_Constructors#testConstructor_Object_PeriodType2 ArrayIndexOutOfBoundsException
  org.joda.time.convert.TestConverterManager#testGetDurationConverter ArrayIndexOutOfBoundsException
  org.joda.time.convert.TestConverterManager#testGetPeriodConverter ArrayIndexOutOfBoundsException

Tests run: 4157, Failures: 0, Errors: 10, Skipped: 0

[INFO] ------------------------------------------------------------------------
[INFO] BUILD FAILURE
[INFO] ------------------------------------------------------------------------
[INFO] Total time: 15.451s
[INFO] Finished at: Thu Aug 06 03:01:14 BST 2015
[INFO] Final Memory: 9M/213M
[INFO] ------------------------------------------------------------------------
[ERROR] Failed to execute goal org.apache.maven.plugins:maven-surefire-plugin:2.18.1:test (default-test) on project joda-time: There are test failures.
[ERROR] 
[ERROR] Please refer to /home/perham/Study/LittleDarwin/Cases/joda-time-2.8.1/target/surefire-reports for the individual test results.
[ERROR] -> [Help 1]
[ERROR] 
[ERROR] To see the full stack trace of the errors, re-run Maven with the -e switch.
[ERROR] Re-run Maven using the -X switch to enable full debug logging.
[ERROR] 
[ERROR] For more information about the errors and possible solutions, please read the following articles:
[ERROR] [Help 1] http://cwiki.apache.org/confluence/display/MAVEN/MojoFailureException
