[INFO] Scanning for projects...
[INFO]                                                                         
[INFO] ------------------------------------------------------------------------
[INFO] Building Joda-Time 2.8.1
[INFO] ------------------------------------------------------------------------
[INFO] 
[INFO] --- maven-resources-plugin:2.7:resources (default-resources) @ joda-time ---
[INFO] Using 'UTF-8' encoding to copy filtered resources.
[INFO] Copying 2 resources to META-INF
[INFO] Copying 10 resources
[INFO] 
[INFO] --- maven-compiler-plugin:3.3:compile (default-compile) @ joda-time ---
[INFO] Changes detected - recompiling the module!
[INFO] Compiling 166 source files to /home/perham/Study/LittleDarwin/Cases/joda-time-2.8.1/target/classes
[INFO] 
[INFO] --- exec-maven-plugin:1.4.0:java (compile-tzdb) @ joda-time ---
Writing zoneinfo files
Writing ZoneInfoMap
[INFO] 
[INFO] --- maven-resources-plugin:2.7:testResources (default-testResources) @ joda-time ---
[INFO] Using 'UTF-8' encoding to copy filtered resources.
[INFO] Copying 34 resources
[INFO] 
[INFO] --- maven-compiler-plugin:3.3:testCompile (default-testCompile) @ joda-time ---
[INFO] Nothing to compile - all classes are up to date
[INFO] 
[INFO] --- maven-surefire-plugin:2.18.1:test (default-test) @ joda-time ---
[INFO] Surefire report directory: /home/perham/Study/LittleDarwin/Cases/joda-time-2.8.1/target/surefire-reports

-------------------------------------------------------
 T E S T S
-------------------------------------------------------
Running org.joda.time.TestAllPackages

TestBuddhistChronology.testCalendar

TestCopticChronology.testCalendar

TestEthiopicChronology.testCalendar

TestIslamicChronology.testCalendar

Testing Gregorian chronology over 1000 iterations
100% complete (i=1000)

Testing Julian chronology over 1000 iterations
100% complete (i=1000)
Writing zoneinfo files
Writing ZoneInfoMap
Tests run: 4157, Failures: 20, Errors: 36, Skipped: 0, Time elapsed: 5.318 sec <<< FAILURE! - in org.joda.time.TestAllPackages
testConstructor_badconverterObject(org.joda.time.TestInstant_Constructors)  Time elapsed: 0.006 sec  <<< ERROR!
java.lang.ArrayIndexOutOfBoundsException: -1
	at org.joda.time.convert.ConverterSet.remove(ConverterSet.java:63)
	at org.joda.time.convert.ConverterManager.removeInstantConverter(ConverterManager.java:220)
	at org.joda.time.TestInstant_Constructors.testConstructor_badconverterObject(TestInstant_Constructors.java:178)

testConstructor_badconverterObject(org.joda.time.TestDateTime_Constructors)  Time elapsed: 0.001 sec  <<< ERROR!
java.lang.ArrayIndexOutOfBoundsException: -1
	at org.joda.time.convert.ConverterSet.remove(ConverterSet.java:63)
	at org.joda.time.convert.ConverterManager.removeInstantConverter(ConverterManager.java:220)
	at org.joda.time.TestDateTime_Constructors.testConstructor_badconverterObject(TestDateTime_Constructors.java:370)

testConstructor_badconverterObject_DateTimeZone(org.joda.time.TestDateTime_Constructors)  Time elapsed: 0.001 sec  <<< ERROR!
java.lang.ArrayIndexOutOfBoundsException: -1
	at org.joda.time.convert.ConverterSet.remove(ConverterSet.java:63)
	at org.joda.time.convert.ConverterManager.removeInstantConverter(ConverterManager.java:220)
	at org.joda.time.TestDateTime_Constructors.testConstructor_badconverterObject_DateTimeZone(TestDateTime_Constructors.java:535)

testConstructor_badconverterObject_Chronology(org.joda.time.TestDateTime_Constructors)  Time elapsed: 0 sec  <<< ERROR!
java.lang.ArrayIndexOutOfBoundsException: -1
	at org.joda.time.convert.ConverterSet.remove(ConverterSet.java:63)
	at org.joda.time.convert.ConverterManager.removeInstantConverter(ConverterManager.java:220)
	at org.joda.time.TestDateTime_Constructors.testConstructor_badconverterObject_Chronology(TestDateTime_Constructors.java:597)

testConstructor_badconverterObject(org.joda.time.TestMutableDateTime_Constructors)  Time elapsed: 0 sec  <<< ERROR!
java.lang.ArrayIndexOutOfBoundsException: -1
	at org.joda.time.convert.ConverterSet.remove(ConverterSet.java:63)
	at org.joda.time.convert.ConverterManager.removeInstantConverter(ConverterManager.java:220)
	at org.joda.time.TestMutableDateTime_Constructors.testConstructor_badconverterObject(TestMutableDateTime_Constructors.java:325)

testConstructor_badconverterObject_DateTimeZone(org.joda.time.TestMutableDateTime_Constructors)  Time elapsed: 0.001 sec  <<< ERROR!
java.lang.ArrayIndexOutOfBoundsException: -1
	at org.joda.time.convert.ConverterSet.remove(ConverterSet.java:63)
	at org.joda.time.convert.ConverterManager.removeInstantConverter(ConverterManager.java:220)
	at org.joda.time.TestMutableDateTime_Constructors.testConstructor_badconverterObject_DateTimeZone(TestMutableDateTime_Constructors.java:387)

testConstructor_badconverterObject_Chronology(org.joda.time.TestMutableDateTime_Constructors)  Time elapsed: 0 sec  <<< ERROR!
java.lang.ArrayIndexOutOfBoundsException: -1
	at org.joda.time.convert.ConverterSet.remove(ConverterSet.java:63)
	at org.joda.time.convert.ConverterManager.removeInstantConverter(ConverterManager.java:220)
	at org.joda.time.TestMutableDateTime_Constructors.testConstructor_badconverterObject_Chronology(TestMutableDateTime_Constructors.java:449)

testConstructor_badconverterObject(org.joda.time.TestDateMidnight_Constructors)  Time elapsed: 0.001 sec  <<< ERROR!
java.lang.ArrayIndexOutOfBoundsException: -1
	at org.joda.time.convert.ConverterSet.remove(ConverterSet.java:63)
	at org.joda.time.convert.ConverterManager.removeInstantConverter(ConverterManager.java:220)
	at org.joda.time.TestDateMidnight_Constructors.testConstructor_badconverterObject(TestDateMidnight_Constructors.java:344)

testConstructor_badconverterObject_DateTimeZone(org.joda.time.TestDateMidnight_Constructors)  Time elapsed: 0.001 sec  <<< ERROR!
java.lang.ArrayIndexOutOfBoundsException: -1
	at org.joda.time.convert.ConverterSet.remove(ConverterSet.java:63)
	at org.joda.time.convert.ConverterManager.removeInstantConverter(ConverterManager.java:220)
	at org.joda.time.TestDateMidnight_Constructors.testConstructor_badconverterObject_DateTimeZone(TestDateMidnight_Constructors.java:406)

testConstructor_badconverterObject_Chronology(org.joda.time.TestDateMidnight_Constructors)  Time elapsed: 0.001 sec  <<< ERROR!
java.lang.ArrayIndexOutOfBoundsException: -1
	at org.joda.time.convert.ConverterSet.remove(ConverterSet.java:63)
	at org.joda.time.convert.ConverterManager.removeInstantConverter(ConverterManager.java:220)
	at org.joda.time.TestDateMidnight_Constructors.testConstructor_badconverterObject_Chronology(TestDateMidnight_Constructors.java:468)

testToString(org.joda.time.convert.TestConverterManager)  Time elapsed: 0.002 sec  <<< FAILURE!
junit.framework.ComparisonFailure: expected:<ConverterManager[[6] instant,7 partial,5...> but was:<ConverterManager[[7] instant,7 partial,5...>
	at junit.framework.Assert.assertEquals(Assert.java:81)
	at junit.framework.Assert.assertEquals(Assert.java:87)
	at org.joda.time.convert.TestConverterManager.testToString(TestConverterManager.java:989)

testGetDurationConverterRemovedNull(org.joda.time.convert.TestConverterManager)  Time elapsed: 0.001 sec  <<< ERROR!
java.lang.ArrayIndexOutOfBoundsException: -1
	at org.joda.time.convert.ConverterSet.remove(ConverterSet.java:63)
	at org.joda.time.convert.ConverterManager.removeDurationConverter(ConverterManager.java:394)
	at org.joda.time.convert.TestConverterManager.testGetDurationConverterRemovedNull(TestConverterManager.java:567)

testAddDurationConverter1(org.joda.time.convert.TestConverterManager)  Time elapsed: 0.001 sec  <<< ERROR!
java.lang.ArrayIndexOutOfBoundsException: -1
	at org.joda.time.convert.ConverterSet.remove(ConverterSet.java:63)
	at org.joda.time.convert.ConverterManager.removeDurationConverter(ConverterManager.java:394)
	at org.joda.time.convert.TestConverterManager.testAddDurationConverter1(TestConverterManager.java:596)

testAddDurationConverter2(org.joda.time.convert.TestConverterManager)  Time elapsed: 0.001 sec  <<< FAILURE!
junit.framework.AssertionFailedError: expected:<5> but was:<6>
	at junit.framework.Assert.fail(Assert.java:47)
	at junit.framework.Assert.failNotEquals(Assert.java:280)
	at junit.framework.Assert.assertEquals(Assert.java:64)
	at junit.framework.Assert.assertEquals(Assert.java:198)
	at junit.framework.Assert.assertEquals(Assert.java:204)
	at org.joda.time.convert.TestConverterManager.testAddDurationConverter2(TestConverterManager.java:610)

testAddDurationConverter3(org.joda.time.convert.TestConverterManager)  Time elapsed: 0 sec  <<< FAILURE!
junit.framework.AssertionFailedError: expected:<5> but was:<6>
	at junit.framework.Assert.fail(Assert.java:47)
	at junit.framework.Assert.failNotEquals(Assert.java:280)
	at junit.framework.Assert.assertEquals(Assert.java:64)
	at junit.framework.Assert.assertEquals(Assert.java:198)
	at junit.framework.Assert.assertEquals(Assert.java:204)
	at org.joda.time.convert.TestConverterManager.testAddDurationConverter3(TestConverterManager.java:620)

testRemoveDurationConverter1(org.joda.time.convert.TestConverterManager)  Time elapsed: 0.001 sec  <<< ERROR!
java.lang.ArrayIndexOutOfBoundsException: -1
	at org.joda.time.convert.ConverterSet.remove(ConverterSet.java:63)
	at org.joda.time.convert.ConverterManager.removeDurationConverter(ConverterManager.java:394)
	at org.joda.time.convert.TestConverterManager.testRemoveDurationConverter1(TestConverterManager.java:644)

testRemoveDurationConverter2(org.joda.time.convert.TestConverterManager)  Time elapsed: 0.001 sec  <<< ERROR!
java.lang.ArrayIndexOutOfBoundsException: -1
	at org.joda.time.convert.ConverterSet.remove(ConverterSet.java:63)
	at org.joda.time.convert.ConverterManager.removeDurationConverter(ConverterManager.java:394)
	at org.joda.time.convert.TestConverterManager.testRemoveDurationConverter2(TestConverterManager.java:658)

testRemoveDurationConverter3(org.joda.time.convert.TestConverterManager)  Time elapsed: 0 sec  <<< FAILURE!
junit.framework.AssertionFailedError: expected:<5> but was:<6>
	at junit.framework.Assert.fail(Assert.java:47)
	at junit.framework.Assert.failNotEquals(Assert.java:280)
	at junit.framework.Assert.assertEquals(Assert.java:64)
	at junit.framework.Assert.assertEquals(Assert.java:198)
	at junit.framework.Assert.assertEquals(Assert.java:204)
	at org.joda.time.convert.TestConverterManager.testRemoveDurationConverter3(TestConverterManager.java:666)

testGetPeriodConverterRemovedNull(org.joda.time.convert.TestConverterManager)  Time elapsed: 0 sec  <<< ERROR!
java.lang.ArrayIndexOutOfBoundsException: -1
	at org.joda.time.convert.ConverterSet.remove(ConverterSet.java:63)
	at org.joda.time.convert.ConverterManager.removePeriodConverter(ConverterManager.java:481)
	at org.joda.time.convert.TestConverterManager.testGetPeriodConverterRemovedNull(TestConverterManager.java:715)

testAddPeriodConverter1(org.joda.time.convert.TestConverterManager)  Time elapsed: 0 sec  <<< ERROR!
java.lang.ArrayIndexOutOfBoundsException: -1
	at org.joda.time.convert.ConverterSet.remove(ConverterSet.java:63)
	at org.joda.time.convert.ConverterManager.removePeriodConverter(ConverterManager.java:481)
	at org.joda.time.convert.TestConverterManager.testAddPeriodConverter1(TestConverterManager.java:745)

testAddPeriodConverter2(org.joda.time.convert.TestConverterManager)  Time elapsed: 0.001 sec  <<< FAILURE!
junit.framework.AssertionFailedError: expected:<5> but was:<6>
	at junit.framework.Assert.fail(Assert.java:47)
	at junit.framework.Assert.failNotEquals(Assert.java:280)
	at junit.framework.Assert.assertEquals(Assert.java:64)
	at junit.framework.Assert.assertEquals(Assert.java:198)
	at junit.framework.Assert.assertEquals(Assert.java:204)
	at org.joda.time.convert.TestConverterManager.testAddPeriodConverter2(TestConverterManager.java:760)

testAddPeriodConverter3(org.joda.time.convert.TestConverterManager)  Time elapsed: 0.001 sec  <<< FAILURE!
junit.framework.AssertionFailedError: expected:<5> but was:<6>
	at junit.framework.Assert.fail(Assert.java:47)
	at junit.framework.Assert.failNotEquals(Assert.java:280)
	at junit.framework.Assert.assertEquals(Assert.java:64)
	at junit.framework.Assert.assertEquals(Assert.java:198)
	at junit.framework.Assert.assertEquals(Assert.java:204)
	at org.joda.time.convert.TestConverterManager.testAddPeriodConverter3(TestConverterManager.java:770)

testRemovePeriodConverter1(org.joda.time.convert.TestConverterManager)  Time elapsed: 0 sec  <<< ERROR!
java.lang.ArrayIndexOutOfBoundsException: -1
	at org.joda.time.convert.ConverterSet.remove(ConverterSet.java:63)
	at org.joda.time.convert.ConverterManager.removePeriodConverter(ConverterManager.java:481)
	at org.joda.time.convert.TestConverterManager.testRemovePeriodConverter1(TestConverterManager.java:794)

testRemovePeriodConverter2(org.joda.time.convert.TestConverterManager)  Time elapsed: 0.001 sec  <<< ERROR!
java.lang.ArrayIndexOutOfBoundsException: -1
	at org.joda.time.convert.ConverterSet.remove(ConverterSet.java:63)
	at org.joda.time.convert.ConverterManager.removePeriodConverter(ConverterManager.java:481)
	at org.joda.time.convert.TestConverterManager.testRemovePeriodConverter2(TestConverterManager.java:809)

testRemovePeriodConverter3(org.joda.time.convert.TestConverterManager)  Time elapsed: 0.001 sec  <<< FAILURE!
junit.framework.AssertionFailedError: expected:<5> but was:<6>
	at junit.framework.Assert.fail(Assert.java:47)
	at junit.framework.Assert.failNotEquals(Assert.java:280)
	at junit.framework.Assert.assertEquals(Assert.java:64)
	at junit.framework.Assert.assertEquals(Assert.java:198)
	at junit.framework.Assert.assertEquals(Assert.java:204)
	at org.joda.time.convert.TestConverterManager.testRemovePeriodConverter3(TestConverterManager.java:817)

testGetIntervalConverterRemovedNull(org.joda.time.convert.TestConverterManager)  Time elapsed: 0 sec  <<< ERROR!
java.lang.ArrayIndexOutOfBoundsException: -1
	at org.joda.time.convert.ConverterSet.remove(ConverterSet.java:63)
	at org.joda.time.convert.ConverterManager.removeIntervalConverter(ConverterManager.java:568)
	at org.joda.time.convert.TestConverterManager.testGetIntervalConverterRemovedNull(TestConverterManager.java:864)

testAddIntervalConverter1(org.joda.time.convert.TestConverterManager)  Time elapsed: 0 sec  <<< ERROR!
java.lang.ArrayIndexOutOfBoundsException: -1
	at org.joda.time.convert.ConverterSet.remove(ConverterSet.java:63)
	at org.joda.time.convert.ConverterManager.removeIntervalConverter(ConverterManager.java:568)
	at org.joda.time.convert.TestConverterManager.testAddIntervalConverter1(TestConverterManager.java:894)

testAddIntervalConverter2(org.joda.time.convert.TestConverterManager)  Time elapsed: 0 sec  <<< FAILURE!
junit.framework.AssertionFailedError: expected:<3> but was:<4>
	at junit.framework.Assert.fail(Assert.java:47)
	at junit.framework.Assert.failNotEquals(Assert.java:280)
	at junit.framework.Assert.assertEquals(Assert.java:64)
	at junit.framework.Assert.assertEquals(Assert.java:198)
	at junit.framework.Assert.assertEquals(Assert.java:204)
	at org.joda.time.convert.TestConverterManager.testAddIntervalConverter2(TestConverterManager.java:909)

testAddIntervalConverter3(org.joda.time.convert.TestConverterManager)  Time elapsed: 0.001 sec  <<< FAILURE!
junit.framework.AssertionFailedError: expected:<3> but was:<4>
	at junit.framework.Assert.fail(Assert.java:47)
	at junit.framework.Assert.failNotEquals(Assert.java:280)
	at junit.framework.Assert.assertEquals(Assert.java:64)
	at junit.framework.Assert.assertEquals(Assert.java:198)
	at junit.framework.Assert.assertEquals(Assert.java:204)
	at org.joda.time.convert.TestConverterManager.testAddIntervalConverter3(TestConverterManager.java:919)

testRemoveIntervalConverter1(org.joda.time.convert.TestConverterManager)  Time elapsed: 0 sec  <<< ERROR!
java.lang.ArrayIndexOutOfBoundsException: -1
	at org.joda.time.convert.ConverterSet.remove(ConverterSet.java:63)
	at org.joda.time.convert.ConverterManager.removeIntervalConverter(ConverterManager.java:568)
	at org.joda.time.convert.TestConverterManager.testRemoveIntervalConverter1(TestConverterManager.java:943)

testRemoveIntervalConverter2(org.joda.time.convert.TestConverterManager)  Time elapsed: 0.001 sec  <<< ERROR!
java.lang.ArrayIndexOutOfBoundsException: -1
	at org.joda.time.convert.ConverterSet.remove(ConverterSet.java:63)
	at org.joda.time.convert.ConverterManager.removeIntervalConverter(ConverterManager.java:568)
	at org.joda.time.convert.TestConverterManager.testRemoveIntervalConverter2(TestConverterManager.java:958)

testRemoveIntervalConverter3(org.joda.time.convert.TestConverterManager)  Time elapsed: 0.001 sec  <<< FAILURE!
junit.framework.AssertionFailedError: expected:<3> but was:<4>
	at junit.framework.Assert.fail(Assert.java:47)
	at junit.framework.Assert.failNotEquals(Assert.java:280)
	at junit.framework.Assert.assertEquals(Assert.java:64)
	at junit.framework.Assert.assertEquals(Assert.java:198)
	at junit.framework.Assert.assertEquals(Assert.java:204)
	at org.joda.time.convert.TestConverterManager.testRemoveIntervalConverter3(TestConverterManager.java:966)

testRemoveInstantConverter2(org.joda.time.convert.TestConverterManager)  Time elapsed: 0.001 sec  <<< ERROR!
java.lang.ArrayIndexOutOfBoundsException: -1
	at org.joda.time.convert.ConverterSet.remove(ConverterSet.java:63)
	at org.joda.time.convert.ConverterManager.removeInstantConverter(ConverterManager.java:220)
	at org.joda.time.convert.TestConverterManager.testRemoveInstantConverter2(TestConverterManager.java:300)

testRemoveInstantConverter3(org.joda.time.convert.TestConverterManager)  Time elapsed: 0.001 sec  <<< FAILURE!
junit.framework.AssertionFailedError: expected:<6> but was:<7>
	at junit.framework.Assert.fail(Assert.java:47)
	at junit.framework.Assert.failNotEquals(Assert.java:280)
	at junit.framework.Assert.assertEquals(Assert.java:64)
	at junit.framework.Assert.assertEquals(Assert.java:198)
	at junit.framework.Assert.assertEquals(Assert.java:204)
	at org.joda.time.convert.TestConverterManager.testRemoveInstantConverter3(TestConverterManager.java:308)

testGetPartialConverterRemovedNull(org.joda.time.convert.TestConverterManager)  Time elapsed: 0 sec  <<< ERROR!
java.lang.ArrayIndexOutOfBoundsException: -1
	at org.joda.time.convert.ConverterSet.remove(ConverterSet.java:63)
	at org.joda.time.convert.ConverterManager.removePartialConverter(ConverterManager.java:307)
	at org.joda.time.convert.TestConverterManager.testGetPartialConverterRemovedNull(TestConverterManager.java:363)

testGetPartialConverterOKMultipleMatches(org.joda.time.convert.TestConverterManager)  Time elapsed: 0 sec  <<< ERROR!
java.lang.ArrayIndexOutOfBoundsException: -1
	at org.joda.time.convert.ConverterSet.remove(ConverterSet.java:63)
	at org.joda.time.convert.ConverterManager.removePartialConverter(ConverterManager.java:307)
	at org.joda.time.convert.TestConverterManager.testGetPartialConverterOKMultipleMatches(TestConverterManager.java:388)

testGetPartialConverterBadMultipleMatches(org.joda.time.convert.TestConverterManager)  Time elapsed: 0.001 sec  <<< ERROR!
java.lang.ArrayIndexOutOfBoundsException: -1
	at org.joda.time.convert.ConverterSet.remove(ConverterSet.java:63)
	at org.joda.time.convert.ConverterManager.removePartialConverter(ConverterManager.java:307)
	at org.joda.time.convert.TestConverterManager.testGetPartialConverterBadMultipleMatches(TestConverterManager.java:410)

testGetPartialConverters(org.joda.time.convert.TestConverterManager)  Time elapsed: 0.001 sec  <<< FAILURE!
junit.framework.AssertionFailedError: expected:<7> but was:<9>
	at junit.framework.Assert.fail(Assert.java:47)
	at junit.framework.Assert.failNotEquals(Assert.java:280)
	at junit.framework.Assert.assertEquals(Assert.java:64)
	at junit.framework.Assert.assertEquals(Assert.java:198)
	at junit.framework.Assert.assertEquals(Assert.java:204)
	at org.joda.time.convert.TestConverterManager.testGetPartialConverters(TestConverterManager.java:418)

testAddPartialConverter1(org.joda.time.convert.TestConverterManager)  Time elapsed: 0.001 sec  <<< ERROR!
java.lang.ArrayIndexOutOfBoundsException: -1
	at org.joda.time.convert.ConverterSet.remove(ConverterSet.java:63)
	at org.joda.time.convert.ConverterManager.removePartialConverter(ConverterManager.java:307)
	at org.joda.time.convert.TestConverterManager.testAddPartialConverter1(TestConverterManager.java:436)

testAddPartialConverter2(org.joda.time.convert.TestConverterManager)  Time elapsed: 0.001 sec  <<< FAILURE!
junit.framework.AssertionFailedError: expected:<7> but was:<10>
	at junit.framework.Assert.fail(Assert.java:47)
	at junit.framework.Assert.failNotEquals(Assert.java:280)
	at junit.framework.Assert.assertEquals(Assert.java:64)
	at junit.framework.Assert.assertEquals(Assert.java:198)
	at junit.framework.Assert.assertEquals(Assert.java:204)
	at org.joda.time.convert.TestConverterManager.testAddPartialConverter2(TestConverterManager.java:453)

testAddPartialConverter3(org.joda.time.convert.TestConverterManager)  Time elapsed: 0 sec  <<< FAILURE!
junit.framework.AssertionFailedError: expected:<7> but was:<10>
	at junit.framework.Assert.fail(Assert.java:47)
	at junit.framework.Assert.failNotEquals(Assert.java:280)
	at junit.framework.Assert.assertEquals(Assert.java:64)
	at junit.framework.Assert.assertEquals(Assert.java:198)
	at junit.framework.Assert.assertEquals(Assert.java:204)
	at org.joda.time.convert.TestConverterManager.testAddPartialConverter3(TestConverterManager.java:463)

testAddPartialConverter4(org.joda.time.convert.TestConverterManager)  Time elapsed: 0.001 sec  <<< FAILURE!
junit.framework.AssertionFailedError: expected:<7> but was:<10>
	at junit.framework.Assert.fail(Assert.java:47)
	at junit.framework.Assert.failNotEquals(Assert.java:280)
	at junit.framework.Assert.assertEquals(Assert.java:64)
	at junit.framework.Assert.assertEquals(Assert.java:198)
	at junit.framework.Assert.assertEquals(Assert.java:204)
	at org.joda.time.convert.TestConverterManager.testAddPartialConverter4(TestConverterManager.java:469)

testRemovePartialConverter1(org.joda.time.convert.TestConverterManager)  Time elapsed: 0 sec  <<< ERROR!
java.lang.ArrayIndexOutOfBoundsException: -1
	at org.joda.time.convert.ConverterSet.remove(ConverterSet.java:63)
	at org.joda.time.convert.ConverterManager.removePartialConverter(ConverterManager.java:307)
	at org.joda.time.convert.TestConverterManager.testRemovePartialConverter1(TestConverterManager.java:493)

testRemovePartialConverter2(org.joda.time.convert.TestConverterManager)  Time elapsed: 0.001 sec  <<< ERROR!
java.lang.ArrayIndexOutOfBoundsException: -1
	at org.joda.time.convert.ConverterSet.remove(ConverterSet.java:63)
	at org.joda.time.convert.ConverterManager.removePartialConverter(ConverterManager.java:307)
	at org.joda.time.convert.TestConverterManager.testRemovePartialConverter2(TestConverterManager.java:510)

testRemovePartialConverter3(org.joda.time.convert.TestConverterManager)  Time elapsed: 0 sec  <<< FAILURE!
junit.framework.AssertionFailedError: expected:<7> but was:<10>
	at junit.framework.Assert.fail(Assert.java:47)
	at junit.framework.Assert.failNotEquals(Assert.java:280)
	at junit.framework.Assert.assertEquals(Assert.java:64)
	at junit.framework.Assert.assertEquals(Assert.java:198)
	at junit.framework.Assert.assertEquals(Assert.java:204)
	at org.joda.time.convert.TestConverterManager.testRemovePartialConverter3(TestConverterManager.java:518)

testGetInstantConverters(org.joda.time.convert.TestConverterManager)  Time elapsed: 0.001 sec  <<< FAILURE!
junit.framework.AssertionFailedError: expected:<6> but was:<7>
	at junit.framework.Assert.fail(Assert.java:47)
	at junit.framework.Assert.failNotEquals(Assert.java:280)
	at junit.framework.Assert.assertEquals(Assert.java:64)
	at junit.framework.Assert.assertEquals(Assert.java:198)
	at junit.framework.Assert.assertEquals(Assert.java:204)
	at org.joda.time.convert.TestConverterManager.testGetInstantConverters(TestConverterManager.java:211)

testAddInstantConverter1(org.joda.time.convert.TestConverterManager)  Time elapsed: 0.001 sec  <<< ERROR!
java.lang.ArrayIndexOutOfBoundsException: -1
	at org.joda.time.convert.ConverterSet.remove(ConverterSet.java:63)
	at org.joda.time.convert.ConverterManager.removeInstantConverter(ConverterManager.java:220)
	at org.joda.time.convert.TestConverterManager.testAddInstantConverter1(TestConverterManager.java:228)

testAddInstantConverter2(org.joda.time.convert.TestConverterManager)  Time elapsed: 0.001 sec  <<< FAILURE!
junit.framework.AssertionFailedError: expected:<6> but was:<8>
	at junit.framework.Assert.fail(Assert.java:47)
	at junit.framework.Assert.failNotEquals(Assert.java:280)
	at junit.framework.Assert.assertEquals(Assert.java:64)
	at junit.framework.Assert.assertEquals(Assert.java:198)
	at junit.framework.Assert.assertEquals(Assert.java:204)
	at org.joda.time.convert.TestConverterManager.testAddInstantConverter2(TestConverterManager.java:244)

testAddInstantConverter3(org.joda.time.convert.TestConverterManager)  Time elapsed: 0 sec  <<< FAILURE!
junit.framework.AssertionFailedError: expected:<6> but was:<8>
	at junit.framework.Assert.fail(Assert.java:47)
	at junit.framework.Assert.failNotEquals(Assert.java:280)
	at junit.framework.Assert.assertEquals(Assert.java:64)
	at junit.framework.Assert.assertEquals(Assert.java:198)
	at junit.framework.Assert.assertEquals(Assert.java:204)
	at org.joda.time.convert.TestConverterManager.testAddInstantConverter3(TestConverterManager.java:254)

testAddInstantConverter4(org.joda.time.convert.TestConverterManager)  Time elapsed: 0 sec  <<< FAILURE!
junit.framework.AssertionFailedError: expected:<6> but was:<8>
	at junit.framework.Assert.fail(Assert.java:47)
	at junit.framework.Assert.failNotEquals(Assert.java:280)
	at junit.framework.Assert.assertEquals(Assert.java:64)
	at junit.framework.Assert.assertEquals(Assert.java:198)
	at junit.framework.Assert.assertEquals(Assert.java:204)
	at org.joda.time.convert.TestConverterManager.testAddInstantConverter4(TestConverterManager.java:260)

testRemoveInstantConverter1(org.joda.time.convert.TestConverterManager)  Time elapsed: 0 sec  <<< ERROR!
java.lang.ArrayIndexOutOfBoundsException: -1
	at org.joda.time.convert.ConverterSet.remove(ConverterSet.java:63)
	at org.joda.time.convert.ConverterManager.removeInstantConverter(ConverterManager.java:220)
	at org.joda.time.convert.TestConverterManager.testRemoveInstantConverter1(TestConverterManager.java:284)

testGetInstantConverterRemovedNull(org.joda.time.convert.TestConverterManager)  Time elapsed: 0 sec  <<< ERROR!
java.lang.ArrayIndexOutOfBoundsException: -1
	at org.joda.time.convert.ConverterSet.remove(ConverterSet.java:63)
	at org.joda.time.convert.ConverterManager.removeInstantConverter(ConverterManager.java:220)
	at org.joda.time.convert.TestConverterManager.testGetInstantConverterRemovedNull(TestConverterManager.java:158)

testGetInstantConverterOKMultipleMatches(org.joda.time.convert.TestConverterManager)  Time elapsed: 0.001 sec  <<< ERROR!
java.lang.ArrayIndexOutOfBoundsException: -1
	at org.joda.time.convert.ConverterSet.remove(ConverterSet.java:63)
	at org.joda.time.convert.ConverterManager.removeInstantConverter(ConverterManager.java:220)
	at org.joda.time.convert.TestConverterManager.testGetInstantConverterOKMultipleMatches(TestConverterManager.java:182)

testGetInstantConverterBadMultipleMatches(org.joda.time.convert.TestConverterManager)  Time elapsed: 0.001 sec  <<< ERROR!
java.lang.ArrayIndexOutOfBoundsException: -1
	at org.joda.time.convert.ConverterSet.remove(ConverterSet.java:63)
	at org.joda.time.convert.ConverterManager.removeInstantConverter(ConverterManager.java:220)
	at org.joda.time.convert.TestConverterManager.testGetInstantConverterBadMultipleMatches(TestConverterManager.java:203)

testRemoveNullRemoved1(org.joda.time.convert.TestConverterSet)  Time elapsed: 0 sec  <<< ERROR!
java.lang.ArrayIndexOutOfBoundsException: -1
	at org.joda.time.convert.ConverterSet.remove(ConverterSet.java:63)
	at org.joda.time.convert.TestConverterSet.testRemoveNullRemoved1(TestConverterSet.java:150)

testRemoveNullRemoved2(org.joda.time.convert.TestConverterSet)  Time elapsed: 0 sec  <<< ERROR!
java.lang.ArrayIndexOutOfBoundsException: -1
	at org.joda.time.convert.ConverterSet.remove(ConverterSet.java:63)
	at org.joda.time.convert.TestConverterSet.testRemoveNullRemoved2(TestConverterSet.java:160)


Results :

Failed tests: 
  org.joda.time.convert.TestConverterManager#testAddDurationConverter2 AssertionFailedError
  org.joda.time.convert.TestConverterManager#testAddDurationConverter3 AssertionFailedError
  org.joda.time.convert.TestConverterManager#testAddInstantConverter2 AssertionFailedError
  org.joda.time.convert.TestConverterManager#testAddInstantConverter3 AssertionFailedError
  org.joda.time.convert.TestConverterManager#testAddInstantConverter4 AssertionFailedError
  org.joda.time.convert.TestConverterManager#testAddIntervalConverter2 AssertionFailedError
  org.joda.time.convert.TestConverterManager#testAddIntervalConverter3 AssertionFailedError
  org.joda.time.convert.TestConverterManager#testAddPartialConverter2 AssertionFailedError
  org.joda.time.convert.TestConverterManager#testAddPartialConverter3 AssertionFailedError
  org.joda.time.convert.TestConverterManager#testAddPartialConverter4 AssertionFailedError
  org.joda.time.convert.TestConverterManager#testAddPeriodConverter2 AssertionFailedError
  org.joda.time.convert.TestConverterManager#testAddPeriodConverter3 AssertionFailedError
  org.joda.time.convert.TestConverterManager#testGetInstantConverters AssertionFailedError
  org.joda.time.convert.TestConverterManager#testGetPartialConverters AssertionFailedError
  org.joda.time.convert.TestConverterManager#testRemoveDurationConverter3 AssertionFailedError
  org.joda.time.convert.TestConverterManager#testRemoveInstantConverter3 AssertionFailedError
  org.joda.time.convert.TestConverterManager#testRemoveIntervalConverter3 AssertionFailedError
  org.joda.time.convert.TestConverterManager#testRemovePartialConverter3 AssertionFailedError
  org.joda.time.convert.TestConverterManager#testRemovePeriodConverter3 AssertionFailedError
  org.joda.time.convert.TestConverterManager#testToString ComparisonFailure expe...
Tests in error: 
  org.joda.time.TestDateMidnight_Constructors#testConstructor_badconverterObject ArrayIndexOutOfBoundsException
  org.joda.time.TestDateMidnight_Constructors#testConstructor_badconverterObject_Chronology ArrayIndexOutOfBoundsException
  org.joda.time.TestDateMidnight_Constructors#testConstructor_badconverterObject_DateTimeZone ArrayIndexOutOfBoundsException
  org.joda.time.TestDateTime_Constructors#testConstructor_badconverterObject ArrayIndexOutOfBoundsException
  org.joda.time.TestDateTime_Constructors#testConstructor_badconverterObject_Chronology ArrayIndexOutOfBoundsException
  org.joda.time.TestDateTime_Constructors#testConstructor_badconverterObject_DateTimeZone ArrayIndexOutOfBoundsException
  org.joda.time.TestInstant_Constructors#testConstructor_badconverterObject ArrayIndexOutOfBoundsException
  org.joda.time.TestMutableDateTime_Constructors#testConstructor_badconverterObject ArrayIndexOutOfBoundsException
  org.joda.time.TestMutableDateTime_Constructors#testConstructor_badconverterObject_Chronology ArrayIndexOutOfBoundsException
  org.joda.time.TestMutableDateTime_Constructors#testConstructor_badconverterObject_DateTimeZone ArrayIndexOutOfBoundsException
  org.joda.time.convert.TestConverterManager#testAddDurationConverter1 ArrayIndexOutOfBoundsException
  org.joda.time.convert.TestConverterManager#testAddInstantConverter1 ArrayIndexOutOfBoundsException
  org.joda.time.convert.TestConverterManager#testAddIntervalConverter1 ArrayIndexOutOfBoundsException
  org.joda.time.convert.TestConverterManager#testAddPartialConverter1 ArrayIndexOutOfBoundsException
  org.joda.time.convert.TestConverterManager#testAddPeriodConverter1 ArrayIndexOutOfBoundsException
  org.joda.time.convert.TestConverterManager#testGetDurationConverterRemovedNull ArrayIndexOutOfBoundsException
  org.joda.time.convert.TestConverterManager#testGetInstantConverterBadMultipleMatches ArrayIndexOutOfBoundsException
  org.joda.time.convert.TestConverterManager#testGetInstantConverterOKMultipleMatches ArrayIndexOutOfBoundsException
  org.joda.time.convert.TestConverterManager#testGetInstantConverterRemovedNull ArrayIndexOutOfBoundsException
  org.joda.time.convert.TestConverterManager#testGetIntervalConverterRemovedNull ArrayIndexOutOfBoundsException
  org.joda.time.convert.TestConverterManager#testGetPartialConverterBadMultipleMatches ArrayIndexOutOfBoundsException
  org.joda.time.convert.TestConverterManager#testGetPartialConverterOKMultipleMatches ArrayIndexOutOfBoundsException
  org.joda.time.convert.TestConverterManager#testGetPartialConverterRemovedNull ArrayIndexOutOfBoundsException
  org.joda.time.convert.TestConverterManager#testGetPeriodConverterRemovedNull ArrayIndexOutOfBoundsException
  org.joda.time.convert.TestConverterManager#testRemoveDurationConverter1 ArrayIndexOutOfBoundsException
  org.joda.time.convert.TestConverterManager#testRemoveDurationConverter2 ArrayIndexOutOfBoundsException
  org.joda.time.convert.TestConverterManager#testRemoveInstantConverter1 ArrayIndexOutOfBoundsException
  org.joda.time.convert.TestConverterManager#testRemoveInstantConverter2 ArrayIndexOutOfBoundsException
  org.joda.time.convert.TestConverterManager#testRemoveIntervalConverter1 ArrayIndexOutOfBoundsException
  org.joda.time.convert.TestConverterManager#testRemoveIntervalConverter2 ArrayIndexOutOfBoundsException
  org.joda.time.convert.TestConverterManager#testRemovePartialConverter1 ArrayIndexOutOfBoundsException
  org.joda.time.convert.TestConverterManager#testRemovePartialConverter2 ArrayIndexOutOfBoundsException
  org.joda.time.convert.TestConverterManager#testRemovePeriodConverter1 ArrayIndexOutOfBoundsException
  org.joda.time.convert.TestConverterManager#testRemovePeriodConverter2 ArrayIndexOutOfBoundsException
  org.joda.time.convert.TestConverterSet#testRemoveNullRemoved1 ArrayIndexOutOfBoundsException
  org.joda.time.convert.TestConverterSet#testRemoveNullRemoved2 ArrayIndexOutOfBoundsException

Tests run: 4157, Failures: 20, Errors: 36, Skipped: 0

[INFO] ------------------------------------------------------------------------
[INFO] BUILD FAILURE
[INFO] ------------------------------------------------------------------------
[INFO] Total time: 15.591s
[INFO] Finished at: Thu Aug 06 02:59:31 BST 2015
[INFO] Final Memory: 9M/213M
[INFO] ------------------------------------------------------------------------
[ERROR] Failed to execute goal org.apache.maven.plugins:maven-surefire-plugin:2.18.1:test (default-test) on project joda-time: There are test failures.
[ERROR] 
[ERROR] Please refer to /home/perham/Study/LittleDarwin/Cases/joda-time-2.8.1/target/surefire-reports for the individual test results.
[ERROR] -> [Help 1]
[ERROR] 
[ERROR] To see the full stack trace of the errors, re-run Maven with the -e switch.
[ERROR] Re-run Maven using the -X switch to enable full debug logging.
[ERROR] 
[ERROR] For more information about the errors and possible solutions, please read the following articles:
[ERROR] [Help 1] http://cwiki.apache.org/confluence/display/MAVEN/MojoFailureException
