[INFO] Scanning for projects...
[INFO]                                                                         
[INFO] ------------------------------------------------------------------------
[INFO] Building Joda-Time 2.8.1
[INFO] ------------------------------------------------------------------------
[INFO] 
[INFO] --- maven-resources-plugin:2.7:resources (default-resources) @ joda-time ---
[INFO] Using 'UTF-8' encoding to copy filtered resources.
[INFO] Copying 2 resources to META-INF
[INFO] Copying 10 resources
[INFO] 
[INFO] --- maven-compiler-plugin:3.3:compile (default-compile) @ joda-time ---
[INFO] Changes detected - recompiling the module!
[INFO] Compiling 166 source files to /home/perham/Study/LittleDarwin/Cases/joda-time-2.8.1/target/classes
[INFO] 
[INFO] --- exec-maven-plugin:1.4.0:java (compile-tzdb) @ joda-time ---
Writing zoneinfo files
Writing ZoneInfoMap
[INFO] 
[INFO] --- maven-resources-plugin:2.7:testResources (default-testResources) @ joda-time ---
[INFO] Using 'UTF-8' encoding to copy filtered resources.
[INFO] Copying 34 resources
[INFO] 
[INFO] --- maven-compiler-plugin:3.3:testCompile (default-testCompile) @ joda-time ---
[INFO] Nothing to compile - all classes are up to date
[INFO] 
[INFO] --- maven-surefire-plugin:2.18.1:test (default-test) @ joda-time ---
[INFO] Surefire report directory: /home/perham/Study/LittleDarwin/Cases/joda-time-2.8.1/target/surefire-reports

-------------------------------------------------------
 T E S T S
-------------------------------------------------------
Running org.joda.time.TestAllPackages

TestBuddhistChronology.testCalendar

TestCopticChronology.testCalendar

TestEthiopicChronology.testCalendar

TestIslamicChronology.testCalendar

Testing Gregorian chronology over 1000 iterations
100% complete (i=1000)

Testing Julian chronology over 1000 iterations
100% complete (i=1000)
Writing zoneinfo files
Writing ZoneInfoMap
Tests run: 4157, Failures: 1, Errors: 22, Skipped: 0, Time elapsed: 5.356 sec <<< FAILURE! - in org.joda.time.TestAllPackages
testParse_noFormatter(org.joda.time.TestInterval_Constructors)  Time elapsed: 0.005 sec  <<< ERROR!
java.lang.IllegalArgumentException: No interval converter found for type: java.lang.String
	at org.joda.time.convert.ConverterManager.getIntervalConverter(ConverterManager.java:102)
	at org.joda.time.base.BaseInterval.<init>(BaseInterval.java:190)
	at org.joda.time.Interval.<init>(Interval.java:193)
	at org.joda.time.Interval.parse(Interval.java:69)
	at org.joda.time.TestInterval_Constructors.testParse_noFormatter(TestInterval_Constructors.java:108)

testConstructor_Object6(org.joda.time.TestInterval_Constructors)  Time elapsed: 0.001 sec  <<< ERROR!
java.lang.IllegalArgumentException: No interval converter found for type: org.joda.time.Interval
	at org.joda.time.convert.ConverterManager.getIntervalConverter(ConverterManager.java:102)
	at org.joda.time.TestInterval_Constructors.testConstructor_Object6(TestInterval_Constructors.java:594)

testConstructor_Object_Chronology1(org.joda.time.TestInterval_Constructors)  Time elapsed: 0.001 sec  <<< ERROR!
java.lang.IllegalArgumentException: No interval converter found for type: org.joda.time.Interval
	at org.joda.time.convert.ConverterManager.getIntervalConverter(ConverterManager.java:102)
	at org.joda.time.base.BaseInterval.<init>(BaseInterval.java:190)
	at org.joda.time.Interval.<init>(Interval.java:212)
	at org.joda.time.TestInterval_Constructors.testConstructor_Object_Chronology1(TestInterval_Constructors.java:687)

testConstructor_Object_Chronology2(org.joda.time.TestInterval_Constructors)  Time elapsed: 0.001 sec  <<< ERROR!
java.lang.IllegalArgumentException: No interval converter found for type: org.joda.time.Interval
	at org.joda.time.convert.ConverterManager.getIntervalConverter(ConverterManager.java:102)
	at org.joda.time.base.BaseInterval.<init>(BaseInterval.java:190)
	at org.joda.time.Interval.<init>(Interval.java:212)
	at org.joda.time.TestInterval_Constructors.testConstructor_Object_Chronology2(TestInterval_Constructors.java:698)

testConstructor_Object1(org.joda.time.TestInterval_Constructors)  Time elapsed: 0.001 sec  <<< ERROR!
java.lang.IllegalArgumentException: No interval converter found for type: java.lang.String
	at org.joda.time.convert.ConverterManager.getIntervalConverter(ConverterManager.java:102)
	at org.joda.time.base.BaseInterval.<init>(BaseInterval.java:190)
	at org.joda.time.Interval.<init>(Interval.java:193)
	at org.joda.time.TestInterval_Constructors.testConstructor_Object1(TestInterval_Constructors.java:535)

testConstructor_Object2(org.joda.time.TestInterval_Constructors)  Time elapsed: 0 sec  <<< ERROR!
java.lang.IllegalArgumentException: No interval converter found for type: org.joda.time.Interval
	at org.joda.time.convert.ConverterManager.getIntervalConverter(ConverterManager.java:102)
	at org.joda.time.base.BaseInterval.<init>(BaseInterval.java:190)
	at org.joda.time.Interval.<init>(Interval.java:193)
	at org.joda.time.TestInterval_Constructors.testConstructor_Object2(TestInterval_Constructors.java:545)

testConstructor_Object3(org.joda.time.TestInterval_Constructors)  Time elapsed: 0.002 sec  <<< ERROR!
java.lang.IllegalArgumentException: No interval converter found for type: org.joda.time.MutableInterval
	at org.joda.time.convert.ConverterManager.getIntervalConverter(ConverterManager.java:102)
	at org.joda.time.base.BaseInterval.<init>(BaseInterval.java:190)
	at org.joda.time.Interval.<init>(Interval.java:193)
	at org.joda.time.TestInterval_Constructors.testConstructor_Object3(TestInterval_Constructors.java:555)

testConstructor_Object4(org.joda.time.TestInterval_Constructors)  Time elapsed: 0.001 sec  <<< ERROR!
java.lang.IllegalArgumentException: No interval converter found for type: org.joda.time.TestInterval_Constructors$MockInterval
	at org.joda.time.convert.ConverterManager.getIntervalConverter(ConverterManager.java:102)
	at org.joda.time.base.BaseInterval.<init>(BaseInterval.java:190)
	at org.joda.time.Interval.<init>(Interval.java:193)
	at org.joda.time.TestInterval_Constructors.testConstructor_Object4(TestInterval_Constructors.java:562)

testConstructor_Object5(org.joda.time.TestInterval_Constructors)  Time elapsed: 0 sec  <<< ERROR!
java.lang.IllegalArgumentException: No interval converter found for type: java.lang.String
	at org.joda.time.convert.ConverterManager.getIntervalConverter(ConverterManager.java:102)
	at org.joda.time.TestInterval_Constructors.testConstructor_Object5(TestInterval_Constructors.java:568)

testToString_reparse(org.joda.time.TestInterval_Basics)  Time elapsed: 0.001 sec  <<< ERROR!
java.lang.IllegalArgumentException: No interval converter found for type: java.lang.String
	at org.joda.time.convert.ConverterManager.getIntervalConverter(ConverterManager.java:102)
	at org.joda.time.base.BaseInterval.<init>(BaseInterval.java:190)
	at org.joda.time.Interval.<init>(Interval.java:193)
	at org.joda.time.TestInterval_Basics.testToString_reparse(TestInterval_Basics.java:1053)

testParse_noFormatter(org.joda.time.TestMutableInterval_Constructors)  Time elapsed: 0 sec  <<< ERROR!
java.lang.IllegalArgumentException: No interval converter found for type: java.lang.String
	at org.joda.time.convert.ConverterManager.getIntervalConverter(ConverterManager.java:102)
	at org.joda.time.base.BaseInterval.<init>(BaseInterval.java:190)
	at org.joda.time.MutableInterval.<init>(MutableInterval.java:186)
	at org.joda.time.MutableInterval.parse(MutableInterval.java:71)
	at org.joda.time.TestMutableInterval_Constructors.testParse_noFormatter(TestMutableInterval_Constructors.java:114)

testConstructor_Object6(org.joda.time.TestMutableInterval_Constructors)  Time elapsed: 0 sec  <<< ERROR!
java.lang.IllegalArgumentException: No interval converter found for type: org.joda.time.MutableInterval
	at org.joda.time.convert.ConverterManager.getIntervalConverter(ConverterManager.java:102)
	at org.joda.time.TestMutableInterval_Constructors.testConstructor_Object6(TestMutableInterval_Constructors.java:570)

testConstructor_Object_Chronology1(org.joda.time.TestMutableInterval_Constructors)  Time elapsed: 0.001 sec  <<< ERROR!
java.lang.IllegalArgumentException: No interval converter found for type: org.joda.time.Interval
	at org.joda.time.convert.ConverterManager.getIntervalConverter(ConverterManager.java:102)
	at org.joda.time.base.BaseInterval.<init>(BaseInterval.java:190)
	at org.joda.time.MutableInterval.<init>(MutableInterval.java:205)
	at org.joda.time.TestMutableInterval_Constructors.testConstructor_Object_Chronology1(TestMutableInterval_Constructors.java:663)

testConstructor_Object_Chronology2(org.joda.time.TestMutableInterval_Constructors)  Time elapsed: 0 sec  <<< ERROR!
java.lang.IllegalArgumentException: No interval converter found for type: org.joda.time.Interval
	at org.joda.time.convert.ConverterManager.getIntervalConverter(ConverterManager.java:102)
	at org.joda.time.base.BaseInterval.<init>(BaseInterval.java:190)
	at org.joda.time.MutableInterval.<init>(MutableInterval.java:205)
	at org.joda.time.TestMutableInterval_Constructors.testConstructor_Object_Chronology2(TestMutableInterval_Constructors.java:674)

testConstructor_Object1(org.joda.time.TestMutableInterval_Constructors)  Time elapsed: 0.001 sec  <<< ERROR!
java.lang.IllegalArgumentException: No interval converter found for type: java.lang.String
	at org.joda.time.convert.ConverterManager.getIntervalConverter(ConverterManager.java:102)
	at org.joda.time.base.BaseInterval.<init>(BaseInterval.java:190)
	at org.joda.time.MutableInterval.<init>(MutableInterval.java:186)
	at org.joda.time.TestMutableInterval_Constructors.testConstructor_Object1(TestMutableInterval_Constructors.java:511)

testConstructor_Object2(org.joda.time.TestMutableInterval_Constructors)  Time elapsed: 0.001 sec  <<< ERROR!
java.lang.IllegalArgumentException: No interval converter found for type: org.joda.time.MutableInterval
	at org.joda.time.convert.ConverterManager.getIntervalConverter(ConverterManager.java:102)
	at org.joda.time.base.BaseInterval.<init>(BaseInterval.java:190)
	at org.joda.time.MutableInterval.<init>(MutableInterval.java:186)
	at org.joda.time.TestMutableInterval_Constructors.testConstructor_Object2(TestMutableInterval_Constructors.java:521)

testConstructor_Object3(org.joda.time.TestMutableInterval_Constructors)  Time elapsed: 0 sec  <<< ERROR!
java.lang.IllegalArgumentException: No interval converter found for type: org.joda.time.Interval
	at org.joda.time.convert.ConverterManager.getIntervalConverter(ConverterManager.java:102)
	at org.joda.time.base.BaseInterval.<init>(BaseInterval.java:190)
	at org.joda.time.MutableInterval.<init>(MutableInterval.java:186)
	at org.joda.time.TestMutableInterval_Constructors.testConstructor_Object3(TestMutableInterval_Constructors.java:531)

testConstructor_Object4(org.joda.time.TestMutableInterval_Constructors)  Time elapsed: 0.001 sec  <<< ERROR!
java.lang.IllegalArgumentException: No interval converter found for type: org.joda.time.TestMutableInterval_Constructors$MockInterval
	at org.joda.time.convert.ConverterManager.getIntervalConverter(ConverterManager.java:102)
	at org.joda.time.base.BaseInterval.<init>(BaseInterval.java:190)
	at org.joda.time.MutableInterval.<init>(MutableInterval.java:186)
	at org.joda.time.TestMutableInterval_Constructors.testConstructor_Object4(TestMutableInterval_Constructors.java:538)

testConstructor_Object5(org.joda.time.TestMutableInterval_Constructors)  Time elapsed: 0.001 sec  <<< ERROR!
java.lang.IllegalArgumentException: No interval converter found for type: java.lang.String
	at org.joda.time.convert.ConverterManager.getIntervalConverter(ConverterManager.java:102)
	at org.joda.time.TestMutableInterval_Constructors.testConstructor_Object5(TestMutableInterval_Constructors.java:544)

testGetIntervalConverter(org.joda.time.convert.TestConverterManager)  Time elapsed: 0.001 sec  <<< ERROR!
java.lang.IllegalArgumentException: No interval converter found for type: org.joda.time.Interval
	at org.joda.time.convert.ConverterManager.getIntervalConverter(ConverterManager.java:102)
	at org.joda.time.convert.TestConverterManager.testGetIntervalConverter(TestConverterManager.java:843)

testGetIntervalConverterRemovedNull(org.joda.time.convert.TestConverterManager)  Time elapsed: 0 sec  <<< FAILURE!
junit.framework.AssertionFailedError
	at junit.framework.Assert.fail(Assert.java:47)
	at junit.framework.Assert.fail(Assert.java:53)
	at org.joda.time.convert.TestConverterManager.testGetIntervalConverterRemovedNull(TestConverterManager.java:867)

testAddIntervalConverter1(org.joda.time.convert.TestConverterManager)  Time elapsed: 0.002 sec  <<< ERROR!
java.lang.IllegalArgumentException: No interval converter found for type: java.lang.Boolean
	at org.joda.time.convert.ConverterManager.getIntervalConverter(ConverterManager.java:102)
	at org.joda.time.convert.TestConverterManager.testAddIntervalConverter1(TestConverterManager.java:891)

testAddIntervalConverter2(org.joda.time.convert.TestConverterManager)  Time elapsed: 0.001 sec  <<< ERROR!
java.lang.IllegalArgumentException: No interval converter found for type: java.lang.String
	at org.joda.time.convert.ConverterManager.getIntervalConverter(ConverterManager.java:102)
	at org.joda.time.convert.TestConverterManager.testAddIntervalConverter2(TestConverterManager.java:908)


Results :

Failed tests: 
  org.joda.time.convert.TestConverterManager#testGetIntervalConverterRemovedNull AssertionFailedError
Tests in error: 
  org.joda.time.TestInterval_Basics#testToString_reparse IllegalArgumentException
  org.joda.time.TestInterval_Constructors#testConstructor_Object1 IllegalArgumentException
  org.joda.time.TestInterval_Constructors#testConstructor_Object2 IllegalArgumentException
  org.joda.time.TestInterval_Constructors#testConstructor_Object3 IllegalArgumentException
  org.joda.time.TestInterval_Constructors#testConstructor_Object4 IllegalArgumentException
  org.joda.time.TestInterval_Constructors#testConstructor_Object5 IllegalArgumentException
  org.joda.time.TestInterval_Constructors#testConstructor_Object6 IllegalArgumentException
  org.joda.time.TestInterval_Constructors#testConstructor_Object_Chronology1 IllegalArgumentException
  org.joda.time.TestInterval_Constructors#testConstructor_Object_Chronology2 IllegalArgumentException
  org.joda.time.TestInterval_Constructors#testParse_noFormatter IllegalArgumentException
  org.joda.time.TestMutableInterval_Constructors#testConstructor_Object1 IllegalArgumentException
  org.joda.time.TestMutableInterval_Constructors#testConstructor_Object2 IllegalArgumentException
  org.joda.time.TestMutableInterval_Constructors#testConstructor_Object3 IllegalArgumentException
  org.joda.time.TestMutableInterval_Constructors#testConstructor_Object4 IllegalArgumentException
  org.joda.time.TestMutableInterval_Constructors#testConstructor_Object5 IllegalArgumentException
  org.joda.time.TestMutableInterval_Constructors#testConstructor_Object6 IllegalArgumentException
  org.joda.time.TestMutableInterval_Constructors#testConstructor_Object_Chronology1 IllegalArgumentException
  org.joda.time.TestMutableInterval_Constructors#testConstructor_Object_Chronology2 IllegalArgumentException
  org.joda.time.TestMutableInterval_Constructors#testParse_noFormatter IllegalArgumentException
  org.joda.time.convert.TestConverterManager#testAddIntervalConverter1 IllegalArgumentException
  org.joda.time.convert.TestConverterManager#testAddIntervalConverter2 IllegalArgumentException
  org.joda.time.convert.TestConverterManager#testGetIntervalConverter IllegalArgumentException

Tests run: 4157, Failures: 1, Errors: 22, Skipped: 0

[INFO] ------------------------------------------------------------------------
[INFO] BUILD FAILURE
[INFO] ------------------------------------------------------------------------
[INFO] Total time: 15.864s
[INFO] Finished at: Thu Aug 06 02:48:27 BST 2015
[INFO] Final Memory: 9M/213M
[INFO] ------------------------------------------------------------------------
[ERROR] Failed to execute goal org.apache.maven.plugins:maven-surefire-plugin:2.18.1:test (default-test) on project joda-time: There are test failures.
[ERROR] 
[ERROR] Please refer to /home/perham/Study/LittleDarwin/Cases/joda-time-2.8.1/target/surefire-reports for the individual test results.
[ERROR] -> [Help 1]
[ERROR] 
[ERROR] To see the full stack trace of the errors, re-run Maven with the -e switch.
[ERROR] Re-run Maven using the -X switch to enable full debug logging.
[ERROR] 
[ERROR] For more information about the errors and possible solutions, please read the following articles:
[ERROR] [Help 1] http://cwiki.apache.org/confluence/display/MAVEN/MojoFailureException
