[INFO] Scanning for projects...
[INFO]                                                                         
[INFO] ------------------------------------------------------------------------
[INFO] Building Joda-Time 2.8.1
[INFO] ------------------------------------------------------------------------
[INFO] 
[INFO] --- maven-resources-plugin:2.7:resources (default-resources) @ joda-time ---
[INFO] Using 'UTF-8' encoding to copy filtered resources.
[INFO] Copying 2 resources to META-INF
[INFO] Copying 10 resources
[INFO] 
[INFO] --- maven-compiler-plugin:3.3:compile (default-compile) @ joda-time ---
[INFO] Changes detected - recompiling the module!
[INFO] Compiling 166 source files to /home/perham/Study/LittleDarwin/Cases/joda-time-2.8.1/target/classes
[INFO] 
[INFO] --- exec-maven-plugin:1.4.0:java (compile-tzdb) @ joda-time ---
Writing zoneinfo files
Writing ZoneInfoMap
[INFO] 
[INFO] --- maven-resources-plugin:2.7:testResources (default-testResources) @ joda-time ---
[INFO] Using 'UTF-8' encoding to copy filtered resources.
[INFO] Copying 34 resources
[INFO] 
[INFO] --- maven-compiler-plugin:3.3:testCompile (default-testCompile) @ joda-time ---
[INFO] Nothing to compile - all classes are up to date
[INFO] 
[INFO] --- maven-surefire-plugin:2.18.1:test (default-test) @ joda-time ---
[INFO] Surefire report directory: /home/perham/Study/LittleDarwin/Cases/joda-time-2.8.1/target/surefire-reports

-------------------------------------------------------
 T E S T S
-------------------------------------------------------
Running org.joda.time.TestAllPackages

TestBuddhistChronology.testCalendar

TestCopticChronology.testCalendar

TestEthiopicChronology.testCalendar

TestIslamicChronology.testCalendar

Testing Gregorian chronology over 1000 iterations
100% complete (i=1000)

Testing Julian chronology over 1000 iterations
100% complete (i=1000)
Writing zoneinfo files
Writing ZoneInfoMap
Tests run: 4157, Failures: 9, Errors: 26, Skipped: 0, Time elapsed: 5.183 sec <<< FAILURE! - in org.joda.time.TestAllPackages
testConstructor_badconverterObject(org.joda.time.TestInstant_Constructors)  Time elapsed: 0.005 sec  <<< ERROR!
java.lang.IllegalArgumentException: No instant converter found for type: java.lang.Integer
	at org.joda.time.convert.ConverterManager.getInstantConverter(ConverterManager.java:26)
	at org.joda.time.Instant.<init>(Instant.java:133)
	at org.joda.time.TestInstant_Constructors.testConstructor_badconverterObject(TestInstant_Constructors.java:174)

testConstructor_badconverterObject(org.joda.time.TestDateTime_Constructors)  Time elapsed: 0 sec  <<< ERROR!
java.lang.IllegalArgumentException: No instant converter found for type: java.lang.Integer
	at org.joda.time.convert.ConverterManager.getInstantConverter(ConverterManager.java:26)
	at org.joda.time.base.BaseDateTime.<init>(BaseDateTime.java:173)
	at org.joda.time.DateTime.<init>(DateTime.java:257)
	at org.joda.time.TestDateTime_Constructors.testConstructor_badconverterObject(TestDateTime_Constructors.java:366)

testConstructor_badconverterObject_DateTimeZone(org.joda.time.TestDateTime_Constructors)  Time elapsed: 0.001 sec  <<< ERROR!
java.lang.IllegalArgumentException: No instant converter found for type: java.lang.Integer
	at org.joda.time.convert.ConverterManager.getInstantConverter(ConverterManager.java:26)
	at org.joda.time.base.BaseDateTime.<init>(BaseDateTime.java:173)
	at org.joda.time.DateTime.<init>(DateTime.java:302)
	at org.joda.time.TestDateTime_Constructors.testConstructor_badconverterObject_DateTimeZone(TestDateTime_Constructors.java:531)

testConstructor_badconverterObject_Chronology(org.joda.time.TestDateTime_Constructors)  Time elapsed: 0 sec  <<< ERROR!
java.lang.IllegalArgumentException: No instant converter found for type: java.lang.Integer
	at org.joda.time.convert.ConverterManager.getInstantConverter(ConverterManager.java:26)
	at org.joda.time.base.BaseDateTime.<init>(BaseDateTime.java:173)
	at org.joda.time.DateTime.<init>(DateTime.java:302)
	at org.joda.time.TestDateTime_Constructors.testConstructor_badconverterObject_Chronology(TestDateTime_Constructors.java:593)

testConstructor_badconverterObject(org.joda.time.TestMutableDateTime_Constructors)  Time elapsed: 0 sec  <<< ERROR!
java.lang.IllegalArgumentException: No instant converter found for type: java.lang.Integer
	at org.joda.time.convert.ConverterManager.getInstantConverter(ConverterManager.java:26)
	at org.joda.time.base.BaseDateTime.<init>(BaseDateTime.java:173)
	at org.joda.time.MutableDateTime.<init>(MutableDateTime.java:256)
	at org.joda.time.TestMutableDateTime_Constructors.testConstructor_badconverterObject(TestMutableDateTime_Constructors.java:321)

testConstructor_badconverterObject_DateTimeZone(org.joda.time.TestMutableDateTime_Constructors)  Time elapsed: 0 sec  <<< ERROR!
java.lang.IllegalArgumentException: No instant converter found for type: java.lang.Integer
	at org.joda.time.convert.ConverterManager.getInstantConverter(ConverterManager.java:26)
	at org.joda.time.base.BaseDateTime.<init>(BaseDateTime.java:173)
	at org.joda.time.MutableDateTime.<init>(MutableDateTime.java:299)
	at org.joda.time.TestMutableDateTime_Constructors.testConstructor_badconverterObject_DateTimeZone(TestMutableDateTime_Constructors.java:383)

testConstructor_badconverterObject_Chronology(org.joda.time.TestMutableDateTime_Constructors)  Time elapsed: 0 sec  <<< ERROR!
java.lang.IllegalArgumentException: No instant converter found for type: java.lang.Integer
	at org.joda.time.convert.ConverterManager.getInstantConverter(ConverterManager.java:26)
	at org.joda.time.base.BaseDateTime.<init>(BaseDateTime.java:173)
	at org.joda.time.MutableDateTime.<init>(MutableDateTime.java:299)
	at org.joda.time.TestMutableDateTime_Constructors.testConstructor_badconverterObject_Chronology(TestMutableDateTime_Constructors.java:445)

testConstructor_badconverterObject(org.joda.time.TestDateMidnight_Constructors)  Time elapsed: 0.001 sec  <<< ERROR!
java.lang.IllegalArgumentException: No instant converter found for type: java.lang.Integer
	at org.joda.time.convert.ConverterManager.getInstantConverter(ConverterManager.java:26)
	at org.joda.time.base.BaseDateTime.<init>(BaseDateTime.java:173)
	at org.joda.time.DateMidnight.<init>(DateMidnight.java:256)
	at org.joda.time.TestDateMidnight_Constructors.testConstructor_badconverterObject(TestDateMidnight_Constructors.java:340)

testConstructor_badconverterObject_DateTimeZone(org.joda.time.TestDateMidnight_Constructors)  Time elapsed: 0 sec  <<< ERROR!
java.lang.IllegalArgumentException: No instant converter found for type: java.lang.Integer
	at org.joda.time.convert.ConverterManager.getInstantConverter(ConverterManager.java:26)
	at org.joda.time.base.BaseDateTime.<init>(BaseDateTime.java:173)
	at org.joda.time.DateMidnight.<init>(DateMidnight.java:303)
	at org.joda.time.TestDateMidnight_Constructors.testConstructor_badconverterObject_DateTimeZone(TestDateMidnight_Constructors.java:402)

testConstructor_badconverterObject_Chronology(org.joda.time.TestDateMidnight_Constructors)  Time elapsed: 0 sec  <<< ERROR!
java.lang.IllegalArgumentException: No instant converter found for type: java.lang.Integer
	at org.joda.time.convert.ConverterManager.getInstantConverter(ConverterManager.java:26)
	at org.joda.time.base.BaseDateTime.<init>(BaseDateTime.java:173)
	at org.joda.time.DateMidnight.<init>(DateMidnight.java:303)
	at org.joda.time.TestDateMidnight_Constructors.testConstructor_badconverterObject_Chronology(TestDateMidnight_Constructors.java:464)

testRemoveInstantConverter1(org.joda.time.convert.TestConverterManager)  Time elapsed: 0.001 sec  <<< FAILURE!
junit.framework.AssertionFailedError: expected:<6> but was:<5>
	at junit.framework.Assert.fail(Assert.java:47)
	at junit.framework.Assert.failNotEquals(Assert.java:280)
	at junit.framework.Assert.assertEquals(Assert.java:64)
	at junit.framework.Assert.assertEquals(Assert.java:198)
	at junit.framework.Assert.assertEquals(Assert.java:204)
	at org.joda.time.convert.TestConverterManager.testRemoveInstantConverter1(TestConverterManager.java:290)

testRemoveInstantConverter2(org.joda.time.convert.TestConverterManager)  Time elapsed: 0.001 sec  <<< FAILURE!
junit.framework.AssertionFailedError: expected:<6> but was:<5>
	at junit.framework.Assert.fail(Assert.java:47)
	at junit.framework.Assert.failNotEquals(Assert.java:280)
	at junit.framework.Assert.assertEquals(Assert.java:64)
	at junit.framework.Assert.assertEquals(Assert.java:198)
	at junit.framework.Assert.assertEquals(Assert.java:204)
	at org.joda.time.convert.TestConverterManager.testRemoveInstantConverter2(TestConverterManager.java:302)

testRemoveInstantConverter3(org.joda.time.convert.TestConverterManager)  Time elapsed: 0.001 sec  <<< FAILURE!
junit.framework.AssertionFailedError: expected:<6> but was:<5>
	at junit.framework.Assert.fail(Assert.java:47)
	at junit.framework.Assert.failNotEquals(Assert.java:280)
	at junit.framework.Assert.assertEquals(Assert.java:64)
	at junit.framework.Assert.assertEquals(Assert.java:198)
	at junit.framework.Assert.assertEquals(Assert.java:204)
	at org.joda.time.convert.TestConverterManager.testRemoveInstantConverter3(TestConverterManager.java:308)

testGetInstantConverter(org.joda.time.convert.TestConverterManager)  Time elapsed: 0 sec  <<< ERROR!
java.lang.IllegalArgumentException: No instant converter found for type: java.lang.String
	at org.joda.time.convert.ConverterManager.getInstantConverter(ConverterManager.java:26)
	at org.joda.time.convert.TestConverterManager.testGetInstantConverter(TestConverterManager.java:138)

testGetInstantConverterRemovedNull(org.joda.time.convert.TestConverterManager)  Time elapsed: 0 sec  <<< FAILURE!
junit.framework.AssertionFailedError: expected:<6> but was:<4>
	at junit.framework.Assert.fail(Assert.java:47)
	at junit.framework.Assert.failNotEquals(Assert.java:280)
	at junit.framework.Assert.assertEquals(Assert.java:64)
	at junit.framework.Assert.assertEquals(Assert.java:198)
	at junit.framework.Assert.assertEquals(Assert.java:204)
	at org.joda.time.convert.TestConverterManager.testGetInstantConverterRemovedNull(TestConverterManager.java:166)

testGetInstantConverterOKMultipleMatches(org.joda.time.convert.TestConverterManager)  Time elapsed: 0 sec  <<< FAILURE!
junit.framework.AssertionFailedError: expected:<interface org.joda.time.ReadableDateTime> but was:<interface org.joda.time.ReadableInstant>
	at junit.framework.Assert.fail(Assert.java:47)
	at junit.framework.Assert.failNotEquals(Assert.java:280)
	at junit.framework.Assert.assertEquals(Assert.java:64)
	at junit.framework.Assert.assertEquals(Assert.java:71)
	at org.joda.time.convert.TestConverterManager.testGetInstantConverterOKMultipleMatches(TestConverterManager.java:180)

testGetInstantConverterBadMultipleMatches(org.joda.time.convert.TestConverterManager)  Time elapsed: 0 sec  <<< FAILURE!
junit.framework.AssertionFailedError
	at junit.framework.Assert.fail(Assert.java:47)
	at junit.framework.Assert.fail(Assert.java:53)
	at org.joda.time.convert.TestConverterManager.testGetInstantConverterBadMultipleMatches(TestConverterManager.java:198)

testGetInstantConverters(org.joda.time.convert.TestConverterManager)  Time elapsed: 0 sec  <<< FAILURE!
junit.framework.AssertionFailedError: expected:<6> but was:<4>
	at junit.framework.Assert.fail(Assert.java:47)
	at junit.framework.Assert.failNotEquals(Assert.java:280)
	at junit.framework.Assert.assertEquals(Assert.java:64)
	at junit.framework.Assert.assertEquals(Assert.java:198)
	at junit.framework.Assert.assertEquals(Assert.java:204)
	at org.joda.time.convert.TestConverterManager.testGetInstantConverters(TestConverterManager.java:211)

testAddInstantConverter1(org.joda.time.convert.TestConverterManager)  Time elapsed: 0 sec  <<< ERROR!
java.lang.IllegalArgumentException: No instant converter found for type: java.lang.Boolean
	at org.joda.time.convert.ConverterManager.getInstantConverter(ConverterManager.java:26)
	at org.joda.time.convert.TestConverterManager.testAddInstantConverter1(TestConverterManager.java:225)

testAddInstantConverter2(org.joda.time.convert.TestConverterManager)  Time elapsed: 0 sec  <<< FAILURE!
junit.framework.AssertionFailedError: expected:<Converter[java.lang.String]> but was:<null>
	at junit.framework.Assert.fail(Assert.java:47)
	at junit.framework.Assert.failNotEquals(Assert.java:280)
	at junit.framework.Assert.assertEquals(Assert.java:64)
	at junit.framework.Assert.assertEquals(Assert.java:71)
	at org.joda.time.convert.TestConverterManager.testAddInstantConverter2(TestConverterManager.java:242)

testAddInstantConverter3(org.joda.time.convert.TestConverterManager)  Time elapsed: 0.001 sec  <<< FAILURE!
junit.framework.AssertionFailedError: expected:<6> but was:<4>
	at junit.framework.Assert.fail(Assert.java:47)
	at junit.framework.Assert.failNotEquals(Assert.java:280)
	at junit.framework.Assert.assertEquals(Assert.java:64)
	at junit.framework.Assert.assertEquals(Assert.java:198)
	at junit.framework.Assert.assertEquals(Assert.java:204)
	at org.joda.time.convert.TestConverterManager.testAddInstantConverter3(TestConverterManager.java:254)

testAddInstantConverter4(org.joda.time.convert.TestConverterManager)  Time elapsed: 0 sec  <<< ERROR!
java.lang.NullPointerException
	at org.joda.time.convert.ConverterSet.add(ConverterSet.java:144)
	at org.joda.time.convert.ConverterManager.addInstantConverter(ConverterManager.java:34)
	at org.joda.time.convert.TestConverterManager.testAddInstantConverter4(TestConverterManager.java:258)

testGetDateTime(org.joda.time.convert.TestStringConverter)  Time elapsed: 0 sec  <<< ERROR!
java.lang.IllegalArgumentException: No instant converter found for type: java.lang.String
	at org.joda.time.convert.ConverterManager.getInstantConverter(ConverterManager.java:26)
	at org.joda.time.base.BaseDateTime.<init>(BaseDateTime.java:151)
	at org.joda.time.DateTime.<init>(DateTime.java:281)
	at org.joda.time.convert.TestStringConverter.testGetDateTime(TestStringConverter.java:212)

testGetDateTime1(org.joda.time.convert.TestStringConverter)  Time elapsed: 0 sec  <<< ERROR!
java.lang.IllegalArgumentException: No instant converter found for type: java.lang.String
	at org.joda.time.convert.ConverterManager.getInstantConverter(ConverterManager.java:26)
	at org.joda.time.base.BaseDateTime.<init>(BaseDateTime.java:173)
	at org.joda.time.DateTime.<init>(DateTime.java:257)
	at org.joda.time.convert.TestStringConverter.testGetDateTime1(TestStringConverter.java:217)

testGetDateTime2(org.joda.time.convert.TestStringConverter)  Time elapsed: 0.001 sec  <<< ERROR!
java.lang.IllegalArgumentException: No instant converter found for type: java.lang.String
	at org.joda.time.convert.ConverterManager.getInstantConverter(ConverterManager.java:26)
	at org.joda.time.base.BaseDateTime.<init>(BaseDateTime.java:173)
	at org.joda.time.DateTime.<init>(DateTime.java:257)
	at org.joda.time.convert.TestStringConverter.testGetDateTime2(TestStringConverter.java:229)

testGetDateTime3(org.joda.time.convert.TestStringConverter)  Time elapsed: 0 sec  <<< ERROR!
java.lang.IllegalArgumentException: No instant converter found for type: java.lang.String
	at org.joda.time.convert.ConverterManager.getInstantConverter(ConverterManager.java:26)
	at org.joda.time.base.BaseDateTime.<init>(BaseDateTime.java:151)
	at org.joda.time.DateTime.<init>(DateTime.java:281)
	at org.joda.time.convert.TestStringConverter.testGetDateTime3(TestStringConverter.java:241)

testGetDateTime4(org.joda.time.convert.TestStringConverter)  Time elapsed: 0.001 sec  <<< ERROR!
java.lang.IllegalArgumentException: No instant converter found for type: java.lang.String
	at org.joda.time.convert.ConverterManager.getInstantConverter(ConverterManager.java:26)
	at org.joda.time.base.BaseDateTime.<init>(BaseDateTime.java:151)
	at org.joda.time.DateTime.<init>(DateTime.java:281)
	at org.joda.time.convert.TestStringConverter.testGetDateTime4(TestStringConverter.java:253)

testGetDateTime5(org.joda.time.convert.TestStringConverter)  Time elapsed: 0 sec  <<< ERROR!
java.lang.IllegalArgumentException: No instant converter found for type: java.lang.String
	at org.joda.time.convert.ConverterManager.getInstantConverter(ConverterManager.java:26)
	at org.joda.time.base.BaseDateTime.<init>(BaseDateTime.java:173)
	at org.joda.time.DateTime.<init>(DateTime.java:302)
	at org.joda.time.convert.TestStringConverter.testGetDateTime5(TestStringConverter.java:265)

testGetDateTime6(org.joda.time.convert.TestStringConverter)  Time elapsed: 0 sec  <<< ERROR!
java.lang.IllegalArgumentException: No instant converter found for type: java.lang.String
	at org.joda.time.convert.ConverterManager.getInstantConverter(ConverterManager.java:26)
	at org.joda.time.base.BaseDateTime.<init>(BaseDateTime.java:173)
	at org.joda.time.DateTime.<init>(DateTime.java:302)
	at org.joda.time.convert.TestStringConverter.testGetDateTime6(TestStringConverter.java:277)

test_appendFixedDecimal(org.joda.time.format.TestDateTimeFormatterBuilder)  Time elapsed: 0.001 sec  <<< ERROR!
java.lang.IllegalArgumentException: No instant converter found for type: java.lang.String
	at org.joda.time.convert.ConverterManager.getInstantConverter(ConverterManager.java:26)
	at org.joda.time.base.BaseDateTime.<init>(BaseDateTime.java:173)
	at org.joda.time.DateTime.<init>(DateTime.java:257)
	at org.joda.time.format.TestDateTimeFormatterBuilder.test_appendFixedDecimal(TestDateTimeFormatterBuilder.java:246)

test_appendFixedSignedDecimal(org.joda.time.format.TestDateTimeFormatterBuilder)  Time elapsed: 0.001 sec  <<< ERROR!
java.lang.IllegalArgumentException: No instant converter found for type: java.lang.String
	at org.joda.time.convert.ConverterManager.getInstantConverter(ConverterManager.java:26)
	at org.joda.time.base.BaseDateTime.<init>(BaseDateTime.java:173)
	at org.joda.time.DateTime.<init>(DateTime.java:257)
	at org.joda.time.format.TestDateTimeFormatterBuilder.test_appendFixedSignedDecimal(TestDateTimeFormatterBuilder.java:303)

testSerialization(org.joda.time.tz.TestBuilder)  Time elapsed: 0.007 sec  <<< ERROR!
java.lang.IllegalArgumentException: No instant converter found for type: java.lang.String
	at org.joda.time.convert.ConverterManager.getInstantConverter(ConverterManager.java:26)
	at org.joda.time.base.BaseDateTime.<init>(BaseDateTime.java:173)
	at org.joda.time.DateTime.<init>(DateTime.java:257)
	at org.joda.time.tz.TestBuilder.testForwardTransitions(TestBuilder.java:241)
	at org.joda.time.tz.TestBuilder.testSerialization(TestBuilder.java:282)

testForwardTransitions(org.joda.time.tz.TestBuilder)  Time elapsed: 0.005 sec  <<< ERROR!
java.lang.IllegalArgumentException: No instant converter found for type: java.lang.String
	at org.joda.time.convert.ConverterManager.getInstantConverter(ConverterManager.java:26)
	at org.joda.time.base.BaseDateTime.<init>(BaseDateTime.java:173)
	at org.joda.time.DateTime.<init>(DateTime.java:257)
	at org.joda.time.tz.TestBuilder.testForwardTransitions(TestBuilder.java:241)
	at org.joda.time.tz.TestBuilder.testForwardTransitions(TestBuilder.java:217)

testReverseTransitions(org.joda.time.tz.TestBuilder)  Time elapsed: 0.006 sec  <<< ERROR!
java.lang.IllegalArgumentException: No instant converter found for type: java.lang.String
	at org.joda.time.convert.ConverterManager.getInstantConverter(ConverterManager.java:26)
	at org.joda.time.base.BaseDateTime.<init>(BaseDateTime.java:173)
	at org.joda.time.DateTime.<init>(DateTime.java:257)
	at org.joda.time.tz.TestBuilder.testReverseTransitions(TestBuilder.java:259)
	at org.joda.time.tz.TestBuilder.testReverseTransitions(TestBuilder.java:255)

testCompile(org.joda.time.tz.TestCompiler)  Time elapsed: 0.028 sec  <<< ERROR!
java.lang.IllegalArgumentException: No instant converter found for type: java.lang.String
	at org.joda.time.convert.ConverterManager.getInstantConverter(ConverterManager.java:26)
	at org.joda.time.base.BaseDateTime.<init>(BaseDateTime.java:173)
	at org.joda.time.DateTime.<init>(DateTime.java:257)
	at org.joda.time.tz.TestBuilder.testForwardTransitions(TestBuilder.java:241)
	at org.joda.time.tz.TestCompiler.testCompile(TestCompiler.java:117)


Results :

Failed tests: 
  org.joda.time.convert.TestConverterManager#testAddInstantConverter2 AssertionFailedError
  org.joda.time.convert.TestConverterManager#testAddInstantConverter3 AssertionFailedError
  org.joda.time.convert.TestConverterManager#testGetInstantConverterBadMultipleMatches AssertionFailedError
  org.joda.time.convert.TestConverterManager#testGetInstantConverterOKMultipleMatches AssertionFailedError
  org.joda.time.convert.TestConverterManager#testGetInstantConverterRemovedNull AssertionFailedError
  org.joda.time.convert.TestConverterManager#testGetInstantConverters AssertionFailedError
  org.joda.time.convert.TestConverterManager#testRemoveInstantConverter1 AssertionFailedError
  org.joda.time.convert.TestConverterManager#testRemoveInstantConverter2 AssertionFailedError
  org.joda.time.convert.TestConverterManager#testRemoveInstantConverter3 AssertionFailedError
Tests in error: 
  org.joda.time.TestDateMidnight_Constructors#testConstructor_badconverterObject IllegalArgumentException
  org.joda.time.TestDateMidnight_Constructors#testConstructor_badconverterObject_Chronology IllegalArgumentException
  org.joda.time.TestDateMidnight_Constructors#testConstructor_badconverterObject_DateTimeZone IllegalArgumentException
  org.joda.time.TestDateTime_Constructors#testConstructor_badconverterObject IllegalArgumentException
  org.joda.time.TestDateTime_Constructors#testConstructor_badconverterObject_Chronology IllegalArgumentException
  org.joda.time.TestDateTime_Constructors#testConstructor_badconverterObject_DateTimeZone IllegalArgumentException
  org.joda.time.TestInstant_Constructors#testConstructor_badconverterObject IllegalArgumentException
  org.joda.time.TestMutableDateTime_Constructors#testConstructor_badconverterObject IllegalArgumentException
  org.joda.time.TestMutableDateTime_Constructors#testConstructor_badconverterObject_Chronology IllegalArgumentException
  org.joda.time.TestMutableDateTime_Constructors#testConstructor_badconverterObject_DateTimeZone IllegalArgumentException
  org.joda.time.convert.TestConverterManager#testAddInstantConverter1 IllegalArgumentException
  org.joda.time.convert.TestConverterManager#testAddInstantConverter4 NullPointerException
  org.joda.time.convert.TestConverterManager#testGetInstantConverter IllegalArgumentException
  org.joda.time.convert.TestStringConverter#testGetDateTime IllegalArgumentException
  org.joda.time.convert.TestStringConverter#testGetDateTime1 IllegalArgumentException
  org.joda.time.convert.TestStringConverter#testGetDateTime2 IllegalArgumentException
  org.joda.time.convert.TestStringConverter#testGetDateTime3 IllegalArgumentException
  org.joda.time.convert.TestStringConverter#testGetDateTime4 IllegalArgumentException
  org.joda.time.convert.TestStringConverter#testGetDateTime5 IllegalArgumentException
  org.joda.time.convert.TestStringConverter#testGetDateTime6 IllegalArgumentException
  org.joda.time.format.TestDateTimeFormatterBuilder#test_appendFixedDecimal IllegalArgumentException
  org.joda.time.format.TestDateTimeFormatterBuilder#test_appendFixedSignedDecimal IllegalArgumentException
  org.joda.time.tz.TestBuilder#testForwardTransitions IllegalArgumentException N...
  org.joda.time.tz.TestBuilder#testReverseTransitions IllegalArgumentException N...
  org.joda.time.tz.TestBuilder#testSerialization IllegalArgumentException No ins...
  org.joda.time.tz.TestCompiler#testCompile IllegalArgumentException No instant ...

Tests run: 4157, Failures: 9, Errors: 26, Skipped: 0

[INFO] ------------------------------------------------------------------------
[INFO] BUILD FAILURE
[INFO] ------------------------------------------------------------------------
[INFO] Total time: 15.027s
[INFO] Finished at: Thu Aug 06 02:54:52 BST 2015
[INFO] Final Memory: 8M/214M
[INFO] ------------------------------------------------------------------------
[ERROR] Failed to execute goal org.apache.maven.plugins:maven-surefire-plugin:2.18.1:test (default-test) on project joda-time: There are test failures.
[ERROR] 
[ERROR] Please refer to /home/perham/Study/LittleDarwin/Cases/joda-time-2.8.1/target/surefire-reports for the individual test results.
[ERROR] -> [Help 1]
[ERROR] 
[ERROR] To see the full stack trace of the errors, re-run Maven with the -e switch.
[ERROR] Re-run Maven using the -X switch to enable full debug logging.
[ERROR] 
[ERROR] For more information about the errors and possible solutions, please read the following articles:
[ERROR] [Help 1] http://cwiki.apache.org/confluence/display/MAVEN/MojoFailureException
