[INFO] Scanning for projects...
[INFO]                                                                         
[INFO] ------------------------------------------------------------------------
[INFO] Building Joda-Time 2.8.1
[INFO] ------------------------------------------------------------------------
[INFO] 
[INFO] --- maven-resources-plugin:2.7:resources (default-resources) @ joda-time ---
[INFO] Using 'UTF-8' encoding to copy filtered resources.
[INFO] Copying 2 resources to META-INF
[INFO] Copying 10 resources
[INFO] 
[INFO] --- maven-compiler-plugin:3.3:compile (default-compile) @ joda-time ---
[INFO] Changes detected - recompiling the module!
[INFO] Compiling 166 source files to /home/perham/Study/LittleDarwin/Cases/joda-time-2.8.1/target/classes
[INFO] 
[INFO] --- exec-maven-plugin:1.4.0:java (compile-tzdb) @ joda-time ---
Writing zoneinfo files
Writing ZoneInfoMap
[INFO] 
[INFO] --- maven-resources-plugin:2.7:testResources (default-testResources) @ joda-time ---
[INFO] Using 'UTF-8' encoding to copy filtered resources.
[INFO] Copying 34 resources
[INFO] 
[INFO] --- maven-compiler-plugin:3.3:testCompile (default-testCompile) @ joda-time ---
[INFO] Nothing to compile - all classes are up to date
[INFO] 
[INFO] --- maven-surefire-plugin:2.18.1:test (default-test) @ joda-time ---
[INFO] Surefire report directory: /home/perham/Study/LittleDarwin/Cases/joda-time-2.8.1/target/surefire-reports

-------------------------------------------------------
 T E S T S
-------------------------------------------------------
Running org.joda.time.TestAllPackages

TestBuddhistChronology.testCalendar

TestCopticChronology.testCalendar

TestEthiopicChronology.testCalendar

TestIslamicChronology.testCalendar

Testing Gregorian chronology over 1000 iterations
100% complete (i=1000)

Testing Julian chronology over 1000 iterations
100% complete (i=1000)
Writing zoneinfo files
Writing ZoneInfoMap
Tests run: 4157, Failures: 0, Errors: 20, Skipped: 0, Time elapsed: 5.244 sec <<< FAILURE! - in org.joda.time.TestAllPackages
testConstructor_badconverterObject(org.joda.time.TestInstant_Constructors)  Time elapsed: 0.007 sec  <<< ERROR!
java.lang.NullPointerException
	at org.joda.time.convert.ConverterManager.checkAlterInstantConverters(ConverterManager.java:42)
	at org.joda.time.convert.ConverterManager.removeInstantConverter(ConverterManager.java:36)
	at org.joda.time.TestInstant_Constructors.testConstructor_badconverterObject(TestInstant_Constructors.java:178)

testConstructor_badconverterObject_DateTimeZone(org.joda.time.TestDateTime_Constructors)  Time elapsed: 0.001 sec  <<< ERROR!
java.lang.NullPointerException
	at org.joda.time.convert.ConverterManager.checkAlterInstantConverters(ConverterManager.java:42)
	at org.joda.time.convert.ConverterManager.removeInstantConverter(ConverterManager.java:36)
	at org.joda.time.TestDateTime_Constructors.testConstructor_badconverterObject_DateTimeZone(TestDateTime_Constructors.java:535)

testConstructor_badconverterObject_Chronology(org.joda.time.TestDateTime_Constructors)  Time elapsed: 0 sec  <<< ERROR!
java.lang.NullPointerException
	at org.joda.time.convert.ConverterManager.checkAlterInstantConverters(ConverterManager.java:42)
	at org.joda.time.convert.ConverterManager.removeInstantConverter(ConverterManager.java:36)
	at org.joda.time.TestDateTime_Constructors.testConstructor_badconverterObject_Chronology(TestDateTime_Constructors.java:597)

testConstructor_badconverterObject(org.joda.time.TestDateTime_Constructors)  Time elapsed: 0.001 sec  <<< ERROR!
java.lang.NullPointerException
	at org.joda.time.convert.ConverterManager.checkAlterInstantConverters(ConverterManager.java:42)
	at org.joda.time.convert.ConverterManager.removeInstantConverter(ConverterManager.java:36)
	at org.joda.time.TestDateTime_Constructors.testConstructor_badconverterObject(TestDateTime_Constructors.java:370)

testConstructor_badconverterObject_DateTimeZone(org.joda.time.TestMutableDateTime_Constructors)  Time elapsed: 0 sec  <<< ERROR!
java.lang.NullPointerException
	at org.joda.time.convert.ConverterManager.checkAlterInstantConverters(ConverterManager.java:42)
	at org.joda.time.convert.ConverterManager.removeInstantConverter(ConverterManager.java:36)
	at org.joda.time.TestMutableDateTime_Constructors.testConstructor_badconverterObject_DateTimeZone(TestMutableDateTime_Constructors.java:387)

testConstructor_badconverterObject_Chronology(org.joda.time.TestMutableDateTime_Constructors)  Time elapsed: 0.001 sec  <<< ERROR!
java.lang.NullPointerException
	at org.joda.time.convert.ConverterManager.checkAlterInstantConverters(ConverterManager.java:42)
	at org.joda.time.convert.ConverterManager.removeInstantConverter(ConverterManager.java:36)
	at org.joda.time.TestMutableDateTime_Constructors.testConstructor_badconverterObject_Chronology(TestMutableDateTime_Constructors.java:449)

testConstructor_badconverterObject(org.joda.time.TestMutableDateTime_Constructors)  Time elapsed: 0.001 sec  <<< ERROR!
java.lang.NullPointerException
	at org.joda.time.convert.ConverterManager.checkAlterInstantConverters(ConverterManager.java:42)
	at org.joda.time.convert.ConverterManager.removeInstantConverter(ConverterManager.java:36)
	at org.joda.time.TestMutableDateTime_Constructors.testConstructor_badconverterObject(TestMutableDateTime_Constructors.java:325)

testConstructor_badconverterObject_DateTimeZone(org.joda.time.TestDateMidnight_Constructors)  Time elapsed: 0.001 sec  <<< ERROR!
java.lang.NullPointerException
	at org.joda.time.convert.ConverterManager.checkAlterInstantConverters(ConverterManager.java:42)
	at org.joda.time.convert.ConverterManager.removeInstantConverter(ConverterManager.java:36)
	at org.joda.time.TestDateMidnight_Constructors.testConstructor_badconverterObject_DateTimeZone(TestDateMidnight_Constructors.java:406)

testConstructor_badconverterObject_Chronology(org.joda.time.TestDateMidnight_Constructors)  Time elapsed: 0.001 sec  <<< ERROR!
java.lang.NullPointerException
	at org.joda.time.convert.ConverterManager.checkAlterInstantConverters(ConverterManager.java:42)
	at org.joda.time.convert.ConverterManager.removeInstantConverter(ConverterManager.java:36)
	at org.joda.time.TestDateMidnight_Constructors.testConstructor_badconverterObject_Chronology(TestDateMidnight_Constructors.java:468)

testConstructor_badconverterObject(org.joda.time.TestDateMidnight_Constructors)  Time elapsed: 0 sec  <<< ERROR!
java.lang.NullPointerException
	at org.joda.time.convert.ConverterManager.checkAlterInstantConverters(ConverterManager.java:42)
	at org.joda.time.convert.ConverterManager.removeInstantConverter(ConverterManager.java:36)
	at org.joda.time.TestDateMidnight_Constructors.testConstructor_badconverterObject(TestDateMidnight_Constructors.java:344)

testGetInstantConverterRemovedNull(org.joda.time.convert.TestConverterManager)  Time elapsed: 0 sec  <<< ERROR!
java.lang.NullPointerException
	at org.joda.time.convert.ConverterManager.checkAlterInstantConverters(ConverterManager.java:42)
	at org.joda.time.convert.ConverterManager.addInstantConverter(ConverterManager.java:31)
	at org.joda.time.convert.TestConverterManager.testGetInstantConverterRemovedNull(TestConverterManager.java:164)

testGetInstantConverterOKMultipleMatches(org.joda.time.convert.TestConverterManager)  Time elapsed: 0 sec  <<< ERROR!
java.lang.NullPointerException
	at org.joda.time.convert.ConverterManager.checkAlterInstantConverters(ConverterManager.java:42)
	at org.joda.time.convert.ConverterManager.removeInstantConverter(ConverterManager.java:36)
	at org.joda.time.convert.TestConverterManager.testGetInstantConverterOKMultipleMatches(TestConverterManager.java:182)

testGetInstantConverterBadMultipleMatches(org.joda.time.convert.TestConverterManager)  Time elapsed: 0.001 sec  <<< ERROR!
java.lang.NullPointerException
	at org.joda.time.convert.ConverterManager.checkAlterInstantConverters(ConverterManager.java:42)
	at org.joda.time.convert.ConverterManager.removeInstantConverter(ConverterManager.java:36)
	at org.joda.time.convert.TestConverterManager.testGetInstantConverterBadMultipleMatches(TestConverterManager.java:203)

testAddInstantConverter1(org.joda.time.convert.TestConverterManager)  Time elapsed: 0.001 sec  <<< ERROR!
java.lang.NullPointerException
	at org.joda.time.convert.ConverterManager.checkAlterInstantConverters(ConverterManager.java:42)
	at org.joda.time.convert.ConverterManager.removeInstantConverter(ConverterManager.java:36)
	at org.joda.time.convert.TestConverterManager.testAddInstantConverter1(TestConverterManager.java:228)

testAddInstantConverter2(org.joda.time.convert.TestConverterManager)  Time elapsed: 0.001 sec  <<< ERROR!
java.lang.NullPointerException
	at org.joda.time.convert.ConverterManager.checkAlterInstantConverters(ConverterManager.java:42)
	at org.joda.time.convert.ConverterManager.addInstantConverter(ConverterManager.java:31)
	at org.joda.time.convert.TestConverterManager.testAddInstantConverter2(TestConverterManager.java:246)

testAddInstantConverter3(org.joda.time.convert.TestConverterManager)  Time elapsed: 0.001 sec  <<< ERROR!
java.lang.NullPointerException
	at org.joda.time.convert.ConverterManager.checkAlterInstantConverters(ConverterManager.java:42)
	at org.joda.time.convert.ConverterManager.addInstantConverter(ConverterManager.java:31)
	at org.joda.time.convert.TestConverterManager.testAddInstantConverter3(TestConverterManager.java:252)

testAddInstantConverter4(org.joda.time.convert.TestConverterManager)  Time elapsed: 0 sec  <<< ERROR!
java.lang.NullPointerException
	at org.joda.time.convert.ConverterManager.checkAlterInstantConverters(ConverterManager.java:42)
	at org.joda.time.convert.ConverterManager.addInstantConverter(ConverterManager.java:31)
	at org.joda.time.convert.TestConverterManager.testAddInstantConverter4(TestConverterManager.java:258)

testRemoveInstantConverter1(org.joda.time.convert.TestConverterManager)  Time elapsed: 0 sec  <<< ERROR!
java.lang.NullPointerException
	at org.joda.time.convert.ConverterManager.checkAlterInstantConverters(ConverterManager.java:42)
	at org.joda.time.convert.ConverterManager.addInstantConverter(ConverterManager.java:31)
	at org.joda.time.convert.TestConverterManager.testRemoveInstantConverter1(TestConverterManager.java:288)

testRemoveInstantConverter2(org.joda.time.convert.TestConverterManager)  Time elapsed: 0.001 sec  <<< ERROR!
java.lang.NullPointerException
	at org.joda.time.convert.ConverterManager.checkAlterInstantConverters(ConverterManager.java:42)
	at org.joda.time.convert.ConverterManager.removeInstantConverter(ConverterManager.java:36)
	at org.joda.time.convert.TestConverterManager.testRemoveInstantConverter2(TestConverterManager.java:300)

testRemoveInstantConverter3(org.joda.time.convert.TestConverterManager)  Time elapsed: 0 sec  <<< ERROR!
java.lang.NullPointerException
	at org.joda.time.convert.ConverterManager.checkAlterInstantConverters(ConverterManager.java:42)
	at org.joda.time.convert.ConverterManager.removeInstantConverter(ConverterManager.java:36)
	at org.joda.time.convert.TestConverterManager.testRemoveInstantConverter3(TestConverterManager.java:306)


Results :

Tests in error: 
  org.joda.time.TestDateMidnight_Constructors#testConstructor_badconverterObject NullPointerException
  org.joda.time.TestDateMidnight_Constructors#testConstructor_badconverterObject_Chronology NullPointerException
  org.joda.time.TestDateMidnight_Constructors#testConstructor_badconverterObject_DateTimeZone NullPointerException
  org.joda.time.TestDateTime_Constructors#testConstructor_badconverterObject NullPointerException
  org.joda.time.TestDateTime_Constructors#testConstructor_badconverterObject_Chronology NullPointerException
  org.joda.time.TestDateTime_Constructors#testConstructor_badconverterObject_DateTimeZone NullPointerException
  org.joda.time.TestInstant_Constructors#testConstructor_badconverterObject NullPointerException
  org.joda.time.TestMutableDateTime_Constructors#testConstructor_badconverterObject NullPointerException
  org.joda.time.TestMutableDateTime_Constructors#testConstructor_badconverterObject_Chronology NullPointerException
  org.joda.time.TestMutableDateTime_Constructors#testConstructor_badconverterObject_DateTimeZone NullPointerException
  org.joda.time.convert.TestConverterManager#testAddInstantConverter1 NullPointerException
  org.joda.time.convert.TestConverterManager#testAddInstantConverter2 NullPointerException
  org.joda.time.convert.TestConverterManager#testAddInstantConverter3 NullPointerException
  org.joda.time.convert.TestConverterManager#testAddInstantConverter4 NullPointerException
  org.joda.time.convert.TestConverterManager#testGetInstantConverterBadMultipleMatches NullPointerException
  org.joda.time.convert.TestConverterManager#testGetInstantConverterOKMultipleMatches NullPointerException
  org.joda.time.convert.TestConverterManager#testGetInstantConverterRemovedNull NullPointerException
  org.joda.time.convert.TestConverterManager#testRemoveInstantConverter1 NullPointerException
  org.joda.time.convert.TestConverterManager#testRemoveInstantConverter2 NullPointerException
  org.joda.time.convert.TestConverterManager#testRemoveInstantConverter3 NullPointerException

Tests run: 4157, Failures: 0, Errors: 20, Skipped: 0

[INFO] ------------------------------------------------------------------------
[INFO] BUILD FAILURE
[INFO] ------------------------------------------------------------------------
[INFO] Total time: 15.570s
[INFO] Finished at: Thu Aug 06 02:54:17 BST 2015
[INFO] Final Memory: 8M/218M
[INFO] ------------------------------------------------------------------------
[ERROR] Failed to execute goal org.apache.maven.plugins:maven-surefire-plugin:2.18.1:test (default-test) on project joda-time: There are test failures.
[ERROR] 
[ERROR] Please refer to /home/perham/Study/LittleDarwin/Cases/joda-time-2.8.1/target/surefire-reports for the individual test results.
[ERROR] -> [Help 1]
[ERROR] 
[ERROR] To see the full stack trace of the errors, re-run Maven with the -e switch.
[ERROR] Re-run Maven using the -X switch to enable full debug logging.
[ERROR] 
[ERROR] For more information about the errors and possible solutions, please read the following articles:
[ERROR] [Help 1] http://cwiki.apache.org/confluence/display/MAVEN/MojoFailureException
