[INFO] Scanning for projects...
[INFO]                                                                         
[INFO] ------------------------------------------------------------------------
[INFO] Building Joda-Time 2.8.1
[INFO] ------------------------------------------------------------------------
[INFO] 
[INFO] --- maven-resources-plugin:2.7:resources (default-resources) @ joda-time ---
[INFO] Using 'UTF-8' encoding to copy filtered resources.
[INFO] Copying 2 resources to META-INF
[INFO] Copying 10 resources
[INFO] 
[INFO] --- maven-compiler-plugin:3.3:compile (default-compile) @ joda-time ---
[INFO] Changes detected - recompiling the module!
[INFO] Compiling 166 source files to /home/perham/Study/LittleDarwin/Cases/joda-time-2.8.1/target/classes
[INFO] 
[INFO] --- exec-maven-plugin:1.4.0:java (compile-tzdb) @ joda-time ---
Writing zoneinfo files
Writing ZoneInfoMap
[INFO] 
[INFO] --- maven-resources-plugin:2.7:testResources (default-testResources) @ joda-time ---
[INFO] Using 'UTF-8' encoding to copy filtered resources.
[INFO] Copying 34 resources
[INFO] 
[INFO] --- maven-compiler-plugin:3.3:testCompile (default-testCompile) @ joda-time ---
[INFO] Nothing to compile - all classes are up to date
[INFO] 
[INFO] --- maven-surefire-plugin:2.18.1:test (default-test) @ joda-time ---
[INFO] Surefire report directory: /home/perham/Study/LittleDarwin/Cases/joda-time-2.8.1/target/surefire-reports

-------------------------------------------------------
 T E S T S
-------------------------------------------------------
Running org.joda.time.TestAllPackages

TestBuddhistChronology.testCalendar

TestCopticChronology.testCalendar

TestEthiopicChronology.testCalendar

TestIslamicChronology.testCalendar

Testing Gregorian chronology over 1000 iterations
100% complete (i=1000)

Testing Julian chronology over 1000 iterations
100% complete (i=1000)
Writing zoneinfo files
Writing ZoneInfoMap
Tests run: 4157, Failures: 1, Errors: 114, Skipped: 0, Time elapsed: 5.258 sec <<< FAILURE! - in org.joda.time.TestAllPackages
testConstructor_ObjectString2(org.joda.time.TestLocalDateTime_Constructors)  Time elapsed: 0.004 sec  <<< ERROR!
java.lang.IllegalArgumentException: No partial converter found for type: java.lang.String
	at org.joda.time.convert.ConverterManager.getPartialConverter(ConverterManager.java:45)
	at org.joda.time.LocalDateTime.<init>(LocalDateTime.java:410)
	at org.joda.time.LocalDateTime.<init>(LocalDateTime.java:358)
	at org.joda.time.TestLocalDateTime_Constructors.testConstructor_ObjectString2(TestLocalDateTime_Constructors.java:392)

testConstructor_ObjectString3(org.joda.time.TestLocalDateTime_Constructors)  Time elapsed: 0 sec  <<< ERROR!
java.lang.IllegalArgumentException: No partial converter found for type: java.lang.String
	at org.joda.time.convert.ConverterManager.getPartialConverter(ConverterManager.java:45)
	at org.joda.time.LocalDateTime.<init>(LocalDateTime.java:410)
	at org.joda.time.LocalDateTime.<init>(LocalDateTime.java:358)
	at org.joda.time.TestLocalDateTime_Constructors.testConstructor_ObjectString3(TestLocalDateTime_Constructors.java:404)

testConstructor_ObjectString4(org.joda.time.TestLocalDateTime_Constructors)  Time elapsed: 0.001 sec  <<< ERROR!
java.lang.IllegalArgumentException: No partial converter found for type: java.lang.String
	at org.joda.time.convert.ConverterManager.getPartialConverter(ConverterManager.java:45)
	at org.joda.time.LocalDateTime.<init>(LocalDateTime.java:410)
	at org.joda.time.LocalDateTime.<init>(LocalDateTime.java:358)
	at org.joda.time.TestLocalDateTime_Constructors.testConstructor_ObjectString4(TestLocalDateTime_Constructors.java:416)

testConstructor_Object_DateTimeZone(org.joda.time.TestLocalDateTime_Constructors)  Time elapsed: 0.001 sec  <<< ERROR!
java.lang.IllegalArgumentException: No partial converter found for type: java.util.Date
	at org.joda.time.convert.ConverterManager.getPartialConverter(ConverterManager.java:45)
	at org.joda.time.LocalDateTime.<init>(LocalDateTime.java:380)
	at org.joda.time.TestLocalDateTime_Constructors.testConstructor_Object_DateTimeZone(TestLocalDateTime_Constructors.java:501)

testConstructor_nullObject_DateTimeZone(org.joda.time.TestLocalDateTime_Constructors)  Time elapsed: 0.001 sec  <<< ERROR!
java.lang.IllegalArgumentException: No partial converter found for type: null
	at org.joda.time.convert.ConverterManager.getPartialConverter(ConverterManager.java:45)
	at org.joda.time.LocalDateTime.<init>(LocalDateTime.java:380)
	at org.joda.time.TestLocalDateTime_Constructors.testConstructor_nullObject_DateTimeZone(TestLocalDateTime_Constructors.java:541)

testConstructor_Object_nullDateTimeZone(org.joda.time.TestLocalDateTime_Constructors)  Time elapsed: 0 sec  <<< ERROR!
java.lang.IllegalArgumentException: No partial converter found for type: java.util.Date
	at org.joda.time.convert.ConverterManager.getPartialConverter(ConverterManager.java:45)
	at org.joda.time.LocalDateTime.<init>(LocalDateTime.java:380)
	at org.joda.time.TestLocalDateTime_Constructors.testConstructor_Object_nullDateTimeZone(TestLocalDateTime_Constructors.java:554)

testConstructor_nullObject_nullDateTimeZone(org.joda.time.TestLocalDateTime_Constructors)  Time elapsed: 0.001 sec  <<< ERROR!
java.lang.IllegalArgumentException: No partial converter found for type: null
	at org.joda.time.convert.ConverterManager.getPartialConverter(ConverterManager.java:45)
	at org.joda.time.LocalDateTime.<init>(LocalDateTime.java:380)
	at org.joda.time.TestLocalDateTime_Constructors.testConstructor_nullObject_nullDateTimeZone(TestLocalDateTime_Constructors.java:566)

testConstructor_ObjectString1(org.joda.time.TestLocalDateTime_Constructors)  Time elapsed: 0 sec  <<< ERROR!
java.lang.IllegalArgumentException: No partial converter found for type: java.lang.String
	at org.joda.time.convert.ConverterManager.getPartialConverter(ConverterManager.java:45)
	at org.joda.time.LocalDateTime.<init>(LocalDateTime.java:410)
	at org.joda.time.LocalDateTime.<init>(LocalDateTime.java:358)
	at org.joda.time.TestLocalDateTime_Constructors.testConstructor_ObjectString1(TestLocalDateTime_Constructors.java:380)

testConstructor_nullObject(org.joda.time.TestLocalDateTime_Constructors)  Time elapsed: 0.001 sec  <<< ERROR!
java.lang.IllegalArgumentException: No partial converter found for type: null
	at org.joda.time.convert.ConverterManager.getPartialConverter(ConverterManager.java:45)
	at org.joda.time.LocalDateTime.<init>(LocalDateTime.java:410)
	at org.joda.time.LocalDateTime.<init>(LocalDateTime.java:358)
	at org.joda.time.TestLocalDateTime_Constructors.testConstructor_nullObject(TestLocalDateTime_Constructors.java:368)

testConstructor_Object_Chronology(org.joda.time.TestLocalDateTime_Constructors)  Time elapsed: 0 sec  <<< ERROR!
java.lang.IllegalArgumentException: No partial converter found for type: java.util.Date
	at org.joda.time.convert.ConverterManager.getPartialConverter(ConverterManager.java:45)
	at org.joda.time.LocalDateTime.<init>(LocalDateTime.java:410)
	at org.joda.time.TestLocalDateTime_Constructors.testConstructor_Object_Chronology(TestLocalDateTime_Constructors.java:580)

testConstructor_nullObject_Chronology(org.joda.time.TestLocalDateTime_Constructors)  Time elapsed: 0.001 sec  <<< ERROR!
java.lang.IllegalArgumentException: No partial converter found for type: null
	at org.joda.time.convert.ConverterManager.getPartialConverter(ConverterManager.java:45)
	at org.joda.time.LocalDateTime.<init>(LocalDateTime.java:410)
	at org.joda.time.TestLocalDateTime_Constructors.testConstructor_nullObject_Chronology(TestLocalDateTime_Constructors.java:633)

testConstructor_Object_nullChronology(org.joda.time.TestLocalDateTime_Constructors)  Time elapsed: 0 sec  <<< ERROR!
java.lang.IllegalArgumentException: No partial converter found for type: java.util.Date
	at org.joda.time.convert.ConverterManager.getPartialConverter(ConverterManager.java:45)
	at org.joda.time.LocalDateTime.<init>(LocalDateTime.java:410)
	at org.joda.time.TestLocalDateTime_Constructors.testConstructor_Object_nullChronology(TestLocalDateTime_Constructors.java:646)

testConstructor_nullObject_nullChronology(org.joda.time.TestLocalDateTime_Constructors)  Time elapsed: 0.001 sec  <<< ERROR!
java.lang.IllegalArgumentException: No partial converter found for type: null
	at org.joda.time.convert.ConverterManager.getPartialConverter(ConverterManager.java:45)
	at org.joda.time.LocalDateTime.<init>(LocalDateTime.java:410)
	at org.joda.time.TestLocalDateTime_Constructors.testConstructor_nullObject_nullChronology(TestLocalDateTime_Constructors.java:658)

testConstructor_ObjectLocalDateTime(org.joda.time.TestLocalDateTime_Constructors)  Time elapsed: 0.001 sec  <<< ERROR!
java.lang.IllegalArgumentException: No partial converter found for type: org.joda.time.LocalDateTime
	at org.joda.time.convert.ConverterManager.getPartialConverter(ConverterManager.java:45)
	at org.joda.time.LocalDateTime.<init>(LocalDateTime.java:410)
	at org.joda.time.LocalDateTime.<init>(LocalDateTime.java:358)
	at org.joda.time.TestLocalDateTime_Constructors.testConstructor_ObjectLocalDateTime(TestLocalDateTime_Constructors.java:471)

testConstructor_Object_DateTimeZoneMoscow(org.joda.time.TestLocalDateTime_Constructors)  Time elapsed: 0.001 sec  <<< ERROR!
java.lang.IllegalArgumentException: No partial converter found for type: java.lang.String
	at org.joda.time.convert.ConverterManager.getPartialConverter(ConverterManager.java:45)
	at org.joda.time.LocalDateTime.<init>(LocalDateTime.java:380)
	at org.joda.time.TestLocalDateTime_Constructors.testConstructor_Object_DateTimeZoneMoscow(TestLocalDateTime_Constructors.java:513)

testConstructor_Object_DateTimeZoneMoscowBadDateTime(org.joda.time.TestLocalDateTime_Constructors)  Time elapsed: 0 sec  <<< ERROR!
java.lang.IllegalArgumentException: No partial converter found for type: java.lang.String
	at org.joda.time.convert.ConverterManager.getPartialConverter(ConverterManager.java:45)
	at org.joda.time.LocalDateTime.<init>(LocalDateTime.java:380)
	at org.joda.time.TestLocalDateTime_Constructors.testConstructor_Object_DateTimeZoneMoscowBadDateTime(TestLocalDateTime_Constructors.java:529)

testConstructor_Object_Chronology_crossChronology(org.joda.time.TestLocalDateTime_Constructors)  Time elapsed: 0.001 sec  <<< ERROR!
java.lang.IllegalArgumentException: No partial converter found for type: org.joda.time.LocalDateTime
	at org.joda.time.convert.ConverterManager.getPartialConverter(ConverterManager.java:45)
	at org.joda.time.LocalDateTime.<init>(LocalDateTime.java:410)
	at org.joda.time.TestLocalDateTime_Constructors.testConstructor_Object_Chronology_crossChronology(TestLocalDateTime_Constructors.java:593)

testConstructor_Object_ChronologyMoscow(org.joda.time.TestLocalDateTime_Constructors)  Time elapsed: 0 sec  <<< ERROR!
java.lang.IllegalArgumentException: No partial converter found for type: java.lang.String
	at org.joda.time.convert.ConverterManager.getPartialConverter(ConverterManager.java:45)
	at org.joda.time.LocalDateTime.<init>(LocalDateTime.java:410)
	at org.joda.time.TestLocalDateTime_Constructors.testConstructor_Object_ChronologyMoscow(TestLocalDateTime_Constructors.java:605)

testConstructor_Object_ChronologyMoscowBadDateTime(org.joda.time.TestLocalDateTime_Constructors)  Time elapsed: 0.001 sec  <<< ERROR!
java.lang.IllegalArgumentException: No partial converter found for type: java.lang.String
	at org.joda.time.convert.ConverterManager.getPartialConverter(ConverterManager.java:45)
	at org.joda.time.LocalDateTime.<init>(LocalDateTime.java:410)
	at org.joda.time.TestLocalDateTime_Constructors.testConstructor_Object_ChronologyMoscowBadDateTime(TestLocalDateTime_Constructors.java:621)

testConstructor_Object1(org.joda.time.TestLocalDateTime_Constructors)  Time elapsed: 0 sec  <<< ERROR!
java.lang.IllegalArgumentException: No partial converter found for type: java.util.Date
	at org.joda.time.convert.ConverterManager.getPartialConverter(ConverterManager.java:45)
	at org.joda.time.LocalDateTime.<init>(LocalDateTime.java:410)
	at org.joda.time.LocalDateTime.<init>(LocalDateTime.java:358)
	at org.joda.time.TestLocalDateTime_Constructors.testConstructor_Object1(TestLocalDateTime_Constructors.java:356)

testConstructor_ObjectString2(org.joda.time.TestLocalDate_Constructors)  Time elapsed: 0 sec  <<< ERROR!
java.lang.IllegalArgumentException: No partial converter found for type: java.lang.String
	at org.joda.time.convert.ConverterManager.getPartialConverter(ConverterManager.java:45)
	at org.joda.time.LocalDate.<init>(LocalDate.java:415)
	at org.joda.time.LocalDate.<init>(LocalDate.java:363)
	at org.joda.time.TestLocalDate_Constructors.testConstructor_ObjectString2(TestLocalDate_Constructors.java:341)

testConstructor_ObjectString3(org.joda.time.TestLocalDate_Constructors)  Time elapsed: 0.001 sec  <<< ERROR!
java.lang.IllegalArgumentException: No partial converter found for type: java.lang.String
	at org.joda.time.convert.ConverterManager.getPartialConverter(ConverterManager.java:45)
	at org.joda.time.LocalDate.<init>(LocalDate.java:415)
	at org.joda.time.LocalDate.<init>(LocalDate.java:363)
	at org.joda.time.TestLocalDate_Constructors.testConstructor_ObjectString3(TestLocalDate_Constructors.java:349)

testConstructor_Object_DateTimeZone(org.joda.time.TestLocalDate_Constructors)  Time elapsed: 0 sec  <<< ERROR!
java.lang.IllegalArgumentException: No partial converter found for type: java.util.Date
	at org.joda.time.convert.ConverterManager.getPartialConverter(ConverterManager.java:45)
	at org.joda.time.LocalDate.<init>(LocalDate.java:385)
	at org.joda.time.TestLocalDate_Constructors.testConstructor_Object_DateTimeZone(TestLocalDate_Constructors.java:444)

testConstructor_nullObject_DateTimeZone(org.joda.time.TestLocalDate_Constructors)  Time elapsed: 0.001 sec  <<< ERROR!
java.lang.IllegalArgumentException: No partial converter found for type: null
	at org.joda.time.convert.ConverterManager.getPartialConverter(ConverterManager.java:45)
	at org.joda.time.LocalDate.<init>(LocalDate.java:385)
	at org.joda.time.TestLocalDate_Constructors.testConstructor_nullObject_DateTimeZone(TestLocalDate_Constructors.java:452)

testConstructor_Object_nullDateTimeZone(org.joda.time.TestLocalDate_Constructors)  Time elapsed: 0 sec  <<< ERROR!
java.lang.IllegalArgumentException: No partial converter found for type: java.util.Date
	at org.joda.time.convert.ConverterManager.getPartialConverter(ConverterManager.java:45)
	at org.joda.time.LocalDate.<init>(LocalDate.java:385)
	at org.joda.time.TestLocalDate_Constructors.testConstructor_Object_nullDateTimeZone(TestLocalDate_Constructors.java:461)

testConstructor_nullObject_nullDateTimeZone(org.joda.time.TestLocalDate_Constructors)  Time elapsed: 0.001 sec  <<< ERROR!
java.lang.IllegalArgumentException: No partial converter found for type: null
	at org.joda.time.convert.ConverterManager.getPartialConverter(ConverterManager.java:45)
	at org.joda.time.LocalDate.<init>(LocalDate.java:385)
	at org.joda.time.TestLocalDate_Constructors.testConstructor_nullObject_nullDateTimeZone(TestLocalDate_Constructors.java:469)

testConstructor_ObjectString1(org.joda.time.TestLocalDate_Constructors)  Time elapsed: 0.001 sec  <<< ERROR!
java.lang.IllegalArgumentException: No partial converter found for type: java.lang.String
	at org.joda.time.convert.ConverterManager.getPartialConverter(ConverterManager.java:45)
	at org.joda.time.LocalDate.<init>(LocalDate.java:415)
	at org.joda.time.LocalDate.<init>(LocalDate.java:363)
	at org.joda.time.TestLocalDate_Constructors.testConstructor_ObjectString1(TestLocalDate_Constructors.java:333)

testConstructor_nullObject(org.joda.time.TestLocalDate_Constructors)  Time elapsed: 0 sec  <<< ERROR!
java.lang.IllegalArgumentException: No partial converter found for type: null
	at org.joda.time.convert.ConverterManager.getPartialConverter(ConverterManager.java:45)
	at org.joda.time.LocalDate.<init>(LocalDate.java:415)
	at org.joda.time.LocalDate.<init>(LocalDate.java:363)
	at org.joda.time.TestLocalDate_Constructors.testConstructor_nullObject(TestLocalDate_Constructors.java:325)

testConstructor_Object_Chronology(org.joda.time.TestLocalDate_Constructors)  Time elapsed: 0 sec  <<< ERROR!
java.lang.IllegalArgumentException: No partial converter found for type: java.util.Date
	at org.joda.time.convert.ConverterManager.getPartialConverter(ConverterManager.java:45)
	at org.joda.time.LocalDate.<init>(LocalDate.java:415)
	at org.joda.time.TestLocalDate_Constructors.testConstructor_Object_Chronology(TestLocalDate_Constructors.java:478)

testConstructor_nullObject_Chronology(org.joda.time.TestLocalDate_Constructors)  Time elapsed: 0.001 sec  <<< ERROR!
java.lang.IllegalArgumentException: No partial converter found for type: null
	at org.joda.time.convert.ConverterManager.getPartialConverter(ConverterManager.java:45)
	at org.joda.time.LocalDate.<init>(LocalDate.java:415)
	at org.joda.time.TestLocalDate_Constructors.testConstructor_nullObject_Chronology(TestLocalDate_Constructors.java:495)

testConstructor_Object_nullChronology(org.joda.time.TestLocalDate_Constructors)  Time elapsed: 0 sec  <<< ERROR!
java.lang.IllegalArgumentException: No partial converter found for type: java.util.Date
	at org.joda.time.convert.ConverterManager.getPartialConverter(ConverterManager.java:45)
	at org.joda.time.LocalDate.<init>(LocalDate.java:415)
	at org.joda.time.TestLocalDate_Constructors.testConstructor_Object_nullChronology(TestLocalDate_Constructors.java:504)

testConstructor_nullObject_nullChronology(org.joda.time.TestLocalDate_Constructors)  Time elapsed: 0.001 sec  <<< ERROR!
java.lang.IllegalArgumentException: No partial converter found for type: null
	at org.joda.time.convert.ConverterManager.getPartialConverter(ConverterManager.java:45)
	at org.joda.time.LocalDate.<init>(LocalDate.java:415)
	at org.joda.time.TestLocalDate_Constructors.testConstructor_nullObject_nullChronology(TestLocalDate_Constructors.java:512)

testConstructor_ObjectLocalDateTime(org.joda.time.TestLocalDate_Constructors)  Time elapsed: 0.001 sec  <<< ERROR!
java.lang.IllegalArgumentException: No partial converter found for type: org.joda.time.LocalDateTime
	at org.joda.time.convert.ConverterManager.getPartialConverter(ConverterManager.java:45)
	at org.joda.time.LocalDate.<init>(LocalDate.java:415)
	at org.joda.time.LocalDate.<init>(LocalDate.java:363)
	at org.joda.time.TestLocalDate_Constructors.testConstructor_ObjectLocalDateTime(TestLocalDate_Constructors.java:424)

testConstructor_ObjectLocalDate(org.joda.time.TestLocalDate_Constructors)  Time elapsed: 0 sec  <<< ERROR!
java.lang.IllegalArgumentException: No partial converter found for type: org.joda.time.LocalDate
	at org.joda.time.convert.ConverterManager.getPartialConverter(ConverterManager.java:45)
	at org.joda.time.LocalDate.<init>(LocalDate.java:415)
	at org.joda.time.LocalDate.<init>(LocalDate.java:363)
	at org.joda.time.TestLocalDate_Constructors.testConstructor_ObjectLocalDate(TestLocalDate_Constructors.java:407)

testConstructor_Object_Chronology_crossChronology(org.joda.time.TestLocalDate_Constructors)  Time elapsed: 0.001 sec  <<< ERROR!
java.lang.IllegalArgumentException: No partial converter found for type: org.joda.time.LocalDate
	at org.joda.time.convert.ConverterManager.getPartialConverter(ConverterManager.java:45)
	at org.joda.time.LocalDate.<init>(LocalDate.java:415)
	at org.joda.time.TestLocalDate_Constructors.testConstructor_Object_Chronology_crossChronology(TestLocalDate_Constructors.java:487)

testConstructor_Object1(org.joda.time.TestLocalDate_Constructors)  Time elapsed: 0.001 sec  <<< ERROR!
java.lang.IllegalArgumentException: No partial converter found for type: java.util.Date
	at org.joda.time.convert.ConverterManager.getPartialConverter(ConverterManager.java:45)
	at org.joda.time.LocalDate.<init>(LocalDate.java:415)
	at org.joda.time.LocalDate.<init>(LocalDate.java:363)
	at org.joda.time.TestLocalDate_Constructors.testConstructor_Object1(TestLocalDate_Constructors.java:317)

testConstructor_ObjectYearMonthDay(org.joda.time.TestLocalDate_Constructors)  Time elapsed: 0 sec  <<< ERROR!
java.lang.IllegalArgumentException: No partial converter found for type: org.joda.time.YearMonthDay
	at org.joda.time.convert.ConverterManager.getPartialConverter(ConverterManager.java:45)
	at org.joda.time.LocalDate.<init>(LocalDate.java:415)
	at org.joda.time.LocalDate.<init>(LocalDate.java:363)
	at org.joda.time.TestLocalDate_Constructors.testConstructor_ObjectYearMonthDay(TestLocalDate_Constructors.java:434)

testConstructor_ObjectString2(org.joda.time.TestLocalTime_Constructors)  Time elapsed: 0 sec  <<< ERROR!
java.lang.IllegalArgumentException: No partial converter found for type: java.lang.String
	at org.joda.time.convert.ConverterManager.getPartialConverter(ConverterManager.java:45)
	at org.joda.time.LocalTime.<init>(LocalTime.java:431)
	at org.joda.time.LocalTime.<init>(LocalTime.java:383)
	at org.joda.time.TestLocalTime_Constructors.testConstructor_ObjectString2(TestLocalTime_Constructors.java:392)

testConstructor_ObjectString3(org.joda.time.TestLocalTime_Constructors)  Time elapsed: 0 sec  <<< ERROR!
java.lang.IllegalArgumentException: No partial converter found for type: java.lang.String
	at org.joda.time.convert.ConverterManager.getPartialConverter(ConverterManager.java:45)
	at org.joda.time.LocalTime.<init>(LocalTime.java:431)
	at org.joda.time.LocalTime.<init>(LocalTime.java:383)
	at org.joda.time.TestLocalTime_Constructors.testConstructor_ObjectString3(TestLocalTime_Constructors.java:401)

testConstructor_ObjectString4(org.joda.time.TestLocalTime_Constructors)  Time elapsed: 0.001 sec  <<< ERROR!
java.lang.IllegalArgumentException: No partial converter found for type: java.lang.String
	at org.joda.time.convert.ConverterManager.getPartialConverter(ConverterManager.java:45)
	at org.joda.time.LocalTime.<init>(LocalTime.java:431)
	at org.joda.time.LocalTime.<init>(LocalTime.java:383)
	at org.joda.time.TestLocalTime_Constructors.testConstructor_ObjectString4(TestLocalTime_Constructors.java:410)

testConstructor_nullObject_DateTimeZone(org.joda.time.TestLocalTime_Constructors)  Time elapsed: 0 sec  <<< ERROR!
java.lang.IllegalArgumentException: No partial converter found for type: null
	at org.joda.time.convert.ConverterManager.getPartialConverter(ConverterManager.java:45)
	at org.joda.time.LocalTime.<init>(LocalTime.java:405)
	at org.joda.time.TestLocalTime_Constructors.testConstructor_nullObject_DateTimeZone(TestLocalTime_Constructors.java:531)

testConstructor_Object_nullDateTimeZone(org.joda.time.TestLocalTime_Constructors)  Time elapsed: 0 sec  <<< ERROR!
java.lang.IllegalArgumentException: No partial converter found for type: java.util.Date
	at org.joda.time.convert.ConverterManager.getPartialConverter(ConverterManager.java:45)
	at org.joda.time.LocalTime.<init>(LocalTime.java:405)
	at org.joda.time.TestLocalTime_Constructors.testConstructor_Object_nullDateTimeZone(TestLocalTime_Constructors.java:541)

testConstructor_nullObject_nullDateTimeZone(org.joda.time.TestLocalTime_Constructors)  Time elapsed: 0 sec  <<< ERROR!
java.lang.IllegalArgumentException: No partial converter found for type: null
	at org.joda.time.convert.ConverterManager.getPartialConverter(ConverterManager.java:45)
	at org.joda.time.LocalTime.<init>(LocalTime.java:405)
	at org.joda.time.TestLocalTime_Constructors.testConstructor_nullObject_nullDateTimeZone(TestLocalTime_Constructors.java:550)

testConstructor_ObjectString1(org.joda.time.TestLocalTime_Constructors)  Time elapsed: 0 sec  <<< ERROR!
java.lang.IllegalArgumentException: No partial converter found for type: java.lang.String
	at org.joda.time.convert.ConverterManager.getPartialConverter(ConverterManager.java:45)
	at org.joda.time.LocalTime.<init>(LocalTime.java:431)
	at org.joda.time.LocalTime.<init>(LocalTime.java:383)
	at org.joda.time.TestLocalTime_Constructors.testConstructor_ObjectString1(TestLocalTime_Constructors.java:363)

testConstructor_nullObject(org.joda.time.TestLocalTime_Constructors)  Time elapsed: 0.001 sec  <<< ERROR!
java.lang.IllegalArgumentException: No partial converter found for type: null
	at org.joda.time.convert.ConverterManager.getPartialConverter(ConverterManager.java:45)
	at org.joda.time.LocalTime.<init>(LocalTime.java:431)
	at org.joda.time.LocalTime.<init>(LocalTime.java:383)
	at org.joda.time.TestLocalTime_Constructors.testConstructor_nullObject(TestLocalTime_Constructors.java:354)

testConstructor_nullObject_Chronology(org.joda.time.TestLocalTime_Constructors)  Time elapsed: 0 sec  <<< ERROR!
java.lang.IllegalArgumentException: No partial converter found for type: null
	at org.joda.time.convert.ConverterManager.getPartialConverter(ConverterManager.java:45)
	at org.joda.time.LocalTime.<init>(LocalTime.java:431)
	at org.joda.time.TestLocalTime_Constructors.testConstructor_nullObject_Chronology(TestLocalTime_Constructors.java:583)

testConstructor_Object_nullChronology(org.joda.time.TestLocalTime_Constructors)  Time elapsed: 0 sec  <<< ERROR!
java.lang.IllegalArgumentException: No partial converter found for type: java.util.Date
	at org.joda.time.convert.ConverterManager.getPartialConverter(ConverterManager.java:45)
	at org.joda.time.LocalTime.<init>(LocalTime.java:431)
	at org.joda.time.TestLocalTime_Constructors.testConstructor_Object_nullChronology(TestLocalTime_Constructors.java:593)

testConstructor_nullObject_nullChronology(org.joda.time.TestLocalTime_Constructors)  Time elapsed: 0 sec  <<< ERROR!
java.lang.IllegalArgumentException: No partial converter found for type: null
	at org.joda.time.convert.ConverterManager.getPartialConverter(ConverterManager.java:45)
	at org.joda.time.LocalTime.<init>(LocalTime.java:431)
	at org.joda.time.TestLocalTime_Constructors.testConstructor_nullObject_nullChronology(TestLocalTime_Constructors.java:602)

testConstructor_ObjectLocalDateTime(org.joda.time.TestLocalTime_Constructors)  Time elapsed: 0 sec  <<< ERROR!
java.lang.IllegalArgumentException: No partial converter found for type: org.joda.time.LocalDateTime
	at org.joda.time.convert.ConverterManager.getPartialConverter(ConverterManager.java:45)
	at org.joda.time.LocalTime.<init>(LocalTime.java:431)
	at org.joda.time.LocalTime.<init>(LocalTime.java:383)
	at org.joda.time.TestLocalTime_Constructors.testConstructor_ObjectLocalDateTime(TestLocalTime_Constructors.java:480)

testConstructor_ObjectLocalTime(org.joda.time.TestLocalTime_Constructors)  Time elapsed: 0.001 sec  <<< ERROR!
java.lang.IllegalArgumentException: No partial converter found for type: org.joda.time.LocalTime
	at org.joda.time.convert.ConverterManager.getPartialConverter(ConverterManager.java:45)
	at org.joda.time.LocalTime.<init>(LocalTime.java:431)
	at org.joda.time.LocalTime.<init>(LocalTime.java:383)
	at org.joda.time.TestLocalTime_Constructors.testConstructor_ObjectLocalTime(TestLocalTime_Constructors.java:462)

testConstructor_Object1(org.joda.time.TestLocalTime_Constructors)  Time elapsed: 0 sec  <<< ERROR!
java.lang.IllegalArgumentException: No partial converter found for type: java.util.Date
	at org.joda.time.convert.ConverterManager.getPartialConverter(ConverterManager.java:45)
	at org.joda.time.LocalTime.<init>(LocalTime.java:431)
	at org.joda.time.LocalTime.<init>(LocalTime.java:383)
	at org.joda.time.TestLocalTime_Constructors.testConstructor_Object1(TestLocalTime_Constructors.java:334)

testConstructor_Object2(org.joda.time.TestLocalTime_Constructors)  Time elapsed: 0.001 sec  <<< ERROR!
java.lang.IllegalArgumentException: No partial converter found for type: java.util.GregorianCalendar
	at org.joda.time.convert.ConverterManager.getPartialConverter(ConverterManager.java:45)
	at org.joda.time.LocalTime.<init>(LocalTime.java:431)
	at org.joda.time.LocalTime.<init>(LocalTime.java:383)
	at org.joda.time.TestLocalTime_Constructors.testConstructor_Object2(TestLocalTime_Constructors.java:345)

testConstructor_ObjectString1Tokyo(org.joda.time.TestLocalTime_Constructors)  Time elapsed: 0.001 sec  <<< ERROR!
java.lang.IllegalArgumentException: No partial converter found for type: java.lang.String
	at org.joda.time.convert.ConverterManager.getPartialConverter(ConverterManager.java:45)
	at org.joda.time.LocalTime.<init>(LocalTime.java:431)
	at org.joda.time.LocalTime.<init>(LocalTime.java:383)
	at org.joda.time.TestLocalTime_Constructors.testConstructor_ObjectString1Tokyo(TestLocalTime_Constructors.java:373)

testConstructor_ObjectString1NewYork(org.joda.time.TestLocalTime_Constructors)  Time elapsed: 0 sec  <<< ERROR!
java.lang.IllegalArgumentException: No partial converter found for type: java.lang.String
	at org.joda.time.convert.ConverterManager.getPartialConverter(ConverterManager.java:45)
	at org.joda.time.LocalTime.<init>(LocalTime.java:431)
	at org.joda.time.LocalTime.<init>(LocalTime.java:383)
	at org.joda.time.TestLocalTime_Constructors.testConstructor_ObjectString1NewYork(TestLocalTime_Constructors.java:383)

testConstructor_ObjectTimeOfDay(org.joda.time.TestLocalTime_Constructors)  Time elapsed: 0.001 sec  <<< ERROR!
java.lang.IllegalArgumentException: No partial converter found for type: org.joda.time.TimeOfDay
	at org.joda.time.convert.ConverterManager.getPartialConverter(ConverterManager.java:45)
	at org.joda.time.LocalTime.<init>(LocalTime.java:431)
	at org.joda.time.LocalTime.<init>(LocalTime.java:383)
	at org.joda.time.TestLocalTime_Constructors.testConstructor_ObjectTimeOfDay(TestLocalTime_Constructors.java:491)

testConstructor_Object1_DateTimeZone(org.joda.time.TestLocalTime_Constructors)  Time elapsed: 0 sec  <<< ERROR!
java.lang.IllegalArgumentException: No partial converter found for type: java.util.Date
	at org.joda.time.convert.ConverterManager.getPartialConverter(ConverterManager.java:45)
	at org.joda.time.LocalTime.<init>(LocalTime.java:405)
	at org.joda.time.TestLocalTime_Constructors.testConstructor_Object1_DateTimeZone(TestLocalTime_Constructors.java:502)

testConstructor_ObjectString_DateTimeZoneLondon(org.joda.time.TestLocalTime_Constructors)  Time elapsed: 0.001 sec  <<< ERROR!
java.lang.IllegalArgumentException: No partial converter found for type: java.lang.String
	at org.joda.time.convert.ConverterManager.getPartialConverter(ConverterManager.java:45)
	at org.joda.time.LocalTime.<init>(LocalTime.java:405)
	at org.joda.time.TestLocalTime_Constructors.testConstructor_ObjectString_DateTimeZoneLondon(TestLocalTime_Constructors.java:511)

testConstructor_ObjectString_DateTimeZoneTokyo(org.joda.time.TestLocalTime_Constructors)  Time elapsed: 0 sec  <<< ERROR!
java.lang.IllegalArgumentException: No partial converter found for type: java.lang.String
	at org.joda.time.convert.ConverterManager.getPartialConverter(ConverterManager.java:45)
	at org.joda.time.LocalTime.<init>(LocalTime.java:405)
	at org.joda.time.TestLocalTime_Constructors.testConstructor_ObjectString_DateTimeZoneTokyo(TestLocalTime_Constructors.java:517)

testConstructor_ObjectString_DateTimeZoneNewYork(org.joda.time.TestLocalTime_Constructors)  Time elapsed: 0.004 sec  <<< ERROR!
java.lang.IllegalArgumentException: No partial converter found for type: java.lang.String
	at org.joda.time.convert.ConverterManager.getPartialConverter(ConverterManager.java:45)
	at org.joda.time.LocalTime.<init>(LocalTime.java:405)
	at org.joda.time.TestLocalTime_Constructors.testConstructor_ObjectString_DateTimeZoneNewYork(TestLocalTime_Constructors.java:524)

testConstructor_Object1_Chronology(org.joda.time.TestLocalTime_Constructors)  Time elapsed: 0 sec  <<< ERROR!
java.lang.IllegalArgumentException: No partial converter found for type: java.util.Date
	at org.joda.time.convert.ConverterManager.getPartialConverter(ConverterManager.java:45)
	at org.joda.time.LocalTime.<init>(LocalTime.java:431)
	at org.joda.time.TestLocalTime_Constructors.testConstructor_Object1_Chronology(TestLocalTime_Constructors.java:561)

testConstructor_Object2_Chronology(org.joda.time.TestLocalTime_Constructors)  Time elapsed: 0 sec  <<< ERROR!
java.lang.IllegalArgumentException: No partial converter found for type: java.lang.String
	at org.joda.time.convert.ConverterManager.getPartialConverter(ConverterManager.java:45)
	at org.joda.time.LocalTime.<init>(LocalTime.java:431)
	at org.joda.time.LocalTime.<init>(LocalTime.java:383)
	at org.joda.time.TestLocalTime_Constructors.testConstructor_Object2_Chronology(TestLocalTime_Constructors.java:570)

testConstructor_ObjectString2(org.joda.time.TestTimeOfDay_Constructors)  Time elapsed: 0 sec  <<< ERROR!
java.lang.IllegalArgumentException: No partial converter found for type: java.lang.String
	at org.joda.time.convert.ConverterManager.getPartialConverter(ConverterManager.java:45)
	at org.joda.time.base.BasePartial.<init>(BasePartial.java:159)
	at org.joda.time.TimeOfDay.<init>(TimeOfDay.java:277)
	at org.joda.time.TestTimeOfDay_Constructors.testConstructor_ObjectString2(TestTimeOfDay_Constructors.java:374)

testConstructor_ObjectString3(org.joda.time.TestTimeOfDay_Constructors)  Time elapsed: 0.001 sec  <<< ERROR!
java.lang.IllegalArgumentException: No partial converter found for type: java.lang.String
	at org.joda.time.convert.ConverterManager.getPartialConverter(ConverterManager.java:45)
	at org.joda.time.base.BasePartial.<init>(BasePartial.java:159)
	at org.joda.time.TimeOfDay.<init>(TimeOfDay.java:277)
	at org.joda.time.TestTimeOfDay_Constructors.testConstructor_ObjectString3(TestTimeOfDay_Constructors.java:383)

testConstructor_ObjectString4(org.joda.time.TestTimeOfDay_Constructors)  Time elapsed: 0 sec  <<< ERROR!
java.lang.IllegalArgumentException: No partial converter found for type: java.lang.String
	at org.joda.time.convert.ConverterManager.getPartialConverter(ConverterManager.java:45)
	at org.joda.time.base.BasePartial.<init>(BasePartial.java:159)
	at org.joda.time.TimeOfDay.<init>(TimeOfDay.java:277)
	at org.joda.time.TestTimeOfDay_Constructors.testConstructor_ObjectString4(TestTimeOfDay_Constructors.java:392)

testConstructor_ObjectString5(org.joda.time.TestTimeOfDay_Constructors)  Time elapsed: 0 sec  <<< ERROR!
java.lang.IllegalArgumentException: No partial converter found for type: java.lang.String
	at org.joda.time.convert.ConverterManager.getPartialConverter(ConverterManager.java:45)
	at org.joda.time.base.BasePartial.<init>(BasePartial.java:159)
	at org.joda.time.TimeOfDay.<init>(TimeOfDay.java:277)
	at org.joda.time.TestTimeOfDay_Constructors.testConstructor_ObjectString5(TestTimeOfDay_Constructors.java:401)

testConstructor_ObjectString6(org.joda.time.TestTimeOfDay_Constructors)  Time elapsed: 0.001 sec  <<< ERROR!
java.lang.IllegalArgumentException: No partial converter found for type: java.lang.String
	at org.joda.time.convert.ConverterManager.getPartialConverter(ConverterManager.java:45)
	at org.joda.time.base.BasePartial.<init>(BasePartial.java:159)
	at org.joda.time.TimeOfDay.<init>(TimeOfDay.java:277)
	at org.joda.time.TestTimeOfDay_Constructors.testConstructor_ObjectString6(TestTimeOfDay_Constructors.java:410)

testConstructor_ObjectString1(org.joda.time.TestTimeOfDay_Constructors)  Time elapsed: 0 sec  <<< ERROR!
java.lang.IllegalArgumentException: No partial converter found for type: java.lang.String
	at org.joda.time.convert.ConverterManager.getPartialConverter(ConverterManager.java:45)
	at org.joda.time.base.BasePartial.<init>(BasePartial.java:159)
	at org.joda.time.TimeOfDay.<init>(TimeOfDay.java:277)
	at org.joda.time.TestTimeOfDay_Constructors.testConstructor_ObjectString1(TestTimeOfDay_Constructors.java:365)

testConstructor_nullObject(org.joda.time.TestTimeOfDay_Constructors)  Time elapsed: 0.001 sec  <<< ERROR!
java.lang.IllegalArgumentException: No partial converter found for type: null
	at org.joda.time.convert.ConverterManager.getPartialConverter(ConverterManager.java:45)
	at org.joda.time.base.BasePartial.<init>(BasePartial.java:159)
	at org.joda.time.TimeOfDay.<init>(TimeOfDay.java:277)
	at org.joda.time.TestTimeOfDay_Constructors.testConstructor_nullObject(TestTimeOfDay_Constructors.java:343)

testConstructor_Object_Chronology(org.joda.time.TestTimeOfDay_Constructors)  Time elapsed: 0 sec  <<< ERROR!
java.lang.IllegalArgumentException: No partial converter found for type: java.util.Date
	at org.joda.time.convert.ConverterManager.getPartialConverter(ConverterManager.java:45)
	at org.joda.time.base.BasePartial.<init>(BasePartial.java:159)
	at org.joda.time.TimeOfDay.<init>(TimeOfDay.java:302)
	at org.joda.time.TestTimeOfDay_Constructors.testConstructor_Object_Chronology(TestTimeOfDay_Constructors.java:452)

testConstructor_nullObject_Chronology(org.joda.time.TestTimeOfDay_Constructors)  Time elapsed: 0.001 sec  <<< ERROR!
java.lang.IllegalArgumentException: No partial converter found for type: null
	at org.joda.time.convert.ConverterManager.getPartialConverter(ConverterManager.java:45)
	at org.joda.time.base.BasePartial.<init>(BasePartial.java:159)
	at org.joda.time.TimeOfDay.<init>(TimeOfDay.java:302)
	at org.joda.time.TestTimeOfDay_Constructors.testConstructor_nullObject_Chronology(TestTimeOfDay_Constructors.java:480)

testConstructor_Object_nullChronology(org.joda.time.TestTimeOfDay_Constructors)  Time elapsed: 0 sec  <<< ERROR!
java.lang.IllegalArgumentException: No partial converter found for type: java.util.Date
	at org.joda.time.convert.ConverterManager.getPartialConverter(ConverterManager.java:45)
	at org.joda.time.base.BasePartial.<init>(BasePartial.java:159)
	at org.joda.time.TimeOfDay.<init>(TimeOfDay.java:302)
	at org.joda.time.TestTimeOfDay_Constructors.testConstructor_Object_nullChronology(TestTimeOfDay_Constructors.java:493)

testConstructor_nullObject_nullChronology(org.joda.time.TestTimeOfDay_Constructors)  Time elapsed: 0 sec  <<< ERROR!
java.lang.IllegalArgumentException: No partial converter found for type: null
	at org.joda.time.convert.ConverterManager.getPartialConverter(ConverterManager.java:45)
	at org.joda.time.base.BasePartial.<init>(BasePartial.java:159)
	at org.joda.time.TimeOfDay.<init>(TimeOfDay.java:302)
	at org.joda.time.TestTimeOfDay_Constructors.testConstructor_nullObject_nullChronology(TestTimeOfDay_Constructors.java:505)

testConstructor_Object1(org.joda.time.TestTimeOfDay_Constructors)  Time elapsed: 0.001 sec  <<< ERROR!
java.lang.IllegalArgumentException: No partial converter found for type: java.util.Date
	at org.joda.time.convert.ConverterManager.getPartialConverter(ConverterManager.java:45)
	at org.joda.time.base.BasePartial.<init>(BasePartial.java:159)
	at org.joda.time.TimeOfDay.<init>(TimeOfDay.java:277)
	at org.joda.time.TestTimeOfDay_Constructors.testConstructor_Object1(TestTimeOfDay_Constructors.java:317)

testConstructor_Object2(org.joda.time.TestTimeOfDay_Constructors)  Time elapsed: 0 sec  <<< ERROR!
java.lang.IllegalArgumentException: No partial converter found for type: java.util.GregorianCalendar
	at org.joda.time.convert.ConverterManager.getPartialConverter(ConverterManager.java:45)
	at org.joda.time.base.BasePartial.<init>(BasePartial.java:159)
	at org.joda.time.TimeOfDay.<init>(TimeOfDay.java:277)
	at org.joda.time.TestTimeOfDay_Constructors.testConstructor_Object2(TestTimeOfDay_Constructors.java:331)

testConstructor2_Object_Chronology(org.joda.time.TestTimeOfDay_Constructors)  Time elapsed: 0.001 sec  <<< ERROR!
java.lang.IllegalArgumentException: No partial converter found for type: java.lang.String
	at org.joda.time.convert.ConverterManager.getPartialConverter(ConverterManager.java:45)
	at org.joda.time.base.BasePartial.<init>(BasePartial.java:159)
	at org.joda.time.TimeOfDay.<init>(TimeOfDay.java:277)
	at org.joda.time.TestTimeOfDay_Constructors.testConstructor2_Object_Chronology(TestTimeOfDay_Constructors.java:464)

testConstructor_todObject(org.joda.time.TestTimeOfDay_Constructors)  Time elapsed: 0.001 sec  <<< ERROR!
java.lang.IllegalArgumentException: No partial converter found for type: org.joda.time.TimeOfDay
	at org.joda.time.convert.ConverterManager.getPartialConverter(ConverterManager.java:45)
	at org.joda.time.base.BasePartial.<init>(BasePartial.java:159)
	at org.joda.time.TimeOfDay.<init>(TimeOfDay.java:277)
	at org.joda.time.TestTimeOfDay_Constructors.testConstructor_todObject(TestTimeOfDay_Constructors.java:356)

testConstructor_ObjectString2(org.joda.time.TestYearMonthDay_Constructors)  Time elapsed: 0.001 sec  <<< ERROR!
java.lang.IllegalArgumentException: No partial converter found for type: java.lang.String
	at org.joda.time.convert.ConverterManager.getPartialConverter(ConverterManager.java:45)
	at org.joda.time.base.BasePartial.<init>(BasePartial.java:159)
	at org.joda.time.YearMonthDay.<init>(YearMonthDay.java:231)
	at org.joda.time.TestYearMonthDay_Constructors.testConstructor_ObjectString2(TestYearMonthDay_Constructors.java:258)

testConstructor_ObjectString3(org.joda.time.TestYearMonthDay_Constructors)  Time elapsed: 0 sec  <<< ERROR!
java.lang.IllegalArgumentException: No partial converter found for type: java.lang.String
	at org.joda.time.convert.ConverterManager.getPartialConverter(ConverterManager.java:45)
	at org.joda.time.base.BasePartial.<init>(BasePartial.java:159)
	at org.joda.time.YearMonthDay.<init>(YearMonthDay.java:231)
	at org.joda.time.TestYearMonthDay_Constructors.testConstructor_ObjectString3(TestYearMonthDay_Constructors.java:266)

testConstructor_ObjectString4(org.joda.time.TestYearMonthDay_Constructors)  Time elapsed: 0.001 sec  <<< ERROR!
java.lang.IllegalArgumentException: No partial converter found for type: java.lang.String
	at org.joda.time.convert.ConverterManager.getPartialConverter(ConverterManager.java:45)
	at org.joda.time.base.BasePartial.<init>(BasePartial.java:159)
	at org.joda.time.YearMonthDay.<init>(YearMonthDay.java:231)
	at org.joda.time.TestYearMonthDay_Constructors.testConstructor_ObjectString4(TestYearMonthDay_Constructors.java:274)

testConstructor_ObjectString5(org.joda.time.TestYearMonthDay_Constructors)  Time elapsed: 0 sec  <<< ERROR!
java.lang.IllegalArgumentException: No partial converter found for type: java.lang.String
	at org.joda.time.convert.ConverterManager.getPartialConverter(ConverterManager.java:45)
	at org.joda.time.base.BasePartial.<init>(BasePartial.java:159)
	at org.joda.time.YearMonthDay.<init>(YearMonthDay.java:231)
	at org.joda.time.TestYearMonthDay_Constructors.testConstructor_ObjectString5(TestYearMonthDay_Constructors.java:282)

testConstructor_ObjectString1(org.joda.time.TestYearMonthDay_Constructors)  Time elapsed: 0.001 sec  <<< ERROR!
java.lang.IllegalArgumentException: No partial converter found for type: java.lang.String
	at org.joda.time.convert.ConverterManager.getPartialConverter(ConverterManager.java:45)
	at org.joda.time.base.BasePartial.<init>(BasePartial.java:159)
	at org.joda.time.YearMonthDay.<init>(YearMonthDay.java:231)
	at org.joda.time.TestYearMonthDay_Constructors.testConstructor_ObjectString1(TestYearMonthDay_Constructors.java:250)

testConstructor_Object(org.joda.time.TestYearMonthDay_Constructors)  Time elapsed: 0.001 sec  <<< ERROR!
java.lang.IllegalArgumentException: No partial converter found for type: java.util.Date
	at org.joda.time.convert.ConverterManager.getPartialConverter(ConverterManager.java:45)
	at org.joda.time.base.BasePartial.<init>(BasePartial.java:159)
	at org.joda.time.YearMonthDay.<init>(YearMonthDay.java:231)
	at org.joda.time.TestYearMonthDay_Constructors.testConstructor_Object(TestYearMonthDay_Constructors.java:234)

testConstructor_nullObject(org.joda.time.TestYearMonthDay_Constructors)  Time elapsed: 0 sec  <<< ERROR!
java.lang.IllegalArgumentException: No partial converter found for type: null
	at org.joda.time.convert.ConverterManager.getPartialConverter(ConverterManager.java:45)
	at org.joda.time.base.BasePartial.<init>(BasePartial.java:159)
	at org.joda.time.YearMonthDay.<init>(YearMonthDay.java:231)
	at org.joda.time.TestYearMonthDay_Constructors.testConstructor_nullObject(TestYearMonthDay_Constructors.java:242)

testConstructor_Object_Chronology(org.joda.time.TestYearMonthDay_Constructors)  Time elapsed: 0.001 sec  <<< ERROR!
java.lang.IllegalArgumentException: No partial converter found for type: java.util.Date
	at org.joda.time.convert.ConverterManager.getPartialConverter(ConverterManager.java:45)
	at org.joda.time.base.BasePartial.<init>(BasePartial.java:159)
	at org.joda.time.YearMonthDay.<init>(YearMonthDay.java:256)
	at org.joda.time.TestYearMonthDay_Constructors.testConstructor_Object_Chronology(TestYearMonthDay_Constructors.java:331)

testConstructor_nullObject_Chronology(org.joda.time.TestYearMonthDay_Constructors)  Time elapsed: 0.001 sec  <<< ERROR!
java.lang.IllegalArgumentException: No partial converter found for type: null
	at org.joda.time.convert.ConverterManager.getPartialConverter(ConverterManager.java:45)
	at org.joda.time.base.BasePartial.<init>(BasePartial.java:159)
	at org.joda.time.YearMonthDay.<init>(YearMonthDay.java:256)
	at org.joda.time.TestYearMonthDay_Constructors.testConstructor_nullObject_Chronology(TestYearMonthDay_Constructors.java:342)

testConstructor_Object_nullChronology(org.joda.time.TestYearMonthDay_Constructors)  Time elapsed: 0 sec  <<< ERROR!
java.lang.IllegalArgumentException: No partial converter found for type: java.util.Date
	at org.joda.time.convert.ConverterManager.getPartialConverter(ConverterManager.java:45)
	at org.joda.time.base.BasePartial.<init>(BasePartial.java:159)
	at org.joda.time.YearMonthDay.<init>(YearMonthDay.java:256)
	at org.joda.time.TestYearMonthDay_Constructors.testConstructor_Object_nullChronology(TestYearMonthDay_Constructors.java:354)

testConstructor_nullObject_nullChronology(org.joda.time.TestYearMonthDay_Constructors)  Time elapsed: 0.001 sec  <<< ERROR!
java.lang.IllegalArgumentException: No partial converter found for type: null
	at org.joda.time.convert.ConverterManager.getPartialConverter(ConverterManager.java:45)
	at org.joda.time.base.BasePartial.<init>(BasePartial.java:159)
	at org.joda.time.YearMonthDay.<init>(YearMonthDay.java:256)
	at org.joda.time.TestYearMonthDay_Constructors.testConstructor_nullObject_nullChronology(TestYearMonthDay_Constructors.java:365)

testConstructor_ObjectString5(org.joda.time.TestYearMonth_Constructors)  Time elapsed: 0.001 sec  <<< ERROR!
java.lang.IllegalArgumentException: No partial converter found for type: java.lang.String
	at org.joda.time.convert.ConverterManager.getPartialConverter(ConverterManager.java:45)
	at org.joda.time.base.BasePartial.<init>(BasePartial.java:159)
	at org.joda.time.YearMonth.<init>(YearMonth.java:289)
	at org.joda.time.TestYearMonth_Constructors.testConstructor_ObjectString5(TestYearMonth_Constructors.java:260)

testConstructor_ObjectString1(org.joda.time.TestYearMonth_Constructors)  Time elapsed: 0 sec  <<< ERROR!
java.lang.IllegalArgumentException: No partial converter found for type: java.lang.String
	at org.joda.time.convert.ConverterManager.getPartialConverter(ConverterManager.java:45)
	at org.joda.time.base.BasePartial.<init>(BasePartial.java:159)
	at org.joda.time.YearMonth.<init>(YearMonth.java:289)
	at org.joda.time.TestYearMonth_Constructors.testConstructor_ObjectString1(TestYearMonth_Constructors.java:253)

testConstructor_Object(org.joda.time.TestYearMonth_Constructors)  Time elapsed: 0 sec  <<< ERROR!
java.lang.IllegalArgumentException: No partial converter found for type: java.util.Date
	at org.joda.time.convert.ConverterManager.getPartialConverter(ConverterManager.java:45)
	at org.joda.time.base.BasePartial.<init>(BasePartial.java:159)
	at org.joda.time.YearMonth.<init>(YearMonth.java:289)
	at org.joda.time.TestYearMonth_Constructors.testConstructor_Object(TestYearMonth_Constructors.java:239)

testConstructor_nullObject(org.joda.time.TestYearMonth_Constructors)  Time elapsed: 0 sec  <<< ERROR!
java.lang.IllegalArgumentException: No partial converter found for type: null
	at org.joda.time.convert.ConverterManager.getPartialConverter(ConverterManager.java:45)
	at org.joda.time.base.BasePartial.<init>(BasePartial.java:159)
	at org.joda.time.YearMonth.<init>(YearMonth.java:289)
	at org.joda.time.TestYearMonth_Constructors.testConstructor_nullObject(TestYearMonth_Constructors.java:246)

testConstructor_Object_Chronology(org.joda.time.TestYearMonth_Constructors)  Time elapsed: 0 sec  <<< ERROR!
java.lang.IllegalArgumentException: No partial converter found for type: java.util.Date
	at org.joda.time.convert.ConverterManager.getPartialConverter(ConverterManager.java:45)
	at org.joda.time.base.BasePartial.<init>(BasePartial.java:159)
	at org.joda.time.YearMonth.<init>(YearMonth.java:311)
	at org.joda.time.TestYearMonth_Constructors.testConstructor_Object_Chronology(TestYearMonth_Constructors.java:308)

testConstructor_nullObject_Chronology(org.joda.time.TestYearMonth_Constructors)  Time elapsed: 0 sec  <<< ERROR!
java.lang.IllegalArgumentException: No partial converter found for type: null
	at org.joda.time.convert.ConverterManager.getPartialConverter(ConverterManager.java:45)
	at org.joda.time.base.BasePartial.<init>(BasePartial.java:159)
	at org.joda.time.YearMonth.<init>(YearMonth.java:311)
	at org.joda.time.TestYearMonth_Constructors.testConstructor_nullObject_Chronology(TestYearMonth_Constructors.java:318)

testConstructor_Object_nullChronology(org.joda.time.TestYearMonth_Constructors)  Time elapsed: 0 sec  <<< ERROR!
java.lang.IllegalArgumentException: No partial converter found for type: java.util.Date
	at org.joda.time.convert.ConverterManager.getPartialConverter(ConverterManager.java:45)
	at org.joda.time.base.BasePartial.<init>(BasePartial.java:159)
	at org.joda.time.YearMonth.<init>(YearMonth.java:311)
	at org.joda.time.TestYearMonth_Constructors.testConstructor_Object_nullChronology(TestYearMonth_Constructors.java:329)

testConstructor_nullObject_nullChronology(org.joda.time.TestYearMonth_Constructors)  Time elapsed: 0 sec  <<< ERROR!
java.lang.IllegalArgumentException: No partial converter found for type: null
	at org.joda.time.convert.ConverterManager.getPartialConverter(ConverterManager.java:45)
	at org.joda.time.base.BasePartial.<init>(BasePartial.java:159)
	at org.joda.time.YearMonth.<init>(YearMonth.java:311)
	at org.joda.time.TestYearMonth_Constructors.testConstructor_nullObject_nullChronology(TestYearMonth_Constructors.java:339)

testConstructor_ObjectString5(org.joda.time.TestMonthDay_Constructors)  Time elapsed: 0 sec  <<< ERROR!
java.lang.IllegalArgumentException: No partial converter found for type: java.lang.String
	at org.joda.time.convert.ConverterManager.getPartialConverter(ConverterManager.java:45)
	at org.joda.time.base.BasePartial.<init>(BasePartial.java:159)
	at org.joda.time.MonthDay.<init>(MonthDay.java:297)
	at org.joda.time.TestMonthDay_Constructors.testConstructor_ObjectString5(TestMonthDay_Constructors.java:260)

testConstructor_ObjectString1(org.joda.time.TestMonthDay_Constructors)  Time elapsed: 0 sec  <<< ERROR!
java.lang.IllegalArgumentException: No partial converter found for type: java.lang.String
	at org.joda.time.convert.ConverterManager.getPartialConverter(ConverterManager.java:45)
	at org.joda.time.base.BasePartial.<init>(BasePartial.java:159)
	at org.joda.time.MonthDay.<init>(MonthDay.java:297)
	at org.joda.time.TestMonthDay_Constructors.testConstructor_ObjectString1(TestMonthDay_Constructors.java:253)

testConstructor_Object(org.joda.time.TestMonthDay_Constructors)  Time elapsed: 0 sec  <<< ERROR!
java.lang.IllegalArgumentException: No partial converter found for type: java.util.Date
	at org.joda.time.convert.ConverterManager.getPartialConverter(ConverterManager.java:45)
	at org.joda.time.base.BasePartial.<init>(BasePartial.java:159)
	at org.joda.time.MonthDay.<init>(MonthDay.java:297)
	at org.joda.time.TestMonthDay_Constructors.testConstructor_Object(TestMonthDay_Constructors.java:239)

testConstructor_nullObject(org.joda.time.TestMonthDay_Constructors)  Time elapsed: 0 sec  <<< ERROR!
java.lang.IllegalArgumentException: No partial converter found for type: null
	at org.joda.time.convert.ConverterManager.getPartialConverter(ConverterManager.java:45)
	at org.joda.time.base.BasePartial.<init>(BasePartial.java:159)
	at org.joda.time.MonthDay.<init>(MonthDay.java:297)
	at org.joda.time.TestMonthDay_Constructors.testConstructor_nullObject(TestMonthDay_Constructors.java:246)

testConstructor_Object_Chronology(org.joda.time.TestMonthDay_Constructors)  Time elapsed: 0 sec  <<< ERROR!
java.lang.IllegalArgumentException: No partial converter found for type: java.util.Date
	at org.joda.time.convert.ConverterManager.getPartialConverter(ConverterManager.java:45)
	at org.joda.time.base.BasePartial.<init>(BasePartial.java:159)
	at org.joda.time.MonthDay.<init>(MonthDay.java:319)
	at org.joda.time.TestMonthDay_Constructors.testConstructor_Object_Chronology(TestMonthDay_Constructors.java:308)

testConstructor_nullObject_Chronology(org.joda.time.TestMonthDay_Constructors)  Time elapsed: 0.001 sec  <<< ERROR!
java.lang.IllegalArgumentException: No partial converter found for type: null
	at org.joda.time.convert.ConverterManager.getPartialConverter(ConverterManager.java:45)
	at org.joda.time.base.BasePartial.<init>(BasePartial.java:159)
	at org.joda.time.MonthDay.<init>(MonthDay.java:319)
	at org.joda.time.TestMonthDay_Constructors.testConstructor_nullObject_Chronology(TestMonthDay_Constructors.java:318)

testConstructor_Object_nullChronology(org.joda.time.TestMonthDay_Constructors)  Time elapsed: 0 sec  <<< ERROR!
java.lang.IllegalArgumentException: No partial converter found for type: java.util.Date
	at org.joda.time.convert.ConverterManager.getPartialConverter(ConverterManager.java:45)
	at org.joda.time.base.BasePartial.<init>(BasePartial.java:159)
	at org.joda.time.MonthDay.<init>(MonthDay.java:319)
	at org.joda.time.TestMonthDay_Constructors.testConstructor_Object_nullChronology(TestMonthDay_Constructors.java:329)

testConstructor_nullObject_nullChronology(org.joda.time.TestMonthDay_Constructors)  Time elapsed: 0.001 sec  <<< ERROR!
java.lang.IllegalArgumentException: No partial converter found for type: null
	at org.joda.time.convert.ConverterManager.getPartialConverter(ConverterManager.java:45)
	at org.joda.time.base.BasePartial.<init>(BasePartial.java:159)
	at org.joda.time.MonthDay.<init>(MonthDay.java:319)
	at org.joda.time.TestMonthDay_Constructors.testConstructor_nullObject_nullChronology(TestMonthDay_Constructors.java:339)

testCutoverAddYears(org.joda.time.chrono.TestGJChronology)  Time elapsed: 0 sec  <<< ERROR!
java.lang.IllegalArgumentException: No partial converter found for type: java.lang.String
	at org.joda.time.convert.ConverterManager.getPartialConverter(ConverterManager.java:45)
	at org.joda.time.base.BasePartial.<init>(BasePartial.java:159)
	at org.joda.time.YearMonthDay.<init>(YearMonthDay.java:256)
	at org.joda.time.chrono.TestGJChronology.testAdd(TestGJChronology.java:494)
	at org.joda.time.chrono.TestGJChronology.testCutoverAddYears(TestGJChronology.java:381)

testCutoverAddMonths(org.joda.time.chrono.TestGJChronology)  Time elapsed: 0.001 sec  <<< ERROR!
java.lang.IllegalArgumentException: No partial converter found for type: java.lang.String
	at org.joda.time.convert.ConverterManager.getPartialConverter(ConverterManager.java:45)
	at org.joda.time.base.BasePartial.<init>(BasePartial.java:159)
	at org.joda.time.YearMonthDay.<init>(YearMonthDay.java:256)
	at org.joda.time.chrono.TestGJChronology.testAdd(TestGJChronology.java:494)
	at org.joda.time.chrono.TestGJChronology.testCutoverAddMonths(TestGJChronology.java:422)

testCutoverAddDays(org.joda.time.chrono.TestGJChronology)  Time elapsed: 0.001 sec  <<< ERROR!
java.lang.IllegalArgumentException: No partial converter found for type: java.lang.String
	at org.joda.time.convert.ConverterManager.getPartialConverter(ConverterManager.java:45)
	at org.joda.time.base.BasePartial.<init>(BasePartial.java:159)
	at org.joda.time.YearMonthDay.<init>(YearMonthDay.java:256)
	at org.joda.time.chrono.TestGJChronology.testAdd(TestGJChronology.java:494)
	at org.joda.time.chrono.TestGJChronology.testCutoverAddDays(TestGJChronology.java:452)

testYearEndAddDays(org.joda.time.chrono.TestGJChronology)  Time elapsed: 0 sec  <<< ERROR!
java.lang.IllegalArgumentException: No partial converter found for type: java.lang.String
	at org.joda.time.convert.ConverterManager.getPartialConverter(ConverterManager.java:45)
	at org.joda.time.base.BasePartial.<init>(BasePartial.java:159)
	at org.joda.time.YearMonthDay.<init>(YearMonthDay.java:256)
	at org.joda.time.chrono.TestGJChronology.testAdd(TestGJChronology.java:494)
	at org.joda.time.chrono.TestGJChronology.testYearEndAddDays(TestGJChronology.java:462)

testPartialGetAsText(org.joda.time.chrono.TestGJChronology)  Time elapsed: 0.001 sec  <<< ERROR!
java.lang.IllegalArgumentException: No partial converter found for type: java.lang.String
	at org.joda.time.convert.ConverterManager.getPartialConverter(ConverterManager.java:45)
	at org.joda.time.base.BasePartial.<init>(BasePartial.java:159)
	at org.joda.time.YearMonthDay.<init>(YearMonthDay.java:256)
	at org.joda.time.chrono.TestGJChronology.testPartialGetAsText(TestGJChronology.java:523)

testAddMonths(org.joda.time.chrono.TestISOChronology)  Time elapsed: 0.001 sec  <<< ERROR!
java.lang.IllegalArgumentException: No partial converter found for type: java.lang.String
	at org.joda.time.convert.ConverterManager.getPartialConverter(ConverterManager.java:45)
	at org.joda.time.base.BasePartial.<init>(BasePartial.java:159)
	at org.joda.time.YearMonthDay.<init>(YearMonthDay.java:256)
	at org.joda.time.chrono.TestISOChronology.testAdd(TestISOChronology.java:423)
	at org.joda.time.chrono.TestISOChronology.testAddMonths(TestISOChronology.java:394)

testCutoverAddYears(org.joda.time.chrono.TestISOChronology)  Time elapsed: 0 sec  <<< ERROR!
java.lang.IllegalArgumentException: No partial converter found for type: java.lang.String
	at org.joda.time.convert.ConverterManager.getPartialConverter(ConverterManager.java:45)
	at org.joda.time.base.BasePartial.<init>(BasePartial.java:159)
	at org.joda.time.YearMonthDay.<init>(YearMonthDay.java:256)
	at org.joda.time.chrono.TestISOChronology.testAdd(TestISOChronology.java:423)
	at org.joda.time.chrono.TestISOChronology.testCutoverAddYears(TestISOChronology.java:376)

testAddPartialConverter1(org.joda.time.convert.TestConverterManager)  Time elapsed: 0.002 sec  <<< ERROR!
java.lang.IllegalArgumentException: No partial converter found for type: java.lang.Boolean
	at org.joda.time.convert.ConverterManager.getPartialConverter(ConverterManager.java:45)
	at org.joda.time.convert.TestConverterManager.testAddPartialConverter1(TestConverterManager.java:433)

testAddPartialConverter2(org.joda.time.convert.TestConverterManager)  Time elapsed: 0.001 sec  <<< ERROR!
java.lang.IllegalArgumentException: No partial converter found for type: java.lang.String
	at org.joda.time.convert.ConverterManager.getPartialConverter(ConverterManager.java:45)
	at org.joda.time.convert.TestConverterManager.testAddPartialConverter2(TestConverterManager.java:452)

testGetPartialConverter(org.joda.time.convert.TestConverterManager)  Time elapsed: 0 sec  <<< ERROR!
java.lang.IllegalArgumentException: No partial converter found for type: java.lang.Long
	at org.joda.time.convert.ConverterManager.getPartialConverter(ConverterManager.java:45)
	at org.joda.time.convert.TestConverterManager.testGetPartialConverter(TestConverterManager.java:334)

testGetPartialConverterRemovedNull(org.joda.time.convert.TestConverterManager)  Time elapsed: 0.001 sec  <<< FAILURE!
junit.framework.AssertionFailedError
	at junit.framework.Assert.fail(Assert.java:47)
	at junit.framework.Assert.fail(Assert.java:53)
	at org.joda.time.convert.TestConverterManager.testGetPartialConverterRemovedNull(TestConverterManager.java:366)

testGetPartialConverterOKMultipleMatches(org.joda.time.convert.TestConverterManager)  Time elapsed: 0.001 sec  <<< ERROR!
java.lang.IllegalArgumentException: No partial converter found for type: org.joda.time.DateTime
	at org.joda.time.convert.ConverterManager.getPartialConverter(ConverterManager.java:45)
	at org.joda.time.convert.TestConverterManager.testGetPartialConverterOKMultipleMatches(TestConverterManager.java:384)


Results :

Failed tests: 
  org.joda.time.convert.TestConverterManager#testGetPartialConverterRemovedNull AssertionFailedError
Tests in error: 
  org.joda.time.TestLocalDateTime_Constructors#testConstructor_Object1 IllegalArgumentException
  org.joda.time.TestLocalDateTime_Constructors#testConstructor_ObjectLocalDateTime IllegalArgumentException
  org.joda.time.TestLocalDateTime_Constructors#testConstructor_ObjectString1 IllegalArgumentException
  org.joda.time.TestLocalDateTime_Constructors#testConstructor_ObjectString2 IllegalArgumentException
  org.joda.time.TestLocalDateTime_Constructors#testConstructor_ObjectString3 IllegalArgumentException
  org.joda.time.TestLocalDateTime_Constructors#testConstructor_ObjectString4 IllegalArgumentException
  org.joda.time.TestLocalDateTime_Constructors#testConstructor_Object_Chronology IllegalArgumentException
  org.joda.time.TestLocalDateTime_Constructors#testConstructor_Object_ChronologyMoscow IllegalArgumentException
  org.joda.time.TestLocalDateTime_Constructors#testConstructor_Object_ChronologyMoscowBadDateTime IllegalArgumentException
  org.joda.time.TestLocalDateTime_Constructors#testConstructor_Object_Chronology_crossChronology IllegalArgumentException
  org.joda.time.TestLocalDateTime_Constructors#testConstructor_Object_DateTimeZone IllegalArgumentException
  org.joda.time.TestLocalDateTime_Constructors#testConstructor_Object_DateTimeZoneMoscow IllegalArgumentException
  org.joda.time.TestLocalDateTime_Constructors#testConstructor_Object_DateTimeZoneMoscowBadDateTime IllegalArgumentException
  org.joda.time.TestLocalDateTime_Constructors#testConstructor_Object_nullChronology IllegalArgumentException
  org.joda.time.TestLocalDateTime_Constructors#testConstructor_Object_nullDateTimeZone IllegalArgumentException
  org.joda.time.TestLocalDateTime_Constructors#testConstructor_nullObject IllegalArgumentException
  org.joda.time.TestLocalDateTime_Constructors#testConstructor_nullObject_Chronology IllegalArgumentException
  org.joda.time.TestLocalDateTime_Constructors#testConstructor_nullObject_DateTimeZone IllegalArgumentException
  org.joda.time.TestLocalDateTime_Constructors#testConstructor_nullObject_nullChronology IllegalArgumentException
  org.joda.time.TestLocalDateTime_Constructors#testConstructor_nullObject_nullDateTimeZone IllegalArgumentException
  org.joda.time.TestLocalDate_Constructors#testConstructor_Object1 IllegalArgumentException
  org.joda.time.TestLocalDate_Constructors#testConstructor_ObjectLocalDate IllegalArgumentException
  org.joda.time.TestLocalDate_Constructors#testConstructor_ObjectLocalDateTime IllegalArgumentException
  org.joda.time.TestLocalDate_Constructors#testConstructor_ObjectString1 IllegalArgumentException
  org.joda.time.TestLocalDate_Constructors#testConstructor_ObjectString2 IllegalArgumentException
  org.joda.time.TestLocalDate_Constructors#testConstructor_ObjectString3 IllegalArgumentException
  org.joda.time.TestLocalDate_Constructors#testConstructor_ObjectYearMonthDay IllegalArgumentException
  org.joda.time.TestLocalDate_Constructors#testConstructor_Object_Chronology IllegalArgumentException
  org.joda.time.TestLocalDate_Constructors#testConstructor_Object_Chronology_crossChronology IllegalArgumentException
  org.joda.time.TestLocalDate_Constructors#testConstructor_Object_DateTimeZone IllegalArgumentException
  org.joda.time.TestLocalDate_Constructors#testConstructor_Object_nullChronology IllegalArgumentException
  org.joda.time.TestLocalDate_Constructors#testConstructor_Object_nullDateTimeZone IllegalArgumentException
  org.joda.time.TestLocalDate_Constructors#testConstructor_nullObject IllegalArgumentException
  org.joda.time.TestLocalDate_Constructors#testConstructor_nullObject_Chronology IllegalArgumentException
  org.joda.time.TestLocalDate_Constructors#testConstructor_nullObject_DateTimeZone IllegalArgumentException
  org.joda.time.TestLocalDate_Constructors#testConstructor_nullObject_nullChronology IllegalArgumentException
  org.joda.time.TestLocalDate_Constructors#testConstructor_nullObject_nullDateTimeZone IllegalArgumentException
  org.joda.time.TestLocalTime_Constructors#testConstructor_Object1 IllegalArgumentException
  org.joda.time.TestLocalTime_Constructors#testConstructor_Object1_Chronology IllegalArgumentException
  org.joda.time.TestLocalTime_Constructors#testConstructor_Object1_DateTimeZone IllegalArgumentException
  org.joda.time.TestLocalTime_Constructors#testConstructor_Object2 IllegalArgumentException
  org.joda.time.TestLocalTime_Constructors#testConstructor_Object2_Chronology IllegalArgumentException
  org.joda.time.TestLocalTime_Constructors#testConstructor_ObjectLocalDateTime IllegalArgumentException
  org.joda.time.TestLocalTime_Constructors#testConstructor_ObjectLocalTime IllegalArgumentException
  org.joda.time.TestLocalTime_Constructors#testConstructor_ObjectString1 IllegalArgumentException
  org.joda.time.TestLocalTime_Constructors#testConstructor_ObjectString1NewYork IllegalArgumentException
  org.joda.time.TestLocalTime_Constructors#testConstructor_ObjectString1Tokyo IllegalArgumentException
  org.joda.time.TestLocalTime_Constructors#testConstructor_ObjectString2 IllegalArgumentException
  org.joda.time.TestLocalTime_Constructors#testConstructor_ObjectString3 IllegalArgumentException
  org.joda.time.TestLocalTime_Constructors#testConstructor_ObjectString4 IllegalArgumentException
  org.joda.time.TestLocalTime_Constructors#testConstructor_ObjectString_DateTimeZoneLondon IllegalArgumentException
  org.joda.time.TestLocalTime_Constructors#testConstructor_ObjectString_DateTimeZoneNewYork IllegalArgumentException
  org.joda.time.TestLocalTime_Constructors#testConstructor_ObjectString_DateTimeZoneTokyo IllegalArgumentException
  org.joda.time.TestLocalTime_Constructors#testConstructor_ObjectTimeOfDay IllegalArgumentException
  org.joda.time.TestLocalTime_Constructors#testConstructor_Object_nullChronology IllegalArgumentException
  org.joda.time.TestLocalTime_Constructors#testConstructor_Object_nullDateTimeZone IllegalArgumentException
  org.joda.time.TestLocalTime_Constructors#testConstructor_nullObject IllegalArgumentException
  org.joda.time.TestLocalTime_Constructors#testConstructor_nullObject_Chronology IllegalArgumentException
  org.joda.time.TestLocalTime_Constructors#testConstructor_nullObject_DateTimeZone IllegalArgumentException
  org.joda.time.TestLocalTime_Constructors#testConstructor_nullObject_nullChronology IllegalArgumentException
  org.joda.time.TestLocalTime_Constructors#testConstructor_nullObject_nullDateTimeZone IllegalArgumentException
  org.joda.time.TestMonthDay_Constructors#testConstructor_Object IllegalArgumentException
  org.joda.time.TestMonthDay_Constructors#testConstructor_ObjectString1 IllegalArgumentException
  org.joda.time.TestMonthDay_Constructors#testConstructor_ObjectString5 IllegalArgumentException
  org.joda.time.TestMonthDay_Constructors#testConstructor_Object_Chronology IllegalArgumentException
  org.joda.time.TestMonthDay_Constructors#testConstructor_Object_nullChronology IllegalArgumentException
  org.joda.time.TestMonthDay_Constructors#testConstructor_nullObject IllegalArgumentException
  org.joda.time.TestMonthDay_Constructors#testConstructor_nullObject_Chronology IllegalArgumentException
  org.joda.time.TestMonthDay_Constructors#testConstructor_nullObject_nullChronology IllegalArgumentException
  org.joda.time.TestTimeOfDay_Constructors#testConstructor2_Object_Chronology IllegalArgumentException
  org.joda.time.TestTimeOfDay_Constructors#testConstructor_Object1 IllegalArgumentException
  org.joda.time.TestTimeOfDay_Constructors#testConstructor_Object2 IllegalArgumentException
  org.joda.time.TestTimeOfDay_Constructors#testConstructor_ObjectString1 IllegalArgumentException
  org.joda.time.TestTimeOfDay_Constructors#testConstructor_ObjectString2 IllegalArgumentException
  org.joda.time.TestTimeOfDay_Constructors#testConstructor_ObjectString3 IllegalArgumentException
  org.joda.time.TestTimeOfDay_Constructors#testConstructor_ObjectString4 IllegalArgumentException
  org.joda.time.TestTimeOfDay_Constructors#testConstructor_ObjectString5 IllegalArgumentException
  org.joda.time.TestTimeOfDay_Constructors#testConstructor_ObjectString6 IllegalArgumentException
  org.joda.time.TestTimeOfDay_Constructors#testConstructor_Object_Chronology IllegalArgumentException
  org.joda.time.TestTimeOfDay_Constructors#testConstructor_Object_nullChronology IllegalArgumentException
  org.joda.time.TestTimeOfDay_Constructors#testConstructor_nullObject IllegalArgumentException
  org.joda.time.TestTimeOfDay_Constructors#testConstructor_nullObject_Chronology IllegalArgumentException
  org.joda.time.TestTimeOfDay_Constructors#testConstructor_nullObject_nullChronology IllegalArgumentException
  org.joda.time.TestTimeOfDay_Constructors#testConstructor_todObject IllegalArgumentException
  org.joda.time.TestYearMonthDay_Constructors#testConstructor_Object IllegalArgumentException
  org.joda.time.TestYearMonthDay_Constructors#testConstructor_ObjectString1 IllegalArgumentException
  org.joda.time.TestYearMonthDay_Constructors#testConstructor_ObjectString2 IllegalArgumentException
  org.joda.time.TestYearMonthDay_Constructors#testConstructor_ObjectString3 IllegalArgumentException
  org.joda.time.TestYearMonthDay_Constructors#testConstructor_ObjectString4 IllegalArgumentException
  org.joda.time.TestYearMonthDay_Constructors#testConstructor_ObjectString5 IllegalArgumentException
  org.joda.time.TestYearMonthDay_Constructors#testConstructor_Object_Chronology IllegalArgumentException
  org.joda.time.TestYearMonthDay_Constructors#testConstructor_Object_nullChronology IllegalArgumentException
  org.joda.time.TestYearMonthDay_Constructors#testConstructor_nullObject IllegalArgumentException
  org.joda.time.TestYearMonthDay_Constructors#testConstructor_nullObject_Chronology IllegalArgumentException
  org.joda.time.TestYearMonthDay_Constructors#testConstructor_nullObject_nullChronology IllegalArgumentException
  org.joda.time.TestYearMonth_Constructors#testConstructor_Object IllegalArgumentException
  org.joda.time.TestYearMonth_Constructors#testConstructor_ObjectString1 IllegalArgumentException
  org.joda.time.TestYearMonth_Constructors#testConstructor_ObjectString5 IllegalArgumentException
  org.joda.time.TestYearMonth_Constructors#testConstructor_Object_Chronology IllegalArgumentException
  org.joda.time.TestYearMonth_Constructors#testConstructor_Object_nullChronology IllegalArgumentException
  org.joda.time.TestYearMonth_Constructors#testConstructor_nullObject IllegalArgumentException
  org.joda.time.TestYearMonth_Constructors#testConstructor_nullObject_Chronology IllegalArgumentException
  org.joda.time.TestYearMonth_Constructors#testConstructor_nullObject_nullChronology IllegalArgumentException
  org.joda.time.chrono.TestGJChronology#testCutoverAddDays IllegalArgumentException
  org.joda.time.chrono.TestGJChronology#testCutoverAddMonths IllegalArgumentException
  org.joda.time.chrono.TestGJChronology#testCutoverAddYears IllegalArgumentException
  org.joda.time.chrono.TestGJChronology#testPartialGetAsText IllegalArgumentException
  org.joda.time.chrono.TestGJChronology#testYearEndAddDays IllegalArgumentException
  org.joda.time.chrono.TestISOChronology#testAddMonths IllegalArgumentException ...
  org.joda.time.chrono.TestISOChronology#testCutoverAddYears IllegalArgumentException
  org.joda.time.convert.TestConverterManager#testAddPartialConverter1 IllegalArgumentException
  org.joda.time.convert.TestConverterManager#testAddPartialConverter2 IllegalArgumentException
  org.joda.time.convert.TestConverterManager#testGetPartialConverter IllegalArgumentException
  org.joda.time.convert.TestConverterManager#testGetPartialConverterOKMultipleMatches IllegalArgumentException

Tests run: 4157, Failures: 1, Errors: 114, Skipped: 0

[INFO] ------------------------------------------------------------------------
[INFO] BUILD FAILURE
[INFO] ------------------------------------------------------------------------
[INFO] Total time: 15.693s
[INFO] Finished at: Thu Aug 06 02:53:42 BST 2015
[INFO] Final Memory: 8M/219M
[INFO] ------------------------------------------------------------------------
[ERROR] Failed to execute goal org.apache.maven.plugins:maven-surefire-plugin:2.18.1:test (default-test) on project joda-time: There are test failures.
[ERROR] 
[ERROR] Please refer to /home/perham/Study/LittleDarwin/Cases/joda-time-2.8.1/target/surefire-reports for the individual test results.
[ERROR] -> [Help 1]
[ERROR] 
[ERROR] To see the full stack trace of the errors, re-run Maven with the -e switch.
[ERROR] Re-run Maven using the -X switch to enable full debug logging.
[ERROR] 
[ERROR] For more information about the errors and possible solutions, please read the following articles:
[ERROR] [Help 1] http://cwiki.apache.org/confluence/display/MAVEN/MojoFailureException
