[INFO] Scanning for projects...
[INFO]                                                                         
[INFO] ------------------------------------------------------------------------
[INFO] Building Joda-Time 2.8.1
[INFO] ------------------------------------------------------------------------
[INFO] 
[INFO] --- maven-resources-plugin:2.7:resources (default-resources) @ joda-time ---
[INFO] Using 'UTF-8' encoding to copy filtered resources.
[INFO] Copying 2 resources to META-INF
[INFO] Copying 10 resources
[INFO] 
[INFO] --- maven-compiler-plugin:3.3:compile (default-compile) @ joda-time ---
[INFO] Changes detected - recompiling the module!
[INFO] Compiling 166 source files to /home/perham/Study/LittleDarwin/Cases/joda-time-2.8.1/target/classes
[INFO] 
[INFO] --- exec-maven-plugin:1.4.0:java (compile-tzdb) @ joda-time ---
Writing zoneinfo files
Writing ZoneInfoMap
[INFO] 
[INFO] --- maven-resources-plugin:2.7:testResources (default-testResources) @ joda-time ---
[INFO] Using 'UTF-8' encoding to copy filtered resources.
[INFO] Copying 34 resources
[INFO] 
[INFO] --- maven-compiler-plugin:3.3:testCompile (default-testCompile) @ joda-time ---
[INFO] Nothing to compile - all classes are up to date
[INFO] 
[INFO] --- maven-surefire-plugin:2.18.1:test (default-test) @ joda-time ---
[INFO] Surefire report directory: /home/perham/Study/LittleDarwin/Cases/joda-time-2.8.1/target/surefire-reports

-------------------------------------------------------
 T E S T S
-------------------------------------------------------
Running org.joda.time.TestAllPackages

TestBuddhistChronology.testCalendar

TestCopticChronology.testCalendar

TestEthiopicChronology.testCalendar

TestIslamicChronology.testCalendar

Testing Gregorian chronology over 1000 iterations
100% complete (i=1000)

Testing Julian chronology over 1000 iterations
100% complete (i=1000)
Writing zoneinfo files
Writing ZoneInfoMap
Tests run: 4157, Failures: 96, Errors: 5, Skipped: 0, Time elapsed: 5.275 sec <<< FAILURE! - in org.joda.time.TestAllPackages
testToPeriod_PeriodType(org.joda.time.TestDuration_Basics)  Time elapsed: 0.005 sec  <<< FAILURE!
junit.framework.AssertionFailedError: expected:<PT0S> but was:<PT10805H6M7S>
	at junit.framework.Assert.fail(Assert.java:47)
	at junit.framework.Assert.failNotEquals(Assert.java:280)
	at junit.framework.Assert.assertEquals(Assert.java:64)
	at junit.framework.Assert.assertEquals(Assert.java:71)
	at org.joda.time.TestDuration_Basics.testToPeriod_PeriodType(TestDuration_Basics.java:503)

testToPeriod_Chronology(org.joda.time.TestDuration_Basics)  Time elapsed: 0 sec  <<< FAILURE!
junit.framework.AssertionFailedError: expected:<PT0S> but was:<P64W2DT5H6M7.008S>
	at junit.framework.Assert.fail(Assert.java:47)
	at junit.framework.Assert.failNotEquals(Assert.java:280)
	at junit.framework.Assert.assertEquals(Assert.java:64)
	at junit.framework.Assert.assertEquals(Assert.java:71)
	at org.joda.time.TestDuration_Basics.testToPeriod_Chronology(TestDuration_Basics.java:516)

testToPeriod_PeriodType_Chronology(org.joda.time.TestDuration_Basics)  Time elapsed: 0 sec  <<< FAILURE!
junit.framework.AssertionFailedError: expected:<PT0S> but was:<P64W2DT5H6M7S>
	at junit.framework.Assert.fail(Assert.java:47)
	at junit.framework.Assert.failNotEquals(Assert.java:280)
	at junit.framework.Assert.assertEquals(Assert.java:64)
	at junit.framework.Assert.assertEquals(Assert.java:71)
	at org.joda.time.TestDuration_Basics.testToPeriod_PeriodType_Chronology(TestDuration_Basics.java:529)

testParse_noFormatter(org.joda.time.TestInterval_Constructors)  Time elapsed: 0.002 sec  <<< FAILURE!
junit.framework.AssertionFailedError: expected:<2010-06-30T12:30:00.000+02:00/2010-07-01T14:30:00.000+02:00> but was:<2010-06-30T12:30:00.000+02:00/2010-06-30T12:30:00.000+02:00>
	at junit.framework.Assert.fail(Assert.java:47)
	at junit.framework.Assert.failNotEquals(Assert.java:280)
	at junit.framework.Assert.assertEquals(Assert.java:64)
	at junit.framework.Assert.assertEquals(Assert.java:71)
	at org.joda.time.TestInterval_Constructors.testParse_noFormatter(TestInterval_Constructors.java:109)

testParse_noFormatter(org.joda.time.TestMutableInterval_Constructors)  Time elapsed: 0.002 sec  <<< FAILURE!
junit.framework.AssertionFailedError: expected:<2010-06-30T12:30:00.000+02:00/2010-07-01T14:30:00.000+02:00> but was:<2010-06-30T12:30:00.000+02:00/2010-06-30T12:30:00.000+02:00>
	at junit.framework.Assert.fail(Assert.java:47)
	at junit.framework.Assert.failNotEquals(Assert.java:280)
	at junit.framework.Assert.assertEquals(Assert.java:64)
	at junit.framework.Assert.assertEquals(Assert.java:71)
	at org.joda.time.TestMutableInterval_Constructors.testParse_noFormatter(TestMutableInterval_Constructors.java:115)

testParse_noFormatter(org.joda.time.TestPeriod_Constructors)  Time elapsed: 0 sec  <<< FAILURE!
junit.framework.AssertionFailedError: expected:<P1Y2M3W4DT5H6M7.890S> but was:<PT0S>
	at junit.framework.Assert.fail(Assert.java:47)
	at junit.framework.Assert.failNotEquals(Assert.java:280)
	at junit.framework.Assert.assertEquals(Assert.java:64)
	at junit.framework.Assert.assertEquals(Assert.java:71)
	at org.joda.time.TestPeriod_Constructors.testParse_noFormatter(TestPeriod_Constructors.java:104)

testConstructor_Object1(org.joda.time.TestPeriod_Constructors)  Time elapsed: 0 sec  <<< FAILURE!
junit.framework.AssertionFailedError: expected:<1> but was:<0>
	at junit.framework.Assert.fail(Assert.java:47)
	at junit.framework.Assert.failNotEquals(Assert.java:280)
	at junit.framework.Assert.assertEquals(Assert.java:64)
	at junit.framework.Assert.assertEquals(Assert.java:198)
	at junit.framework.Assert.assertEquals(Assert.java:204)
	at org.joda.time.TestPeriod_Constructors.testConstructor_Object1(TestPeriod_Constructors.java:1147)

testConstructor_Object2(org.joda.time.TestPeriod_Constructors)  Time elapsed: 0 sec  <<< ERROR!
java.lang.NullPointerException
	at org.joda.time.convert.ConverterManager.getPeriodConverter(ConverterManager.java:81)
	at org.joda.time.base.BasePeriod.<init>(BasePeriod.java:272)
	at org.joda.time.Period.<init>(Period.java:674)
	at org.joda.time.TestPeriod_Constructors.testConstructor_Object2(TestPeriod_Constructors.java:1158)

testConstructor_Object3(org.joda.time.TestPeriod_Constructors)  Time elapsed: 0 sec  <<< FAILURE!
junit.framework.AssertionFailedError: expected:<PeriodType[DayTime]> but was:<PeriodType[Standard]>
	at junit.framework.Assert.fail(Assert.java:47)
	at junit.framework.Assert.failNotEquals(Assert.java:280)
	at junit.framework.Assert.assertEquals(Assert.java:64)
	at junit.framework.Assert.assertEquals(Assert.java:71)
	at org.joda.time.TestPeriod_Constructors.testConstructor_Object3(TestPeriod_Constructors.java:1172)

testConstructor_Object4(org.joda.time.TestPeriod_Constructors)  Time elapsed: 0 sec  <<< FAILURE!
junit.framework.AssertionFailedError: expected:<1> but was:<0>
	at junit.framework.Assert.fail(Assert.java:47)
	at junit.framework.Assert.failNotEquals(Assert.java:280)
	at junit.framework.Assert.assertEquals(Assert.java:64)
	at junit.framework.Assert.assertEquals(Assert.java:198)
	at junit.framework.Assert.assertEquals(Assert.java:204)
	at org.joda.time.TestPeriod_Constructors.testConstructor_Object4(TestPeriod_Constructors.java:1187)

testConstructor_Object_PeriodType1(org.joda.time.TestPeriod_Constructors)  Time elapsed: 0 sec  <<< FAILURE!
junit.framework.AssertionFailedError: expected:<1> but was:<0>
	at junit.framework.Assert.fail(Assert.java:47)
	at junit.framework.Assert.failNotEquals(Assert.java:280)
	at junit.framework.Assert.assertEquals(Assert.java:64)
	at junit.framework.Assert.assertEquals(Assert.java:198)
	at junit.framework.Assert.assertEquals(Assert.java:204)
	at org.joda.time.TestPeriod_Constructors.testConstructor_Object_PeriodType1(TestPeriod_Constructors.java:1204)

testConstructor_Object_PeriodType2(org.joda.time.TestPeriod_Constructors)  Time elapsed: 0.001 sec  <<< ERROR!
java.lang.NullPointerException
	at org.joda.time.convert.ConverterManager.getPeriodConverter(ConverterManager.java:81)
	at org.joda.time.base.BasePeriod.<init>(BasePeriod.java:272)
	at org.joda.time.Period.<init>(Period.java:691)
	at org.joda.time.TestPeriod_Constructors.testConstructor_Object_PeriodType2(TestPeriod_Constructors.java:1215)

testConstructor_Object_PeriodType3(org.joda.time.TestPeriod_Constructors)  Time elapsed: 0 sec  <<< FAILURE!
junit.framework.AssertionFailedError: expected:<1> but was:<0>
	at junit.framework.Assert.fail(Assert.java:47)
	at junit.framework.Assert.failNotEquals(Assert.java:280)
	at junit.framework.Assert.assertEquals(Assert.java:64)
	at junit.framework.Assert.assertEquals(Assert.java:198)
	at junit.framework.Assert.assertEquals(Assert.java:204)
	at org.joda.time.TestPeriod_Constructors.testConstructor_Object_PeriodType3(TestPeriod_Constructors.java:1234)

testConstructor_Object_PeriodType4(org.joda.time.TestPeriod_Constructors)  Time elapsed: 0.001 sec  <<< FAILURE!
junit.framework.AssertionFailedError: expected:<PeriodType[DayTime]> but was:<PeriodType[Standard]>
	at junit.framework.Assert.fail(Assert.java:47)
	at junit.framework.Assert.failNotEquals(Assert.java:280)
	at junit.framework.Assert.assertEquals(Assert.java:64)
	at junit.framework.Assert.assertEquals(Assert.java:71)
	at org.joda.time.TestPeriod_Constructors.testConstructor_Object_PeriodType4(TestPeriod_Constructors.java:1242)

testToMutablePeriod(org.joda.time.TestPeriod_Basics)  Time elapsed: 0.001 sec  <<< FAILURE!
junit.framework.AssertionFailedError: expected:<PT0.123S> but was:<PT0S>
	at junit.framework.Assert.fail(Assert.java:47)
	at junit.framework.Assert.failNotEquals(Assert.java:280)
	at junit.framework.Assert.assertEquals(Assert.java:64)
	at junit.framework.Assert.assertEquals(Assert.java:71)
	at org.joda.time.TestPeriod_Basics.testToMutablePeriod(TestPeriod_Basics.java:505)

testWithPeriodType2(org.joda.time.TestPeriod_Basics)  Time elapsed: 0.001 sec  <<< FAILURE!
junit.framework.AssertionFailedError: expected:<3> but was:<0>
	at junit.framework.Assert.fail(Assert.java:47)
	at junit.framework.Assert.failNotEquals(Assert.java:280)
	at junit.framework.Assert.assertEquals(Assert.java:64)
	at junit.framework.Assert.assertEquals(Assert.java:198)
	at junit.framework.Assert.assertEquals(Assert.java:204)
	at org.joda.time.TestPeriod_Basics.testWithPeriodType2(TestPeriod_Basics.java:534)

testWithPeriodType3(org.joda.time.TestPeriod_Basics)  Time elapsed: 0 sec  <<< FAILURE!
junit.framework.AssertionFailedError
	at junit.framework.Assert.fail(Assert.java:47)
	at junit.framework.Assert.fail(Assert.java:53)
	at org.joda.time.TestPeriod_Basics.testWithPeriodType3(TestPeriod_Basics.java:543)

testWithPeriodType5(org.joda.time.TestPeriod_Basics)  Time elapsed: 0.001 sec  <<< FAILURE!
junit.framework.AssertionFailedError: expected:<1> but was:<0>
	at junit.framework.Assert.fail(Assert.java:47)
	at junit.framework.Assert.failNotEquals(Assert.java:280)
	at junit.framework.Assert.assertEquals(Assert.java:64)
	at junit.framework.Assert.assertEquals(Assert.java:198)
	at junit.framework.Assert.assertEquals(Assert.java:204)
	at org.joda.time.TestPeriod_Basics.testWithPeriodType5(TestPeriod_Basics.java:559)

testParse_noFormatter(org.joda.time.TestMutablePeriod_Constructors)  Time elapsed: 0 sec  <<< FAILURE!
junit.framework.AssertionFailedError: expected:<P1Y2M3W4DT5H6M7.890S> but was:<PT0S>
	at junit.framework.Assert.fail(Assert.java:47)
	at junit.framework.Assert.failNotEquals(Assert.java:280)
	at junit.framework.Assert.assertEquals(Assert.java:64)
	at junit.framework.Assert.assertEquals(Assert.java:71)
	at org.joda.time.TestMutablePeriod_Constructors.testParse_noFormatter(TestMutablePeriod_Constructors.java:102)

testConstructor_Object_Chronology1(org.joda.time.TestMutablePeriod_Constructors)  Time elapsed: 0.001 sec  <<< FAILURE!
junit.framework.AssertionFailedError: expected:<10805> but was:<0>
	at junit.framework.Assert.fail(Assert.java:47)
	at junit.framework.Assert.failNotEquals(Assert.java:280)
	at junit.framework.Assert.assertEquals(Assert.java:64)
	at junit.framework.Assert.assertEquals(Assert.java:198)
	at junit.framework.Assert.assertEquals(Assert.java:204)
	at org.joda.time.TestMutablePeriod_Constructors.testConstructor_Object_Chronology1(TestMutablePeriod_Constructors.java:948)

testConstructor_Object_Chronology2(org.joda.time.TestMutablePeriod_Constructors)  Time elapsed: 0 sec  <<< FAILURE!
junit.framework.AssertionFailedError: expected:<64> but was:<0>
	at junit.framework.Assert.fail(Assert.java:47)
	at junit.framework.Assert.failNotEquals(Assert.java:280)
	at junit.framework.Assert.assertEquals(Assert.java:64)
	at junit.framework.Assert.assertEquals(Assert.java:198)
	at junit.framework.Assert.assertEquals(Assert.java:204)
	at org.joda.time.TestMutablePeriod_Constructors.testConstructor_Object_Chronology2(TestMutablePeriod_Constructors.java:964)

testConstructor_Object1(org.joda.time.TestMutablePeriod_Constructors)  Time elapsed: 0 sec  <<< FAILURE!
junit.framework.AssertionFailedError: expected:<1> but was:<0>
	at junit.framework.Assert.fail(Assert.java:47)
	at junit.framework.Assert.failNotEquals(Assert.java:280)
	at junit.framework.Assert.assertEquals(Assert.java:64)
	at junit.framework.Assert.assertEquals(Assert.java:198)
	at junit.framework.Assert.assertEquals(Assert.java:204)
	at org.joda.time.TestMutablePeriod_Constructors.testConstructor_Object1(TestMutablePeriod_Constructors.java:829)

testConstructor_Object2(org.joda.time.TestMutablePeriod_Constructors)  Time elapsed: 0.001 sec  <<< ERROR!
java.lang.NullPointerException
	at org.joda.time.convert.ConverterManager.getPeriodConverter(ConverterManager.java:81)
	at org.joda.time.base.BasePeriod.<init>(BasePeriod.java:272)
	at org.joda.time.MutablePeriod.<init>(MutablePeriod.java:374)
	at org.joda.time.TestMutablePeriod_Constructors.testConstructor_Object2(TestMutablePeriod_Constructors.java:840)

testConstructor_Object3(org.joda.time.TestMutablePeriod_Constructors)  Time elapsed: 0 sec  <<< FAILURE!
junit.framework.AssertionFailedError: expected:<PeriodType[DayTime]> but was:<PeriodType[Standard]>
	at junit.framework.Assert.fail(Assert.java:47)
	at junit.framework.Assert.failNotEquals(Assert.java:280)
	at junit.framework.Assert.assertEquals(Assert.java:64)
	at junit.framework.Assert.assertEquals(Assert.java:71)
	at org.joda.time.TestMutablePeriod_Constructors.testConstructor_Object3(TestMutablePeriod_Constructors.java:854)

testConstructor_Object4(org.joda.time.TestMutablePeriod_Constructors)  Time elapsed: 0.001 sec  <<< FAILURE!
junit.framework.AssertionFailedError: expected:<1> but was:<0>
	at junit.framework.Assert.fail(Assert.java:47)
	at junit.framework.Assert.failNotEquals(Assert.java:280)
	at junit.framework.Assert.assertEquals(Assert.java:64)
	at junit.framework.Assert.assertEquals(Assert.java:198)
	at junit.framework.Assert.assertEquals(Assert.java:204)
	at org.joda.time.TestMutablePeriod_Constructors.testConstructor_Object4(TestMutablePeriod_Constructors.java:869)

testConstructor_Object_PeriodType1(org.joda.time.TestMutablePeriod_Constructors)  Time elapsed: 0.001 sec  <<< FAILURE!
junit.framework.AssertionFailedError: expected:<1> but was:<0>
	at junit.framework.Assert.fail(Assert.java:47)
	at junit.framework.Assert.failNotEquals(Assert.java:280)
	at junit.framework.Assert.assertEquals(Assert.java:64)
	at junit.framework.Assert.assertEquals(Assert.java:198)
	at junit.framework.Assert.assertEquals(Assert.java:204)
	at org.joda.time.TestMutablePeriod_Constructors.testConstructor_Object_PeriodType1(TestMutablePeriod_Constructors.java:886)

testConstructor_Object_PeriodType2(org.joda.time.TestMutablePeriod_Constructors)  Time elapsed: 0 sec  <<< ERROR!
java.lang.NullPointerException
	at org.joda.time.convert.ConverterManager.getPeriodConverter(ConverterManager.java:81)
	at org.joda.time.base.BasePeriod.<init>(BasePeriod.java:272)
	at org.joda.time.MutablePeriod.<init>(MutablePeriod.java:391)
	at org.joda.time.TestMutablePeriod_Constructors.testConstructor_Object_PeriodType2(TestMutablePeriod_Constructors.java:897)

testConstructor_Object_PeriodType3(org.joda.time.TestMutablePeriod_Constructors)  Time elapsed: 0.001 sec  <<< FAILURE!
junit.framework.AssertionFailedError: expected:<1> but was:<0>
	at junit.framework.Assert.fail(Assert.java:47)
	at junit.framework.Assert.failNotEquals(Assert.java:280)
	at junit.framework.Assert.assertEquals(Assert.java:64)
	at junit.framework.Assert.assertEquals(Assert.java:198)
	at junit.framework.Assert.assertEquals(Assert.java:204)
	at org.joda.time.TestMutablePeriod_Constructors.testConstructor_Object_PeriodType3(TestMutablePeriod_Constructors.java:916)

testConstructor_Object_PeriodType4(org.joda.time.TestMutablePeriod_Constructors)  Time elapsed: 0 sec  <<< FAILURE!
junit.framework.AssertionFailedError: expected:<PeriodType[DayTime]> but was:<PeriodType[Standard]>
	at junit.framework.Assert.fail(Assert.java:47)
	at junit.framework.Assert.failNotEquals(Assert.java:280)
	at junit.framework.Assert.assertEquals(Assert.java:64)
	at junit.framework.Assert.assertEquals(Assert.java:71)
	at org.joda.time.TestMutablePeriod_Constructors.testConstructor_Object_PeriodType4(TestMutablePeriod_Constructors.java:924)

testToPeriod(org.joda.time.TestMutablePeriod_Basics)  Time elapsed: 0 sec  <<< FAILURE!
junit.framework.AssertionFailedError: expected:<PT0.123S> but was:<PT0S>
	at junit.framework.Assert.fail(Assert.java:47)
	at junit.framework.Assert.failNotEquals(Assert.java:280)
	at junit.framework.Assert.assertEquals(Assert.java:64)
	at junit.framework.Assert.assertEquals(Assert.java:71)
	at org.joda.time.TestMutablePeriod_Basics.testToPeriod(TestMutablePeriod_Basics.java:418)

testToMutablePeriod(org.joda.time.TestMutablePeriod_Basics)  Time elapsed: 0.001 sec  <<< FAILURE!
junit.framework.AssertionFailedError: expected:<PT0.123S> but was:<PT0S>
	at junit.framework.Assert.fail(Assert.java:47)
	at junit.framework.Assert.failNotEquals(Assert.java:280)
	at junit.framework.Assert.assertEquals(Assert.java:64)
	at junit.framework.Assert.assertEquals(Assert.java:71)
	at org.joda.time.TestMutablePeriod_Basics.testToMutablePeriod(TestMutablePeriod_Basics.java:424)

testFactory_parseYears_String(org.joda.time.TestYears)  Time elapsed: 0.001 sec  <<< FAILURE!
junit.framework.AssertionFailedError: expected:<1> but was:<0>
	at junit.framework.Assert.fail(Assert.java:47)
	at junit.framework.Assert.failNotEquals(Assert.java:280)
	at junit.framework.Assert.assertEquals(Assert.java:64)
	at junit.framework.Assert.assertEquals(Assert.java:198)
	at junit.framework.Assert.assertEquals(Assert.java:204)
	at org.joda.time.TestYears.testFactory_parseYears_String(TestYears.java:117)

testFactory_parseMonths_String(org.joda.time.TestMonths)  Time elapsed: 0 sec  <<< FAILURE!
junit.framework.AssertionFailedError: expected:<1> but was:<0>
	at junit.framework.Assert.fail(Assert.java:47)
	at junit.framework.Assert.failNotEquals(Assert.java:280)
	at junit.framework.Assert.assertEquals(Assert.java:64)
	at junit.framework.Assert.assertEquals(Assert.java:198)
	at junit.framework.Assert.assertEquals(Assert.java:204)
	at org.joda.time.TestMonths.testFactory_parseMonths_String(TestMonths.java:162)

testFactory_parseWeeks_String(org.joda.time.TestWeeks)  Time elapsed: 0.001 sec  <<< FAILURE!
junit.framework.AssertionFailedError: expected:<1> but was:<0>
	at junit.framework.Assert.fail(Assert.java:47)
	at junit.framework.Assert.failNotEquals(Assert.java:280)
	at junit.framework.Assert.assertEquals(Assert.java:64)
	at junit.framework.Assert.assertEquals(Assert.java:198)
	at junit.framework.Assert.assertEquals(Assert.java:204)
	at org.joda.time.TestWeeks.testFactory_parseWeeks_String(TestWeeks.java:134)

testFactory_parseDays_String(org.joda.time.TestDays)  Time elapsed: 0.001 sec  <<< FAILURE!
junit.framework.AssertionFailedError: expected:<1> but was:<0>
	at junit.framework.Assert.fail(Assert.java:47)
	at junit.framework.Assert.failNotEquals(Assert.java:280)
	at junit.framework.Assert.assertEquals(Assert.java:64)
	at junit.framework.Assert.assertEquals(Assert.java:198)
	at junit.framework.Assert.assertEquals(Assert.java:204)
	at org.joda.time.TestDays.testFactory_parseDays_String(TestDays.java:176)

testFactory_parseHours_String(org.joda.time.TestHours)  Time elapsed: 0.001 sec  <<< FAILURE!
junit.framework.AssertionFailedError: expected:<1> but was:<0>
	at junit.framework.Assert.fail(Assert.java:47)
	at junit.framework.Assert.failNotEquals(Assert.java:280)
	at junit.framework.Assert.assertEquals(Assert.java:64)
	at junit.framework.Assert.assertEquals(Assert.java:198)
	at junit.framework.Assert.assertEquals(Assert.java:204)
	at org.joda.time.TestHours.testFactory_parseHours_String(TestHours.java:145)

testFactory_parseMinutes_String(org.joda.time.TestMinutes)  Time elapsed: 0 sec  <<< FAILURE!
junit.framework.AssertionFailedError: expected:<1> but was:<0>
	at junit.framework.Assert.fail(Assert.java:47)
	at junit.framework.Assert.failNotEquals(Assert.java:280)
	at junit.framework.Assert.assertEquals(Assert.java:64)
	at junit.framework.Assert.assertEquals(Assert.java:198)
	at junit.framework.Assert.assertEquals(Assert.java:204)
	at org.joda.time.TestMinutes.testFactory_parseMinutes_String(TestMinutes.java:135)

testFactory_parseSeconds_String(org.joda.time.TestSeconds)  Time elapsed: 0 sec  <<< FAILURE!
junit.framework.AssertionFailedError: expected:<1> but was:<0>
	at junit.framework.Assert.fail(Assert.java:47)
	at junit.framework.Assert.failNotEquals(Assert.java:280)
	at junit.framework.Assert.assertEquals(Assert.java:64)
	at junit.framework.Assert.assertEquals(Assert.java:198)
	at junit.framework.Assert.assertEquals(Assert.java:204)
	at org.joda.time.TestSeconds.testFactory_parseSeconds_String(TestSeconds.java:132)

testYears(org.joda.time.TestStringConvert)  Time elapsed: 0.032 sec  <<< FAILURE!
junit.framework.AssertionFailedError: expected:<P5Y> but was:<P0Y>
	at junit.framework.Assert.fail(Assert.java:47)
	at junit.framework.Assert.failNotEquals(Assert.java:280)
	at junit.framework.Assert.assertEquals(Assert.java:64)
	at junit.framework.Assert.assertEquals(Assert.java:71)
	at org.joda.time.TestStringConvert.testYears(TestStringConvert.java:158)

testMonths(org.joda.time.TestStringConvert)  Time elapsed: 0.001 sec  <<< FAILURE!
junit.framework.AssertionFailedError: expected:<P5M> but was:<P0M>
	at junit.framework.Assert.fail(Assert.java:47)
	at junit.framework.Assert.failNotEquals(Assert.java:280)
	at junit.framework.Assert.assertEquals(Assert.java:64)
	at junit.framework.Assert.assertEquals(Assert.java:71)
	at org.joda.time.TestStringConvert.testMonths(TestStringConvert.java:165)

testWeeks(org.joda.time.TestStringConvert)  Time elapsed: 0 sec  <<< FAILURE!
junit.framework.AssertionFailedError: expected:<P5W> but was:<P0W>
	at junit.framework.Assert.fail(Assert.java:47)
	at junit.framework.Assert.failNotEquals(Assert.java:280)
	at junit.framework.Assert.assertEquals(Assert.java:64)
	at junit.framework.Assert.assertEquals(Assert.java:71)
	at org.joda.time.TestStringConvert.testWeeks(TestStringConvert.java:172)

testDays(org.joda.time.TestStringConvert)  Time elapsed: 0.001 sec  <<< FAILURE!
junit.framework.AssertionFailedError: expected:<P5D> but was:<P0D>
	at junit.framework.Assert.fail(Assert.java:47)
	at junit.framework.Assert.failNotEquals(Assert.java:280)
	at junit.framework.Assert.assertEquals(Assert.java:64)
	at junit.framework.Assert.assertEquals(Assert.java:71)
	at org.joda.time.TestStringConvert.testDays(TestStringConvert.java:179)

testHours(org.joda.time.TestStringConvert)  Time elapsed: 0.001 sec  <<< FAILURE!
junit.framework.AssertionFailedError: expected:<PT5H> but was:<PT0H>
	at junit.framework.Assert.fail(Assert.java:47)
	at junit.framework.Assert.failNotEquals(Assert.java:280)
	at junit.framework.Assert.assertEquals(Assert.java:64)
	at junit.framework.Assert.assertEquals(Assert.java:71)
	at org.joda.time.TestStringConvert.testHours(TestStringConvert.java:186)

testMinutes(org.joda.time.TestStringConvert)  Time elapsed: 0 sec  <<< FAILURE!
junit.framework.AssertionFailedError: expected:<PT5M> but was:<PT0M>
	at junit.framework.Assert.fail(Assert.java:47)
	at junit.framework.Assert.failNotEquals(Assert.java:280)
	at junit.framework.Assert.assertEquals(Assert.java:64)
	at junit.framework.Assert.assertEquals(Assert.java:71)
	at org.joda.time.TestStringConvert.testMinutes(TestStringConvert.java:193)

testSeconds(org.joda.time.TestStringConvert)  Time elapsed: 0.001 sec  <<< FAILURE!
junit.framework.AssertionFailedError: expected:<PT5S> but was:<PT0S>
	at junit.framework.Assert.fail(Assert.java:47)
	at junit.framework.Assert.failNotEquals(Assert.java:280)
	at junit.framework.Assert.assertEquals(Assert.java:64)
	at junit.framework.Assert.assertEquals(Assert.java:71)
	at org.joda.time.TestStringConvert.testSeconds(TestStringConvert.java:200)

testMutablePeriod(org.joda.time.TestStringConvert)  Time elapsed: 0.002 sec  <<< FAILURE!
junit.framework.AssertionFailedError: expected:<P1Y2M3W4DT5H6M7.008S> but was:<PT0S>
	at junit.framework.Assert.fail(Assert.java:47)
	at junit.framework.Assert.failNotEquals(Assert.java:280)
	at junit.framework.Assert.assertEquals(Assert.java:64)
	at junit.framework.Assert.assertEquals(Assert.java:71)
	at org.joda.time.TestStringConvert.testMutablePeriod(TestStringConvert.java:151)

testPeriod(org.joda.time.TestStringConvert)  Time elapsed: 0.001 sec  <<< FAILURE!
junit.framework.AssertionFailedError: expected:<P1Y2M3W4DT5H6M7.008S> but was:<PT0S>
	at junit.framework.Assert.fail(Assert.java:47)
	at junit.framework.Assert.failNotEquals(Assert.java:280)
	at junit.framework.Assert.assertEquals(Assert.java:64)
	at junit.framework.Assert.assertEquals(Assert.java:71)
	at org.joda.time.TestStringConvert.testPeriod(TestStringConvert.java:144)

testGetPeriodConverter(org.joda.time.convert.TestConverterManager)  Time elapsed: 0 sec  <<< FAILURE!
junit.framework.AssertionFailedError: expected:<interface org.joda.time.ReadablePeriod> but was:<null>
	at junit.framework.Assert.fail(Assert.java:47)
	at junit.framework.Assert.failNotEquals(Assert.java:280)
	at junit.framework.Assert.assertEquals(Assert.java:64)
	at junit.framework.Assert.assertEquals(Assert.java:71)
	at org.joda.time.convert.TestConverterManager.testGetPeriodConverter(TestConverterManager.java:693)

testGetPeriodConverterRemovedNull(org.joda.time.convert.TestConverterManager)  Time elapsed: 0.001 sec  <<< ERROR!
java.lang.NullPointerException
	at org.joda.time.convert.ConverterManager.getPeriodConverter(ConverterManager.java:81)
	at org.joda.time.convert.TestConverterManager.testGetPeriodConverterRemovedNull(TestConverterManager.java:717)

testAddPeriodConverter1(org.joda.time.convert.TestConverterManager)  Time elapsed: 0.001 sec  <<< FAILURE!
junit.framework.AssertionFailedError: expected:<class java.lang.Boolean> but was:<null>
	at junit.framework.Assert.fail(Assert.java:47)
	at junit.framework.Assert.failNotEquals(Assert.java:280)
	at junit.framework.Assert.assertEquals(Assert.java:64)
	at junit.framework.Assert.assertEquals(Assert.java:71)
	at org.joda.time.convert.TestConverterManager.testAddPeriodConverter1(TestConverterManager.java:742)

testAddPeriodConverter2(org.joda.time.convert.TestConverterManager)  Time elapsed: 0.001 sec  <<< FAILURE!
junit.framework.AssertionFailedError: expected:<class java.lang.String> but was:<null>
	at junit.framework.Assert.fail(Assert.java:47)
	at junit.framework.Assert.failNotEquals(Assert.java:280)
	at junit.framework.Assert.assertEquals(Assert.java:64)
	at junit.framework.Assert.assertEquals(Assert.java:71)
	at org.joda.time.convert.TestConverterManager.testAddPeriodConverter2(TestConverterManager.java:759)

testSetIntoInterval_Object_Chronology1(org.joda.time.convert.TestStringConverter)  Time elapsed: 0.001 sec  <<< FAILURE!
junit.framework.AssertionFailedError: expected:<2005-08-09T00:00:00.000+01:00> but was:<2004-06-09T00:00:00.000+01:00>
	at junit.framework.Assert.fail(Assert.java:47)
	at junit.framework.Assert.failNotEquals(Assert.java:280)
	at junit.framework.Assert.assertEquals(Assert.java:64)
	at junit.framework.Assert.assertEquals(Assert.java:71)
	at org.joda.time.convert.TestStringConverter.testSetIntoInterval_Object_Chronology1(TestStringConverter.java:478)

testSetIntoInterval_Object_Chronology2(org.joda.time.convert.TestStringConverter)  Time elapsed: 0 sec  <<< FAILURE!
junit.framework.AssertionFailedError: expected:<2003-04-09T00:00:00.000+01:00> but was:<2004-06-09T00:00:00.000+01:00>
	at junit.framework.Assert.fail(Assert.java:47)
	at junit.framework.Assert.failNotEquals(Assert.java:280)
	at junit.framework.Assert.assertEquals(Assert.java:64)
	at junit.framework.Assert.assertEquals(Assert.java:71)
	at org.joda.time.convert.TestStringConverter.testSetIntoInterval_Object_Chronology2(TestStringConverter.java:485)

testSetIntoInterval_Object_Chronology4(org.joda.time.convert.TestStringConverter)  Time elapsed: 0.001 sec  <<< FAILURE!
junit.framework.AssertionFailedError: expected:<2005-08-08T19:00:00.000+01:00> but was:<2004-06-08T19:00:00.000+01:00>
	at junit.framework.Assert.fail(Assert.java:47)
	at junit.framework.Assert.failNotEquals(Assert.java:280)
	at junit.framework.Assert.assertEquals(Assert.java:64)
	at junit.framework.Assert.assertEquals(Assert.java:71)
	at org.joda.time.convert.TestStringConverter.testSetIntoInterval_Object_Chronology4(TestStringConverter.java:502)

testSetIntoInterval_Object_Chronology5(org.joda.time.convert.TestStringConverter)  Time elapsed: 0.001 sec  <<< FAILURE!
junit.framework.AssertionFailedError: expected:<2003-04-08T19:00:00.000+01:00> but was:<2004-06-08T19:00:00.000+01:00>
	at junit.framework.Assert.fail(Assert.java:47)
	at junit.framework.Assert.failNotEquals(Assert.java:280)
	at junit.framework.Assert.assertEquals(Assert.java:64)
	at junit.framework.Assert.assertEquals(Assert.java:71)
	at org.joda.time.convert.TestStringConverter.testSetIntoInterval_Object_Chronology5(TestStringConverter.java:509)

testParsePeriod_simple(org.joda.time.format.TestPeriodFormatter)  Time elapsed: 0.001 sec  <<< FAILURE!
junit.framework.AssertionFailedError: expected:<P1Y2M3W4DT5H6M7.008S> but was:<PT0S>
	at junit.framework.Assert.fail(Assert.java:47)
	at junit.framework.Assert.failNotEquals(Assert.java:280)
	at junit.framework.Assert.assertEquals(Assert.java:64)
	at junit.framework.Assert.assertEquals(Assert.java:71)
	at org.joda.time.format.TestPeriodFormatter.testParsePeriod_simple(TestPeriodFormatter.java:189)

testParsePeriod_parseType(org.joda.time.format.TestPeriodFormatter)  Time elapsed: 0.001 sec  <<< FAILURE!
junit.framework.AssertionFailedError: expected:<P4DT5H6M7.008S> but was:<PT0S>
	at junit.framework.Assert.fail(Assert.java:47)
	at junit.framework.Assert.failNotEquals(Assert.java:280)
	at junit.framework.Assert.assertEquals(Assert.java:64)
	at junit.framework.Assert.assertEquals(Assert.java:71)
	at org.joda.time.format.TestPeriodFormatter.testParsePeriod_parseType(TestPeriodFormatter.java:199)

test_wordBased_ja_parseOneField(org.joda.time.format.TestPeriodFormat)  Time elapsed: 0.001 sec  <<< FAILURE!
junit.framework.AssertionFailedError: expected:<P2D> but was:<PT0S>
	at junit.framework.Assert.fail(Assert.java:47)
	at junit.framework.Assert.failNotEquals(Assert.java:280)
	at junit.framework.Assert.assertEquals(Assert.java:64)
	at junit.framework.Assert.assertEquals(Assert.java:71)
	at org.joda.time.format.TestPeriodFormat.test_wordBased_ja_parseOneField(TestPeriodFormat.java:355)

test_wordBased_ja_parseTwoFields(org.joda.time.format.TestPeriodFormat)  Time elapsed: 0.001 sec  <<< FAILURE!
junit.framework.AssertionFailedError: expected:<P2DT5H> but was:<PT0S>
	at junit.framework.Assert.fail(Assert.java:47)
	at junit.framework.Assert.failNotEquals(Assert.java:280)
	at junit.framework.Assert.assertEquals(Assert.java:64)
	at junit.framework.Assert.assertEquals(Assert.java:71)
	at org.joda.time.format.TestPeriodFormat.test_wordBased_ja_parseTwoFields(TestPeriodFormat.java:361)

test_wordBased_pl_parseOneField(org.joda.time.format.TestPeriodFormat)  Time elapsed: 0.001 sec  <<< FAILURE!
junit.framework.AssertionFailedError: expected:<P2D> but was:<PT0S>
	at junit.framework.Assert.fail(Assert.java:47)
	at junit.framework.Assert.failNotEquals(Assert.java:280)
	at junit.framework.Assert.assertEquals(Assert.java:64)
	at junit.framework.Assert.assertEquals(Assert.java:71)
	at org.joda.time.format.TestPeriodFormat.test_wordBased_pl_parseOneField(TestPeriodFormat.java:398)

test_wordBased_pl_parseTwoFields(org.joda.time.format.TestPeriodFormat)  Time elapsed: 0 sec  <<< FAILURE!
junit.framework.AssertionFailedError: expected:<P2DT5H> but was:<PT0S>
	at junit.framework.Assert.fail(Assert.java:47)
	at junit.framework.Assert.failNotEquals(Assert.java:280)
	at junit.framework.Assert.assertEquals(Assert.java:64)
	at junit.framework.Assert.assertEquals(Assert.java:71)
	at org.joda.time.format.TestPeriodFormat.test_wordBased_pl_parseTwoFields(TestPeriodFormat.java:404)

test_wordBased_en_withLocale_pt(org.joda.time.format.TestPeriodFormat)  Time elapsed: 0 sec  <<< FAILURE!
junit.framework.AssertionFailedError: expected:<P2DT5H> but was:<PT0S>
	at junit.framework.Assert.fail(Assert.java:47)
	at junit.framework.Assert.failNotEquals(Assert.java:280)
	at junit.framework.Assert.assertEquals(Assert.java:64)
	at junit.framework.Assert.assertEquals(Assert.java:71)
	at org.joda.time.format.TestPeriodFormat.test_wordBased_en_withLocale_pt(TestPeriodFormat.java:634)

test_getDefault_parseOneField(org.joda.time.format.TestPeriodFormat)  Time elapsed: 0 sec  <<< FAILURE!
junit.framework.AssertionFailedError: expected:<P2D> but was:<PT0S>
	at junit.framework.Assert.fail(Assert.java:47)
	at junit.framework.Assert.failNotEquals(Assert.java:280)
	at junit.framework.Assert.assertEquals(Assert.java:64)
	at junit.framework.Assert.assertEquals(Assert.java:71)
	at org.joda.time.format.TestPeriodFormat.test_getDefault_parseOneField(TestPeriodFormat.java:97)

test_getDefault_parseTwoFields(org.joda.time.format.TestPeriodFormat)  Time elapsed: 0.001 sec  <<< FAILURE!
junit.framework.AssertionFailedError: expected:<P2DT5H> but was:<PT0S>
	at junit.framework.Assert.fail(Assert.java:47)
	at junit.framework.Assert.failNotEquals(Assert.java:280)
	at junit.framework.Assert.assertEquals(Assert.java:64)
	at junit.framework.Assert.assertEquals(Assert.java:71)
	at org.joda.time.format.TestPeriodFormat.test_getDefault_parseTwoFields(TestPeriodFormat.java:103)

test_wordBased_fr_parseOneField(org.joda.time.format.TestPeriodFormat)  Time elapsed: 0.001 sec  <<< FAILURE!
junit.framework.AssertionFailedError: expected:<P2D> but was:<PT0S>
	at junit.framework.Assert.fail(Assert.java:47)
	at junit.framework.Assert.failNotEquals(Assert.java:280)
	at junit.framework.Assert.assertEquals(Assert.java:64)
	at junit.framework.Assert.assertEquals(Assert.java:71)
	at org.joda.time.format.TestPeriodFormat.test_wordBased_fr_parseOneField(TestPeriodFormat.java:152)

test_wordBased_fr_parseTwoFields(org.joda.time.format.TestPeriodFormat)  Time elapsed: 0 sec  <<< FAILURE!
junit.framework.AssertionFailedError: expected:<P2DT5H> but was:<PT0S>
	at junit.framework.Assert.fail(Assert.java:47)
	at junit.framework.Assert.failNotEquals(Assert.java:280)
	at junit.framework.Assert.assertEquals(Assert.java:64)
	at junit.framework.Assert.assertEquals(Assert.java:71)
	at org.joda.time.format.TestPeriodFormat.test_wordBased_fr_parseTwoFields(TestPeriodFormat.java:158)

test_wordBased_pt_parseOneField(org.joda.time.format.TestPeriodFormat)  Time elapsed: 0.001 sec  <<< FAILURE!
junit.framework.AssertionFailedError: expected:<P2D> but was:<PT0S>
	at junit.framework.Assert.fail(Assert.java:47)
	at junit.framework.Assert.failNotEquals(Assert.java:280)
	at junit.framework.Assert.assertEquals(Assert.java:64)
	at junit.framework.Assert.assertEquals(Assert.java:71)
	at org.joda.time.format.TestPeriodFormat.test_wordBased_pt_parseOneField(TestPeriodFormat.java:189)

test_wordBased_pt_parseTwoFields(org.joda.time.format.TestPeriodFormat)  Time elapsed: 0.001 sec  <<< FAILURE!
junit.framework.AssertionFailedError: expected:<P2DT5H> but was:<PT0S>
	at junit.framework.Assert.fail(Assert.java:47)
	at junit.framework.Assert.failNotEquals(Assert.java:280)
	at junit.framework.Assert.assertEquals(Assert.java:64)
	at junit.framework.Assert.assertEquals(Assert.java:71)
	at org.joda.time.format.TestPeriodFormat.test_wordBased_pt_parseTwoFields(TestPeriodFormat.java:195)

test_wordBased_es_parseOneField(org.joda.time.format.TestPeriodFormat)  Time elapsed: 0 sec  <<< FAILURE!
junit.framework.AssertionFailedError: expected:<P2D> but was:<PT0S>
	at junit.framework.Assert.fail(Assert.java:47)
	at junit.framework.Assert.failNotEquals(Assert.java:280)
	at junit.framework.Assert.assertEquals(Assert.java:64)
	at junit.framework.Assert.assertEquals(Assert.java:71)
	at org.joda.time.format.TestPeriodFormat.test_wordBased_es_parseOneField(TestPeriodFormat.java:226)

test_wordBased_es_parseTwoFields(org.joda.time.format.TestPeriodFormat)  Time elapsed: 0.001 sec  <<< FAILURE!
junit.framework.AssertionFailedError: expected:<P2DT5H> but was:<PT0S>
	at junit.framework.Assert.fail(Assert.java:47)
	at junit.framework.Assert.failNotEquals(Assert.java:280)
	at junit.framework.Assert.assertEquals(Assert.java:64)
	at junit.framework.Assert.assertEquals(Assert.java:71)
	at org.joda.time.format.TestPeriodFormat.test_wordBased_es_parseTwoFields(TestPeriodFormat.java:232)

test_wordBased_de_parseOneField(org.joda.time.format.TestPeriodFormat)  Time elapsed: 0.001 sec  <<< FAILURE!
junit.framework.AssertionFailedError: expected:<P2D> but was:<PT0S>
	at junit.framework.Assert.fail(Assert.java:47)
	at junit.framework.Assert.failNotEquals(Assert.java:280)
	at junit.framework.Assert.assertEquals(Assert.java:64)
	at junit.framework.Assert.assertEquals(Assert.java:71)
	at org.joda.time.format.TestPeriodFormat.test_wordBased_de_parseOneField(TestPeriodFormat.java:263)

test_wordBased_de_parseTwoFields(org.joda.time.format.TestPeriodFormat)  Time elapsed: 0.001 sec  <<< FAILURE!
junit.framework.AssertionFailedError: expected:<P2DT5H> but was:<PT0S>
	at junit.framework.Assert.fail(Assert.java:47)
	at junit.framework.Assert.failNotEquals(Assert.java:280)
	at junit.framework.Assert.assertEquals(Assert.java:64)
	at junit.framework.Assert.assertEquals(Assert.java:71)
	at org.joda.time.format.TestPeriodFormat.test_wordBased_de_parseTwoFields(TestPeriodFormat.java:269)

test_wordBased_nl_parseOneField(org.joda.time.format.TestPeriodFormat)  Time elapsed: 0 sec  <<< FAILURE!
junit.framework.AssertionFailedError: expected:<P2D> but was:<PT0S>
	at junit.framework.Assert.fail(Assert.java:47)
	at junit.framework.Assert.failNotEquals(Assert.java:280)
	at junit.framework.Assert.assertEquals(Assert.java:64)
	at junit.framework.Assert.assertEquals(Assert.java:71)
	at org.joda.time.format.TestPeriodFormat.test_wordBased_nl_parseOneField(TestPeriodFormat.java:300)

test_wordBased_nl_parseTwoFields(org.joda.time.format.TestPeriodFormat)  Time elapsed: 0.001 sec  <<< FAILURE!
junit.framework.AssertionFailedError: expected:<P2DT5H> but was:<PT0S>
	at junit.framework.Assert.fail(Assert.java:47)
	at junit.framework.Assert.failNotEquals(Assert.java:280)
	at junit.framework.Assert.assertEquals(Assert.java:64)
	at junit.framework.Assert.assertEquals(Assert.java:71)
	at org.joda.time.format.TestPeriodFormat.test_wordBased_nl_parseTwoFields(TestPeriodFormat.java:306)

testParseStandard1(org.joda.time.format.TestISOPeriodFormatParsing)  Time elapsed: 0 sec  <<< FAILURE!
junit.framework.AssertionFailedError: expected:<P1Y2M3W4DT5H6M7.008S> but was:<PT0S>
	at junit.framework.Assert.fail(Assert.java:47)
	at junit.framework.Assert.failNotEquals(Assert.java:280)
	at junit.framework.Assert.assertEquals(Assert.java:64)
	at junit.framework.Assert.assertEquals(Assert.java:71)
	at org.joda.time.format.TestISOPeriodFormatParsing.testParseStandard1(TestISOPeriodFormatParsing.java:95)

testParseStandard2(org.joda.time.format.TestISOPeriodFormatParsing)  Time elapsed: 0 sec  <<< FAILURE!
junit.framework.AssertionFailedError: expected:<PT5H6M7.008S> but was:<PT0S>
	at junit.framework.Assert.fail(Assert.java:47)
	at junit.framework.Assert.failNotEquals(Assert.java:280)
	at junit.framework.Assert.assertEquals(Assert.java:64)
	at junit.framework.Assert.assertEquals(Assert.java:71)
	at org.joda.time.format.TestISOPeriodFormatParsing.testParseStandard2(TestISOPeriodFormatParsing.java:102)

testParseStandard3(org.joda.time.format.TestISOPeriodFormatParsing)  Time elapsed: 0 sec  <<< FAILURE!
junit.framework.AssertionFailedError: expected:<PT5H6M7.008S> but was:<PT0S>
	at junit.framework.Assert.fail(Assert.java:47)
	at junit.framework.Assert.failNotEquals(Assert.java:280)
	at junit.framework.Assert.assertEquals(Assert.java:64)
	at junit.framework.Assert.assertEquals(Assert.java:71)
	at org.joda.time.format.TestISOPeriodFormatParsing.testParseStandard3(TestISOPeriodFormatParsing.java:109)

testParseStandard4(org.joda.time.format.TestISOPeriodFormatParsing)  Time elapsed: 0.001 sec  <<< FAILURE!
junit.framework.AssertionFailedError: expected:<P2Y3DT5H6M7.008S> but was:<PT0S>
	at junit.framework.Assert.fail(Assert.java:47)
	at junit.framework.Assert.failNotEquals(Assert.java:280)
	at junit.framework.Assert.assertEquals(Assert.java:64)
	at junit.framework.Assert.assertEquals(Assert.java:71)
	at org.joda.time.format.TestISOPeriodFormatParsing.testParseStandard4(TestISOPeriodFormatParsing.java:116)

testParseStandard5(org.joda.time.format.TestISOPeriodFormatParsing)  Time elapsed: 0 sec  <<< FAILURE!
junit.framework.AssertionFailedError: expected:<P2YT5H6M7.008S> but was:<PT0S>
	at junit.framework.Assert.fail(Assert.java:47)
	at junit.framework.Assert.failNotEquals(Assert.java:280)
	at junit.framework.Assert.assertEquals(Assert.java:64)
	at junit.framework.Assert.assertEquals(Assert.java:71)
	at org.joda.time.format.TestISOPeriodFormatParsing.testParseStandard5(TestISOPeriodFormatParsing.java:123)

testParseStandard6(org.joda.time.format.TestISOPeriodFormatParsing)  Time elapsed: 0 sec  <<< FAILURE!
junit.framework.AssertionFailedError: expected:<PT5H6M7.008S> but was:<PT0S>
	at junit.framework.Assert.fail(Assert.java:47)
	at junit.framework.Assert.failNotEquals(Assert.java:280)
	at junit.framework.Assert.assertEquals(Assert.java:64)
	at junit.framework.Assert.assertEquals(Assert.java:71)
	at org.joda.time.format.TestISOPeriodFormatParsing.testParseStandard6(TestISOPeriodFormatParsing.java:130)

testParseStandard7(org.joda.time.format.TestISOPeriodFormatParsing)  Time elapsed: 0.007 sec  <<< FAILURE!
junit.framework.AssertionFailedError: expected:<P1Y2M3W4D> but was:<PT0S>
	at junit.framework.Assert.fail(Assert.java:47)
	at junit.framework.Assert.failNotEquals(Assert.java:280)
	at junit.framework.Assert.assertEquals(Assert.java:64)
	at junit.framework.Assert.assertEquals(Assert.java:71)
	at org.joda.time.format.TestISOPeriodFormatParsing.testParseStandard7(TestISOPeriodFormatParsing.java:137)

testParseStandard8(org.joda.time.format.TestISOPeriodFormatParsing)  Time elapsed: 0 sec  <<< FAILURE!
junit.framework.AssertionFailedError: expected:<PT5H6M7S> but was:<PT0S>
	at junit.framework.Assert.fail(Assert.java:47)
	at junit.framework.Assert.failNotEquals(Assert.java:280)
	at junit.framework.Assert.assertEquals(Assert.java:64)
	at junit.framework.Assert.assertEquals(Assert.java:71)
	at org.joda.time.format.TestISOPeriodFormatParsing.testParseStandard8(TestISOPeriodFormatParsing.java:144)

testParseStandard1(org.joda.time.format.TestPeriodFormatParsing)  Time elapsed: 0 sec  <<< FAILURE!
junit.framework.AssertionFailedError: expected:<P6Y3M2D> but was:<PT0S>
	at junit.framework.Assert.fail(Assert.java:47)
	at junit.framework.Assert.failNotEquals(Assert.java:280)
	at junit.framework.Assert.assertEquals(Assert.java:64)
	at junit.framework.Assert.assertEquals(Assert.java:71)
	at org.joda.time.format.TestPeriodFormatParsing.testParseStandard1(TestPeriodFormatParsing.java:95)

testParseNegativeMillis1(org.joda.time.format.TestPeriodFormatParsing)  Time elapsed: 0 sec  <<< FAILURE!
junit.framework.AssertionFailedError: expected:<PT-0.001S> but was:<PT0S>
	at junit.framework.Assert.fail(Assert.java:47)
	at junit.framework.Assert.failNotEquals(Assert.java:280)
	at junit.framework.Assert.assertEquals(Assert.java:64)
	at junit.framework.Assert.assertEquals(Assert.java:71)
	at org.joda.time.format.TestPeriodFormatParsing.testParseNegativeMillis1(TestPeriodFormatParsing.java:103)

testParseNegativeMillis2(org.joda.time.format.TestPeriodFormatParsing)  Time elapsed: 0 sec  <<< FAILURE!
junit.framework.AssertionFailedError: expected:<PT-0.999S> but was:<PT0S>
	at junit.framework.Assert.fail(Assert.java:47)
	at junit.framework.Assert.failNotEquals(Assert.java:280)
	at junit.framework.Assert.assertEquals(Assert.java:64)
	at junit.framework.Assert.assertEquals(Assert.java:71)
	at org.joda.time.format.TestPeriodFormatParsing.testParseNegativeMillis2(TestPeriodFormatParsing.java:111)

testParseCustom1(org.joda.time.format.TestPeriodFormatParsing)  Time elapsed: 0 sec  <<< FAILURE!
junit.framework.AssertionFailedError: expected:<PT47H55M> but was:<PT0S>
	at junit.framework.Assert.fail(Assert.java:47)
	at junit.framework.Assert.failNotEquals(Assert.java:280)
	at junit.framework.Assert.assertEquals(Assert.java:64)
	at junit.framework.Assert.assertEquals(Assert.java:71)
	at org.joda.time.format.TestPeriodFormatParsing.testParseCustom1(TestPeriodFormatParsing.java:127)

testFormatPrefixSimple4IgnoringPrefix(org.joda.time.format.TestPeriodFormatterBuilder)  Time elapsed: 0 sec  <<< FAILURE!
junit.framework.AssertionFailedError: expected:<PT0.001S> but was:<PT0S>
	at junit.framework.Assert.fail(Assert.java:47)
	at junit.framework.Assert.failNotEquals(Assert.java:280)
	at junit.framework.Assert.assertEquals(Assert.java:64)
	at junit.framework.Assert.assertEquals(Assert.java:71)
	at org.joda.time.format.TestPeriodFormatterBuilder.testFormatPrefixSimple4IgnoringPrefix(TestPeriodFormatterBuilder.java:349)

testPluralAffixParseOrder(org.joda.time.format.TestPeriodFormatterBuilder)  Time elapsed: 0 sec  <<< FAILURE!
junit.framework.AssertionFailedError: expected:<P2D> but was:<PT0S>
	at junit.framework.Assert.fail(Assert.java:47)
	at junit.framework.Assert.failNotEquals(Assert.java:280)
	at junit.framework.Assert.assertEquals(Assert.java:64)
	at junit.framework.Assert.assertEquals(Assert.java:71)
	at org.joda.time.format.TestPeriodFormatterBuilder.testPluralAffixParseOrder(TestPeriodFormatterBuilder.java:358)

testFormatPrefixPlural4IgnoringPrefix(org.joda.time.format.TestPeriodFormatterBuilder)  Time elapsed: 0.001 sec  <<< FAILURE!
junit.framework.AssertionFailedError: expected:<PT0.001S> but was:<PT0S>
	at junit.framework.Assert.fail(Assert.java:47)
	at junit.framework.Assert.failNotEquals(Assert.java:280)
	at junit.framework.Assert.assertEquals(Assert.java:64)
	at junit.framework.Assert.assertEquals(Assert.java:71)
	at org.joda.time.format.TestPeriodFormatterBuilder.testFormatPrefixPlural4IgnoringPrefix(TestPeriodFormatterBuilder.java:408)

testRegExAffixParseOrder(org.joda.time.format.TestPeriodFormatterBuilder)  Time elapsed: 0 sec  <<< FAILURE!
junit.framework.AssertionFailedError: expected:<P2D> but was:<PT0S>
	at junit.framework.Assert.fail(Assert.java:47)
	at junit.framework.Assert.failNotEquals(Assert.java:280)
	at junit.framework.Assert.assertEquals(Assert.java:64)
	at junit.framework.Assert.assertEquals(Assert.java:71)
	at org.joda.time.format.TestPeriodFormatterBuilder.testRegExAffixParseOrder(TestPeriodFormatterBuilder.java:425)

testFormatPrefixRegEx4IgnoringPrefix(org.joda.time.format.TestPeriodFormatterBuilder)  Time elapsed: 0.001 sec  <<< FAILURE!
junit.framework.AssertionFailedError: expected:<PT0.001S> but was:<PT0S>
	at junit.framework.Assert.fail(Assert.java:47)
	at junit.framework.Assert.failNotEquals(Assert.java:280)
	at junit.framework.Assert.assertEquals(Assert.java:64)
	at junit.framework.Assert.assertEquals(Assert.java:71)
	at org.joda.time.format.TestPeriodFormatterBuilder.testFormatPrefixRegEx4IgnoringPrefix(TestPeriodFormatterBuilder.java:493)

testFormatPrefixComposite1(org.joda.time.format.TestPeriodFormatterBuilder)  Time elapsed: 0.002 sec  <<< FAILURE!
junit.framework.AssertionFailedError: expected:<P2D> but was:<PT0S>
	at junit.framework.Assert.fail(Assert.java:47)
	at junit.framework.Assert.failNotEquals(Assert.java:280)
	at junit.framework.Assert.assertEquals(Assert.java:64)
	at junit.framework.Assert.assertEquals(Assert.java:71)
	at org.joda.time.format.TestPeriodFormatterBuilder.testFormatPrefixComposite1(TestPeriodFormatterBuilder.java:514)

testFormatPrefixSimple5IgnoringPrefix(org.joda.time.format.TestPeriodFormatterBuilder)  Time elapsed: 0.001 sec  <<< FAILURE!
junit.framework.AssertionFailedError: expected:<PT0.001S> but was:<PT0S>
	at junit.framework.Assert.fail(Assert.java:47)
	at junit.framework.Assert.failNotEquals(Assert.java:280)
	at junit.framework.Assert.assertEquals(Assert.java:64)
	at junit.framework.Assert.assertEquals(Assert.java:71)
	at org.joda.time.format.TestPeriodFormatterBuilder.testFormatPrefixSimple5IgnoringPrefix(TestPeriodFormatterBuilder.java:564)

testFormatPrefixSimple6IgnoringPrefix(org.joda.time.format.TestPeriodFormatterBuilder)  Time elapsed: 0 sec  <<< FAILURE!
junit.framework.AssertionFailedError: expected:<PT0.001S> but was:<PT0S>
	at junit.framework.Assert.fail(Assert.java:47)
	at junit.framework.Assert.failNotEquals(Assert.java:280)
	at junit.framework.Assert.assertEquals(Assert.java:64)
	at junit.framework.Assert.assertEquals(Assert.java:71)
	at org.joda.time.format.TestPeriodFormatterBuilder.testFormatPrefixSimple6IgnoringPrefix(TestPeriodFormatterBuilder.java:575)

testFormatSuffixPlural4IgnoringPrefix(org.joda.time.format.TestPeriodFormatterBuilder)  Time elapsed: 0.001 sec  <<< FAILURE!
junit.framework.AssertionFailedError: expected:<PT0.001S> but was:<PT0S>
	at junit.framework.Assert.fail(Assert.java:47)
	at junit.framework.Assert.failNotEquals(Assert.java:280)
	at junit.framework.Assert.assertEquals(Assert.java:64)
	at junit.framework.Assert.assertEquals(Assert.java:71)
	at org.joda.time.format.TestPeriodFormatterBuilder.testFormatSuffixPlural4IgnoringPrefix(TestPeriodFormatterBuilder.java:632)

testFormatSuffixRegEx5IgnoringAffix(org.joda.time.format.TestPeriodFormatterBuilder)  Time elapsed: 0.001 sec  <<< FAILURE!
junit.framework.AssertionFailedError: expected:<PT0.001S> but was:<PT0S>
	at junit.framework.Assert.fail(Assert.java:47)
	at junit.framework.Assert.failNotEquals(Assert.java:280)
	at junit.framework.Assert.assertEquals(Assert.java:64)
	at junit.framework.Assert.assertEquals(Assert.java:71)
	at org.joda.time.format.TestPeriodFormatterBuilder.testFormatSuffixRegEx5IgnoringAffix(TestPeriodFormatterBuilder.java:724)

testFormatSuffixComposite1(org.joda.time.format.TestPeriodFormatterBuilder)  Time elapsed: 0 sec  <<< FAILURE!
junit.framework.AssertionFailedError: expected:<P2D> but was:<PT0S>
	at junit.framework.Assert.fail(Assert.java:47)
	at junit.framework.Assert.failNotEquals(Assert.java:280)
	at junit.framework.Assert.assertEquals(Assert.java:64)
	at junit.framework.Assert.assertEquals(Assert.java:71)
	at org.joda.time.format.TestPeriodFormatterBuilder.testFormatSuffixComposite1(TestPeriodFormatterBuilder.java:744)

testFormatSuffixComposite5IgnoringAffix(org.joda.time.format.TestPeriodFormatterBuilder)  Time elapsed: 0 sec  <<< FAILURE!
junit.framework.AssertionFailedError: expected:<PT0.001S> but was:<PT0S>
	at junit.framework.Assert.fail(Assert.java:47)
	at junit.framework.Assert.failNotEquals(Assert.java:280)
	at junit.framework.Assert.assertEquals(Assert.java:64)
	at junit.framework.Assert.assertEquals(Assert.java:71)
	at org.joda.time.format.TestPeriodFormatterBuilder.testFormatSuffixComposite5IgnoringAffix(TestPeriodFormatterBuilder.java:758)

testFormatAppend_PrinterParser_null_Parser(org.joda.time.format.TestPeriodFormatterBuilder)  Time elapsed: 0 sec  <<< FAILURE!
junit.framework.AssertionFailedError: expected:<P2M1W> but was:<PT0S>
	at junit.framework.Assert.fail(Assert.java:47)
	at junit.framework.Assert.failNotEquals(Assert.java:280)
	at junit.framework.Assert.assertEquals(Assert.java:64)
	at junit.framework.Assert.assertEquals(Assert.java:71)
	at org.joda.time.format.TestPeriodFormatterBuilder.testFormatAppend_PrinterParser_null_Parser(TestPeriodFormatterBuilder.java:1104)

testFormatAppend_PrinterParser_PrinterParser(org.joda.time.format.TestPeriodFormatterBuilder)  Time elapsed: 0 sec  <<< FAILURE!
junit.framework.AssertionFailedError: expected:<P2M1W> but was:<PT0S>
	at junit.framework.Assert.fail(Assert.java:47)
	at junit.framework.Assert.failNotEquals(Assert.java:280)
	at junit.framework.Assert.assertEquals(Assert.java:64)
	at junit.framework.Assert.assertEquals(Assert.java:71)
	at org.joda.time.format.TestPeriodFormatterBuilder.testFormatAppend_PrinterParser_PrinterParser(TestPeriodFormatterBuilder.java:1116)

testMonthsAndMinutesAreConsideredSeparateAndCaseIsNotIgnored(org.joda.time.format.TestPeriodFormatterBuilder)  Time elapsed: 0.001 sec  <<< FAILURE!
junit.framework.AssertionFailedError: expected:<P1M> but was:<PT0S>
	at junit.framework.Assert.fail(Assert.java:47)
	at junit.framework.Assert.failNotEquals(Assert.java:280)
	at junit.framework.Assert.assertEquals(Assert.java:64)
	at junit.framework.Assert.assertEquals(Assert.java:71)
	at org.joda.time.format.TestPeriodFormatterBuilder.testMonthsAndMinutesAreConsideredSeparateAndCaseIsNotIgnored(TestPeriodFormatterBuilder.java:1180)


Results :

Failed tests: 
  org.joda.time.TestDays#testFactory_parseDays_String AssertionFailedError expec...
  org.joda.time.TestDuration_Basics#testToPeriod_Chronology AssertionFailedError
  org.joda.time.TestDuration_Basics#testToPeriod_PeriodType AssertionFailedError
  org.joda.time.TestDuration_Basics#testToPeriod_PeriodType_Chronology AssertionFailedError
  org.joda.time.TestHours#testFactory_parseHours_String AssertionFailedError exp...
  org.joda.time.TestInterval_Constructors#testParse_noFormatter AssertionFailedError
  org.joda.time.TestMinutes#testFactory_parseMinutes_String AssertionFailedError
  org.joda.time.TestMonths#testFactory_parseMonths_String AssertionFailedError e...
  org.joda.time.TestMutableInterval_Constructors#testParse_noFormatter AssertionFailedError
  org.joda.time.TestMutablePeriod_Basics#testToMutablePeriod AssertionFailedError
  org.joda.time.TestMutablePeriod_Basics#testToPeriod AssertionFailedError expec...
  org.joda.time.TestMutablePeriod_Constructors#testConstructor_Object1 AssertionFailedError
  org.joda.time.TestMutablePeriod_Constructors#testConstructor_Object3 AssertionFailedError
  org.joda.time.TestMutablePeriod_Constructors#testConstructor_Object4 AssertionFailedError
  org.joda.time.TestMutablePeriod_Constructors#testConstructor_Object_Chronology1 AssertionFailedError
  org.joda.time.TestMutablePeriod_Constructors#testConstructor_Object_Chronology2 AssertionFailedError
  org.joda.time.TestMutablePeriod_Constructors#testConstructor_Object_PeriodType1 AssertionFailedError
  org.joda.time.TestMutablePeriod_Constructors#testConstructor_Object_PeriodType3 AssertionFailedError
  org.joda.time.TestMutablePeriod_Constructors#testConstructor_Object_PeriodType4 AssertionFailedError
  org.joda.time.TestMutablePeriod_Constructors#testParse_noFormatter AssertionFailedError
  org.joda.time.TestPeriod_Basics#testToMutablePeriod AssertionFailedError expec...
  org.joda.time.TestPeriod_Basics#testWithPeriodType2 AssertionFailedError expec...
  org.joda.time.TestPeriod_Basics#testWithPeriodType3 AssertionFailedError
  org.joda.time.TestPeriod_Basics#testWithPeriodType5 AssertionFailedError expec...
  org.joda.time.TestPeriod_Constructors#testConstructor_Object1 AssertionFailedError
  org.joda.time.TestPeriod_Constructors#testConstructor_Object3 AssertionFailedError
  org.joda.time.TestPeriod_Constructors#testConstructor_Object4 AssertionFailedError
  org.joda.time.TestPeriod_Constructors#testConstructor_Object_PeriodType1 AssertionFailedError
  org.joda.time.TestPeriod_Constructors#testConstructor_Object_PeriodType3 AssertionFailedError
  org.joda.time.TestPeriod_Constructors#testConstructor_Object_PeriodType4 AssertionFailedError
  org.joda.time.TestPeriod_Constructors#testParse_noFormatter AssertionFailedError
  org.joda.time.TestSeconds#testFactory_parseSeconds_String AssertionFailedError
  org.joda.time.TestStringConvert#testDays AssertionFailedError expected:<P5D> b...
  org.joda.time.TestStringConvert#testHours AssertionFailedError expected:<PT5H>...
  org.joda.time.TestStringConvert#testMinutes AssertionFailedError expected:<PT5...
  org.joda.time.TestStringConvert#testMonths AssertionFailedError expected:<P5M>...
  org.joda.time.TestStringConvert#testMutablePeriod AssertionFailedError expecte...
  org.joda.time.TestStringConvert#testPeriod AssertionFailedError expected:<P1Y2...
  org.joda.time.TestStringConvert#testSeconds AssertionFailedError expected:<PT5...
  org.joda.time.TestStringConvert#testWeeks AssertionFailedError expected:<P5W> ...
  org.joda.time.TestStringConvert#testYears AssertionFailedError expected:<P5Y> ...
  org.joda.time.TestWeeks#testFactory_parseWeeks_String AssertionFailedError exp...
  org.joda.time.TestYears#testFactory_parseYears_String AssertionFailedError exp...
  org.joda.time.convert.TestConverterManager#testAddPeriodConverter1 AssertionFailedError
  org.joda.time.convert.TestConverterManager#testAddPeriodConverter2 AssertionFailedError
  org.joda.time.convert.TestConverterManager#testGetPeriodConverter AssertionFailedError
  org.joda.time.convert.TestStringConverter#testSetIntoInterval_Object_Chronology1 AssertionFailedError
  org.joda.time.convert.TestStringConverter#testSetIntoInterval_Object_Chronology2 AssertionFailedError
  org.joda.time.convert.TestStringConverter#testSetIntoInterval_Object_Chronology4 AssertionFailedError
  org.joda.time.convert.TestStringConverter#testSetIntoInterval_Object_Chronology5 AssertionFailedError
  org.joda.time.format.TestISOPeriodFormatParsing#testParseStandard1 AssertionFailedError
  org.joda.time.format.TestISOPeriodFormatParsing#testParseStandard2 AssertionFailedError
  org.joda.time.format.TestISOPeriodFormatParsing#testParseStandard3 AssertionFailedError
  org.joda.time.format.TestISOPeriodFormatParsing#testParseStandard4 AssertionFailedError
  org.joda.time.format.TestISOPeriodFormatParsing#testParseStandard5 AssertionFailedError
  org.joda.time.format.TestISOPeriodFormatParsing#testParseStandard6 AssertionFailedError
  org.joda.time.format.TestISOPeriodFormatParsing#testParseStandard7 AssertionFailedError
  org.joda.time.format.TestISOPeriodFormatParsing#testParseStandard8 AssertionFailedError
  org.joda.time.format.TestPeriodFormat#test_getDefault_parseOneField AssertionFailedError
  org.joda.time.format.TestPeriodFormat#test_getDefault_parseTwoFields AssertionFailedError
  org.joda.time.format.TestPeriodFormat#test_wordBased_de_parseOneField AssertionFailedError
  org.joda.time.format.TestPeriodFormat#test_wordBased_de_parseTwoFields AssertionFailedError
  org.joda.time.format.TestPeriodFormat#test_wordBased_en_withLocale_pt AssertionFailedError
  org.joda.time.format.TestPeriodFormat#test_wordBased_es_parseOneField AssertionFailedError
  org.joda.time.format.TestPeriodFormat#test_wordBased_es_parseTwoFields AssertionFailedError
  org.joda.time.format.TestPeriodFormat#test_wordBased_fr_parseOneField AssertionFailedError
  org.joda.time.format.TestPeriodFormat#test_wordBased_fr_parseTwoFields AssertionFailedError
  org.joda.time.format.TestPeriodFormat#test_wordBased_ja_parseOneField AssertionFailedError
  org.joda.time.format.TestPeriodFormat#test_wordBased_ja_parseTwoFields AssertionFailedError
  org.joda.time.format.TestPeriodFormat#test_wordBased_nl_parseOneField AssertionFailedError
  org.joda.time.format.TestPeriodFormat#test_wordBased_nl_parseTwoFields AssertionFailedError
  org.joda.time.format.TestPeriodFormat#test_wordBased_pl_parseOneField AssertionFailedError
  org.joda.time.format.TestPeriodFormat#test_wordBased_pl_parseTwoFields AssertionFailedError
  org.joda.time.format.TestPeriodFormat#test_wordBased_pt_parseOneField AssertionFailedError
  org.joda.time.format.TestPeriodFormat#test_wordBased_pt_parseTwoFields AssertionFailedError
  org.joda.time.format.TestPeriodFormatParsing#testParseCustom1 AssertionFailedError
  org.joda.time.format.TestPeriodFormatParsing#testParseNegativeMillis1 AssertionFailedError
  org.joda.time.format.TestPeriodFormatParsing#testParseNegativeMillis2 AssertionFailedError
  org.joda.time.format.TestPeriodFormatParsing#testParseStandard1 AssertionFailedError
  org.joda.time.format.TestPeriodFormatter#testParsePeriod_parseType AssertionFailedError
  org.joda.time.format.TestPeriodFormatter#testParsePeriod_simple AssertionFailedError
  org.joda.time.format.TestPeriodFormatterBuilder#testFormatAppend_PrinterParser_PrinterParser AssertionFailedError
  org.joda.time.format.TestPeriodFormatterBuilder#testFormatAppend_PrinterParser_null_Parser AssertionFailedError
  org.joda.time.format.TestPeriodFormatterBuilder#testFormatPrefixComposite1 AssertionFailedError
  org.joda.time.format.TestPeriodFormatterBuilder#testFormatPrefixPlural4IgnoringPrefix AssertionFailedError
  org.joda.time.format.TestPeriodFormatterBuilder#testFormatPrefixRegEx4IgnoringPrefix AssertionFailedError
  org.joda.time.format.TestPeriodFormatterBuilder#testFormatPrefixSimple4IgnoringPrefix AssertionFailedError
  org.joda.time.format.TestPeriodFormatterBuilder#testFormatPrefixSimple5IgnoringPrefix AssertionFailedError
  org.joda.time.format.TestPeriodFormatterBuilder#testFormatPrefixSimple6IgnoringPrefix AssertionFailedError
  org.joda.time.format.TestPeriodFormatterBuilder#testFormatSuffixComposite1 AssertionFailedError
  org.joda.time.format.TestPeriodFormatterBuilder#testFormatSuffixComposite5IgnoringAffix AssertionFailedError
  org.joda.time.format.TestPeriodFormatterBuilder#testFormatSuffixPlural4IgnoringPrefix AssertionFailedError
  org.joda.time.format.TestPeriodFormatterBuilder#testFormatSuffixRegEx5IgnoringAffix AssertionFailedError
  org.joda.time.format.TestPeriodFormatterBuilder#testMonthsAndMinutesAreConsideredSeparateAndCaseIsNotIgnored AssertionFailedError
  org.joda.time.format.TestPeriodFormatterBuilder#testPluralAffixParseOrder AssertionFailedError
  org.joda.time.format.TestPeriodFormatterBuilder#testRegExAffixParseOrder AssertionFailedError
Tests in error: 
  org.joda.time.TestMutablePeriod_Constructors#testConstructor_Object2 NullPointerException
  org.joda.time.TestMutablePeriod_Constructors#testConstructor_Object_PeriodType2 NullPointerException
  org.joda.time.TestPeriod_Constructors#testConstructor_Object2 NullPointerException
  org.joda.time.TestPeriod_Constructors#testConstructor_Object_PeriodType2 NullPointerException
  org.joda.time.convert.TestConverterManager#testGetPeriodConverterRemovedNull NullPointerException

Tests run: 4157, Failures: 96, Errors: 5, Skipped: 0

[INFO] ------------------------------------------------------------------------
[INFO] BUILD FAILURE
[INFO] ------------------------------------------------------------------------
[INFO] Total time: 15.777s
[INFO] Finished at: Thu Aug 06 02:50:30 BST 2015
[INFO] Final Memory: 8M/218M
[INFO] ------------------------------------------------------------------------
[ERROR] Failed to execute goal org.apache.maven.plugins:maven-surefire-plugin:2.18.1:test (default-test) on project joda-time: There are test failures.
[ERROR] 
[ERROR] Please refer to /home/perham/Study/LittleDarwin/Cases/joda-time-2.8.1/target/surefire-reports for the individual test results.
[ERROR] -> [Help 1]
[ERROR] 
[ERROR] To see the full stack trace of the errors, re-run Maven with the -e switch.
[ERROR] Re-run Maven using the -X switch to enable full debug logging.
[ERROR] 
[ERROR] For more information about the errors and possible solutions, please read the following articles:
[ERROR] [Help 1] http://cwiki.apache.org/confluence/display/MAVEN/MojoFailureException
