[INFO] Scanning for projects...
[INFO]                                                                         
[INFO] ------------------------------------------------------------------------
[INFO] Building Joda-Time 2.8.1
[INFO] ------------------------------------------------------------------------
[INFO] 
[INFO] --- maven-resources-plugin:2.7:resources (default-resources) @ joda-time ---
[INFO] Using 'UTF-8' encoding to copy filtered resources.
[INFO] Copying 2 resources to META-INF
[INFO] Copying 10 resources
[INFO] 
[INFO] --- maven-compiler-plugin:3.3:compile (default-compile) @ joda-time ---
[INFO] Changes detected - recompiling the module!
[INFO] Compiling 166 source files to /home/perham/Study/LittleDarwin/Cases/joda-time-2.8.1/target/classes
[INFO] 
[INFO] --- exec-maven-plugin:1.4.0:java (compile-tzdb) @ joda-time ---
Writing zoneinfo files
Writing ZoneInfoMap
[INFO] 
[INFO] --- maven-resources-plugin:2.7:testResources (default-testResources) @ joda-time ---
[INFO] Using 'UTF-8' encoding to copy filtered resources.
[INFO] Copying 34 resources
[INFO] 
[INFO] --- maven-compiler-plugin:3.3:testCompile (default-testCompile) @ joda-time ---
[INFO] Nothing to compile - all classes are up to date
[INFO] 
[INFO] --- maven-surefire-plugin:2.18.1:test (default-test) @ joda-time ---
[INFO] Surefire report directory: /home/perham/Study/LittleDarwin/Cases/joda-time-2.8.1/target/surefire-reports

-------------------------------------------------------
 T E S T S
-------------------------------------------------------
Running org.joda.time.TestAllPackages

TestBuddhistChronology.testCalendar

TestCopticChronology.testCalendar

TestEthiopicChronology.testCalendar

TestIslamicChronology.testCalendar

Testing Gregorian chronology over 1000 iterations
100% complete (i=1000)

Testing Julian chronology over 1000 iterations
100% complete (i=1000)
Writing zoneinfo files
Writing ZoneInfoMap
Tests run: 4157, Failures: 1, Errors: 104, Skipped: 0, Time elapsed: 5.369 sec <<< FAILURE! - in org.joda.time.TestAllPackages
testToPeriod_PeriodType(org.joda.time.TestDuration_Basics)  Time elapsed: 0.004 sec  <<< ERROR!
java.lang.IllegalArgumentException: No period converter found for type: org.joda.time.Duration
	at org.joda.time.convert.ConverterManager.getPeriodConverter(ConverterManager.java:83)
	at org.joda.time.base.BasePeriod.<init>(BasePeriod.java:272)
	at org.joda.time.Period.<init>(Period.java:691)
	at org.joda.time.TestDuration_Basics.testToPeriod_PeriodType(TestDuration_Basics.java:503)

testToPeriod_Chronology(org.joda.time.TestDuration_Basics)  Time elapsed: 0 sec  <<< ERROR!
java.lang.IllegalArgumentException: No period converter found for type: org.joda.time.Duration
	at org.joda.time.convert.ConverterManager.getPeriodConverter(ConverterManager.java:83)
	at org.joda.time.base.BasePeriod.<init>(BasePeriod.java:272)
	at org.joda.time.Period.<init>(Period.java:708)
	at org.joda.time.TestDuration_Basics.testToPeriod_Chronology(TestDuration_Basics.java:516)

testToPeriod_PeriodType_Chronology(org.joda.time.TestDuration_Basics)  Time elapsed: 0.001 sec  <<< ERROR!
java.lang.IllegalArgumentException: No period converter found for type: org.joda.time.Duration
	at org.joda.time.convert.ConverterManager.getPeriodConverter(ConverterManager.java:83)
	at org.joda.time.base.BasePeriod.<init>(BasePeriod.java:272)
	at org.joda.time.Period.<init>(Period.java:726)
	at org.joda.time.TestDuration_Basics.testToPeriod_PeriodType_Chronology(TestDuration_Basics.java:529)

testParse_noFormatter(org.joda.time.TestInterval_Constructors)  Time elapsed: 0.003 sec  <<< ERROR!
java.lang.IllegalArgumentException: No period converter found for type: org.joda.time.MutablePeriod
	at org.joda.time.convert.ConverterManager.getPeriodConverter(ConverterManager.java:83)
	at org.joda.time.base.BasePeriod.<init>(BasePeriod.java:272)
	at org.joda.time.Period.<init>(Period.java:674)
	at org.joda.time.base.AbstractPeriod.toPeriod(AbstractPeriod.java:147)
	at org.joda.time.format.PeriodFormatter.parsePeriod(PeriodFormatter.java:308)
	at org.joda.time.convert.StringConverter.setInto(StringConverter.java:223)
	at org.joda.time.base.BaseInterval.<init>(BaseInterval.java:200)
	at org.joda.time.Interval.<init>(Interval.java:193)
	at org.joda.time.Interval.parse(Interval.java:69)
	at org.joda.time.TestInterval_Constructors.testParse_noFormatter(TestInterval_Constructors.java:109)

testParse_noFormatter(org.joda.time.TestMutableInterval_Constructors)  Time elapsed: 0.001 sec  <<< ERROR!
java.lang.IllegalArgumentException: No period converter found for type: org.joda.time.MutablePeriod
	at org.joda.time.convert.ConverterManager.getPeriodConverter(ConverterManager.java:83)
	at org.joda.time.base.BasePeriod.<init>(BasePeriod.java:272)
	at org.joda.time.Period.<init>(Period.java:674)
	at org.joda.time.base.AbstractPeriod.toPeriod(AbstractPeriod.java:147)
	at org.joda.time.format.PeriodFormatter.parsePeriod(PeriodFormatter.java:308)
	at org.joda.time.convert.StringConverter.setInto(StringConverter.java:223)
	at org.joda.time.base.BaseInterval.<init>(BaseInterval.java:197)
	at org.joda.time.MutableInterval.<init>(MutableInterval.java:186)
	at org.joda.time.MutableInterval.parse(MutableInterval.java:71)
	at org.joda.time.TestMutableInterval_Constructors.testParse_noFormatter(TestMutableInterval_Constructors.java:115)

testParse_noFormatter(org.joda.time.TestPeriod_Constructors)  Time elapsed: 0.001 sec  <<< ERROR!
java.lang.IllegalArgumentException: No period converter found for type: org.joda.time.MutablePeriod
	at org.joda.time.convert.ConverterManager.getPeriodConverter(ConverterManager.java:83)
	at org.joda.time.base.BasePeriod.<init>(BasePeriod.java:272)
	at org.joda.time.Period.<init>(Period.java:674)
	at org.joda.time.base.AbstractPeriod.toPeriod(AbstractPeriod.java:147)
	at org.joda.time.format.PeriodFormatter.parsePeriod(PeriodFormatter.java:308)
	at org.joda.time.Period.parse(Period.java:92)
	at org.joda.time.Period.parse(Period.java:81)
	at org.joda.time.TestPeriod_Constructors.testParse_noFormatter(TestPeriod_Constructors.java:104)

testConstructor_Object1(org.joda.time.TestPeriod_Constructors)  Time elapsed: 0 sec  <<< ERROR!
java.lang.IllegalArgumentException: No period converter found for type: java.lang.String
	at org.joda.time.convert.ConverterManager.getPeriodConverter(ConverterManager.java:83)
	at org.joda.time.base.BasePeriod.<init>(BasePeriod.java:272)
	at org.joda.time.Period.<init>(Period.java:674)
	at org.joda.time.TestPeriod_Constructors.testConstructor_Object1(TestPeriod_Constructors.java:1145)

testConstructor_Object2(org.joda.time.TestPeriod_Constructors)  Time elapsed: 0.001 sec  <<< ERROR!
java.lang.IllegalArgumentException: No period converter found for type: null
	at org.joda.time.convert.ConverterManager.getPeriodConverter(ConverterManager.java:83)
	at org.joda.time.base.BasePeriod.<init>(BasePeriod.java:272)
	at org.joda.time.Period.<init>(Period.java:674)
	at org.joda.time.TestPeriod_Constructors.testConstructor_Object2(TestPeriod_Constructors.java:1158)

testConstructor_Object3(org.joda.time.TestPeriod_Constructors)  Time elapsed: 0.001 sec  <<< ERROR!
java.lang.IllegalArgumentException: No period converter found for type: org.joda.time.Period
	at org.joda.time.convert.ConverterManager.getPeriodConverter(ConverterManager.java:83)
	at org.joda.time.base.BasePeriod.<init>(BasePeriod.java:272)
	at org.joda.time.Period.<init>(Period.java:674)
	at org.joda.time.TestPeriod_Constructors.testConstructor_Object3(TestPeriod_Constructors.java:1171)

testConstructor_Object4(org.joda.time.TestPeriod_Constructors)  Time elapsed: 0.001 sec  <<< ERROR!
java.lang.IllegalArgumentException: No period converter found for type: org.joda.time.Period
	at org.joda.time.convert.ConverterManager.getPeriodConverter(ConverterManager.java:83)
	at org.joda.time.base.BasePeriod.<init>(BasePeriod.java:272)
	at org.joda.time.Period.<init>(Period.java:674)
	at org.joda.time.TestPeriod_Constructors.testConstructor_Object4(TestPeriod_Constructors.java:1185)

testConstructor_Object_PeriodType1(org.joda.time.TestPeriod_Constructors)  Time elapsed: 0.001 sec  <<< ERROR!
java.lang.IllegalArgumentException: No period converter found for type: java.lang.String
	at org.joda.time.convert.ConverterManager.getPeriodConverter(ConverterManager.java:83)
	at org.joda.time.base.BasePeriod.<init>(BasePeriod.java:272)
	at org.joda.time.Period.<init>(Period.java:691)
	at org.joda.time.TestPeriod_Constructors.testConstructor_Object_PeriodType1(TestPeriod_Constructors.java:1202)

testConstructor_Object_PeriodType2(org.joda.time.TestPeriod_Constructors)  Time elapsed: 0 sec  <<< ERROR!
java.lang.IllegalArgumentException: No period converter found for type: null
	at org.joda.time.convert.ConverterManager.getPeriodConverter(ConverterManager.java:83)
	at org.joda.time.base.BasePeriod.<init>(BasePeriod.java:272)
	at org.joda.time.Period.<init>(Period.java:691)
	at org.joda.time.TestPeriod_Constructors.testConstructor_Object_PeriodType2(TestPeriod_Constructors.java:1215)

testConstructor_Object_PeriodType3(org.joda.time.TestPeriod_Constructors)  Time elapsed: 0.001 sec  <<< ERROR!
java.lang.IllegalArgumentException: No period converter found for type: org.joda.time.Period
	at org.joda.time.convert.ConverterManager.getPeriodConverter(ConverterManager.java:83)
	at org.joda.time.base.BasePeriod.<init>(BasePeriod.java:272)
	at org.joda.time.Period.<init>(Period.java:691)
	at org.joda.time.TestPeriod_Constructors.testConstructor_Object_PeriodType3(TestPeriod_Constructors.java:1228)

testConstructor_Object_PeriodType4(org.joda.time.TestPeriod_Constructors)  Time elapsed: 0 sec  <<< ERROR!
java.lang.IllegalArgumentException: No period converter found for type: org.joda.time.Period
	at org.joda.time.convert.ConverterManager.getPeriodConverter(ConverterManager.java:83)
	at org.joda.time.base.BasePeriod.<init>(BasePeriod.java:272)
	at org.joda.time.Period.<init>(Period.java:691)
	at org.joda.time.TestPeriod_Constructors.testConstructor_Object_PeriodType4(TestPeriod_Constructors.java:1241)

testToMutablePeriod(org.joda.time.TestPeriod_Basics)  Time elapsed: 0.001 sec  <<< ERROR!
java.lang.IllegalArgumentException: No period converter found for type: org.joda.time.Period
	at org.joda.time.convert.ConverterManager.getPeriodConverter(ConverterManager.java:83)
	at org.joda.time.base.BasePeriod.<init>(BasePeriod.java:272)
	at org.joda.time.MutablePeriod.<init>(MutablePeriod.java:374)
	at org.joda.time.base.AbstractPeriod.toMutablePeriod(AbstractPeriod.java:158)
	at org.joda.time.TestPeriod_Basics.testToMutablePeriod(TestPeriod_Basics.java:504)

testWithPeriodType2(org.joda.time.TestPeriod_Basics)  Time elapsed: 0.001 sec  <<< ERROR!
java.lang.IllegalArgumentException: No period converter found for type: org.joda.time.Period
	at org.joda.time.convert.ConverterManager.getPeriodConverter(ConverterManager.java:83)
	at org.joda.time.base.BasePeriod.<init>(BasePeriod.java:272)
	at org.joda.time.Period.<init>(Period.java:691)
	at org.joda.time.Period.withPeriodType(Period.java:840)
	at org.joda.time.TestPeriod_Basics.testWithPeriodType2(TestPeriod_Basics.java:533)

testWithPeriodType5(org.joda.time.TestPeriod_Basics)  Time elapsed: 0.001 sec  <<< ERROR!
java.lang.IllegalArgumentException: No period converter found for type: org.joda.time.Period
	at org.joda.time.convert.ConverterManager.getPeriodConverter(ConverterManager.java:83)
	at org.joda.time.base.BasePeriod.<init>(BasePeriod.java:272)
	at org.joda.time.Period.<init>(Period.java:691)
	at org.joda.time.Period.withPeriodType(Period.java:840)
	at org.joda.time.TestPeriod_Basics.testWithPeriodType5(TestPeriod_Basics.java:557)

testParse_noFormatter(org.joda.time.TestMutablePeriod_Constructors)  Time elapsed: 0 sec  <<< ERROR!
java.lang.IllegalArgumentException: No period converter found for type: org.joda.time.MutablePeriod
	at org.joda.time.convert.ConverterManager.getPeriodConverter(ConverterManager.java:83)
	at org.joda.time.base.BasePeriod.<init>(BasePeriod.java:272)
	at org.joda.time.Period.<init>(Period.java:674)
	at org.joda.time.base.AbstractPeriod.toPeriod(AbstractPeriod.java:147)
	at org.joda.time.format.PeriodFormatter.parsePeriod(PeriodFormatter.java:308)
	at org.joda.time.MutablePeriod.parse(MutablePeriod.java:85)
	at org.joda.time.MutablePeriod.parse(MutablePeriod.java:74)
	at org.joda.time.TestMutablePeriod_Constructors.testParse_noFormatter(TestMutablePeriod_Constructors.java:102)

testConstructor_Object1(org.joda.time.TestMutablePeriod_Constructors)  Time elapsed: 0 sec  <<< ERROR!
java.lang.IllegalArgumentException: No period converter found for type: java.lang.String
	at org.joda.time.convert.ConverterManager.getPeriodConverter(ConverterManager.java:83)
	at org.joda.time.base.BasePeriod.<init>(BasePeriod.java:272)
	at org.joda.time.MutablePeriod.<init>(MutablePeriod.java:374)
	at org.joda.time.TestMutablePeriod_Constructors.testConstructor_Object1(TestMutablePeriod_Constructors.java:827)

testConstructor_Object2(org.joda.time.TestMutablePeriod_Constructors)  Time elapsed: 0.001 sec  <<< ERROR!
java.lang.IllegalArgumentException: No period converter found for type: null
	at org.joda.time.convert.ConverterManager.getPeriodConverter(ConverterManager.java:83)
	at org.joda.time.base.BasePeriod.<init>(BasePeriod.java:272)
	at org.joda.time.MutablePeriod.<init>(MutablePeriod.java:374)
	at org.joda.time.TestMutablePeriod_Constructors.testConstructor_Object2(TestMutablePeriod_Constructors.java:840)

testConstructor_Object3(org.joda.time.TestMutablePeriod_Constructors)  Time elapsed: 0 sec  <<< ERROR!
java.lang.IllegalArgumentException: No period converter found for type: org.joda.time.Period
	at org.joda.time.convert.ConverterManager.getPeriodConverter(ConverterManager.java:83)
	at org.joda.time.base.BasePeriod.<init>(BasePeriod.java:272)
	at org.joda.time.MutablePeriod.<init>(MutablePeriod.java:374)
	at org.joda.time.TestMutablePeriod_Constructors.testConstructor_Object3(TestMutablePeriod_Constructors.java:853)

testConstructor_Object4(org.joda.time.TestMutablePeriod_Constructors)  Time elapsed: 0 sec  <<< ERROR!
java.lang.IllegalArgumentException: No period converter found for type: org.joda.time.Period
	at org.joda.time.convert.ConverterManager.getPeriodConverter(ConverterManager.java:83)
	at org.joda.time.base.BasePeriod.<init>(BasePeriod.java:272)
	at org.joda.time.MutablePeriod.<init>(MutablePeriod.java:374)
	at org.joda.time.TestMutablePeriod_Constructors.testConstructor_Object4(TestMutablePeriod_Constructors.java:867)

testConstructor_Object_Chronology1(org.joda.time.TestMutablePeriod_Constructors)  Time elapsed: 0 sec  <<< ERROR!
java.lang.IllegalArgumentException: No period converter found for type: org.joda.time.Duration
	at org.joda.time.convert.ConverterManager.getPeriodConverter(ConverterManager.java:83)
	at org.joda.time.base.BasePeriod.<init>(BasePeriod.java:272)
	at org.joda.time.MutablePeriod.<init>(MutablePeriod.java:408)
	at org.joda.time.TestMutablePeriod_Constructors.testConstructor_Object_Chronology1(TestMutablePeriod_Constructors.java:942)

testConstructor_Object_Chronology2(org.joda.time.TestMutablePeriod_Constructors)  Time elapsed: 0 sec  <<< ERROR!
java.lang.IllegalArgumentException: No period converter found for type: org.joda.time.Duration
	at org.joda.time.convert.ConverterManager.getPeriodConverter(ConverterManager.java:83)
	at org.joda.time.base.BasePeriod.<init>(BasePeriod.java:272)
	at org.joda.time.MutablePeriod.<init>(MutablePeriod.java:408)
	at org.joda.time.TestMutablePeriod_Constructors.testConstructor_Object_Chronology2(TestMutablePeriod_Constructors.java:960)

testConstructor_Object_PeriodType1(org.joda.time.TestMutablePeriod_Constructors)  Time elapsed: 0.001 sec  <<< ERROR!
java.lang.IllegalArgumentException: No period converter found for type: java.lang.String
	at org.joda.time.convert.ConverterManager.getPeriodConverter(ConverterManager.java:83)
	at org.joda.time.base.BasePeriod.<init>(BasePeriod.java:272)
	at org.joda.time.MutablePeriod.<init>(MutablePeriod.java:391)
	at org.joda.time.TestMutablePeriod_Constructors.testConstructor_Object_PeriodType1(TestMutablePeriod_Constructors.java:884)

testConstructor_Object_PeriodType2(org.joda.time.TestMutablePeriod_Constructors)  Time elapsed: 0 sec  <<< ERROR!
java.lang.IllegalArgumentException: No period converter found for type: null
	at org.joda.time.convert.ConverterManager.getPeriodConverter(ConverterManager.java:83)
	at org.joda.time.base.BasePeriod.<init>(BasePeriod.java:272)
	at org.joda.time.MutablePeriod.<init>(MutablePeriod.java:391)
	at org.joda.time.TestMutablePeriod_Constructors.testConstructor_Object_PeriodType2(TestMutablePeriod_Constructors.java:897)

testConstructor_Object_PeriodType3(org.joda.time.TestMutablePeriod_Constructors)  Time elapsed: 0 sec  <<< ERROR!
java.lang.IllegalArgumentException: No period converter found for type: org.joda.time.Period
	at org.joda.time.convert.ConverterManager.getPeriodConverter(ConverterManager.java:83)
	at org.joda.time.base.BasePeriod.<init>(BasePeriod.java:272)
	at org.joda.time.MutablePeriod.<init>(MutablePeriod.java:391)
	at org.joda.time.TestMutablePeriod_Constructors.testConstructor_Object_PeriodType3(TestMutablePeriod_Constructors.java:910)

testConstructor_Object_PeriodType4(org.joda.time.TestMutablePeriod_Constructors)  Time elapsed: 0.001 sec  <<< ERROR!
java.lang.IllegalArgumentException: No period converter found for type: org.joda.time.Period
	at org.joda.time.convert.ConverterManager.getPeriodConverter(ConverterManager.java:83)
	at org.joda.time.base.BasePeriod.<init>(BasePeriod.java:272)
	at org.joda.time.MutablePeriod.<init>(MutablePeriod.java:391)
	at org.joda.time.TestMutablePeriod_Constructors.testConstructor_Object_PeriodType4(TestMutablePeriod_Constructors.java:923)

testToMutablePeriod(org.joda.time.TestMutablePeriod_Basics)  Time elapsed: 0 sec  <<< ERROR!
java.lang.IllegalArgumentException: No period converter found for type: org.joda.time.MutablePeriod
	at org.joda.time.convert.ConverterManager.getPeriodConverter(ConverterManager.java:83)
	at org.joda.time.base.BasePeriod.<init>(BasePeriod.java:272)
	at org.joda.time.MutablePeriod.<init>(MutablePeriod.java:374)
	at org.joda.time.base.AbstractPeriod.toMutablePeriod(AbstractPeriod.java:158)
	at org.joda.time.TestMutablePeriod_Basics.testToMutablePeriod(TestMutablePeriod_Basics.java:423)

testToPeriod(org.joda.time.TestMutablePeriod_Basics)  Time elapsed: 0.001 sec  <<< ERROR!
java.lang.IllegalArgumentException: No period converter found for type: org.joda.time.MutablePeriod
	at org.joda.time.convert.ConverterManager.getPeriodConverter(ConverterManager.java:83)
	at org.joda.time.base.BasePeriod.<init>(BasePeriod.java:272)
	at org.joda.time.Period.<init>(Period.java:674)
	at org.joda.time.base.AbstractPeriod.toPeriod(AbstractPeriod.java:147)
	at org.joda.time.TestMutablePeriod_Basics.testToPeriod(TestMutablePeriod_Basics.java:417)

testFactory_parseYears_String(org.joda.time.TestYears)  Time elapsed: 0 sec  <<< ERROR!
java.lang.IllegalArgumentException: No period converter found for type: org.joda.time.MutablePeriod
	at org.joda.time.convert.ConverterManager.getPeriodConverter(ConverterManager.java:83)
	at org.joda.time.base.BasePeriod.<init>(BasePeriod.java:272)
	at org.joda.time.Period.<init>(Period.java:674)
	at org.joda.time.base.AbstractPeriod.toPeriod(AbstractPeriod.java:147)
	at org.joda.time.format.PeriodFormatter.parsePeriod(PeriodFormatter.java:308)
	at org.joda.time.Years.parseYears(Years.java:162)
	at org.joda.time.TestYears.testFactory_parseYears_String(TestYears.java:116)

testFactory_parseMonths_String(org.joda.time.TestMonths)  Time elapsed: 0.001 sec  <<< ERROR!
java.lang.IllegalArgumentException: No period converter found for type: org.joda.time.MutablePeriod
	at org.joda.time.convert.ConverterManager.getPeriodConverter(ConverterManager.java:83)
	at org.joda.time.base.BasePeriod.<init>(BasePeriod.java:272)
	at org.joda.time.Period.<init>(Period.java:674)
	at org.joda.time.base.AbstractPeriod.toPeriod(AbstractPeriod.java:147)
	at org.joda.time.format.PeriodFormatter.parsePeriod(PeriodFormatter.java:308)
	at org.joda.time.Months.parseMonths(Months.java:198)
	at org.joda.time.TestMonths.testFactory_parseMonths_String(TestMonths.java:161)

testFactory_parseWeeks_String(org.joda.time.TestWeeks)  Time elapsed: 0.009 sec  <<< ERROR!
java.lang.IllegalArgumentException: No period converter found for type: org.joda.time.MutablePeriod
	at org.joda.time.convert.ConverterManager.getPeriodConverter(ConverterManager.java:83)
	at org.joda.time.base.BasePeriod.<init>(BasePeriod.java:272)
	at org.joda.time.Period.<init>(Period.java:674)
	at org.joda.time.base.AbstractPeriod.toPeriod(AbstractPeriod.java:147)
	at org.joda.time.format.PeriodFormatter.parsePeriod(PeriodFormatter.java:308)
	at org.joda.time.Weeks.parseWeeks(Weeks.java:185)
	at org.joda.time.TestWeeks.testFactory_parseWeeks_String(TestWeeks.java:133)

testFactory_parseDays_String(org.joda.time.TestDays)  Time elapsed: 0 sec  <<< ERROR!
java.lang.IllegalArgumentException: No period converter found for type: org.joda.time.MutablePeriod
	at org.joda.time.convert.ConverterManager.getPeriodConverter(ConverterManager.java:83)
	at org.joda.time.base.BasePeriod.<init>(BasePeriod.java:272)
	at org.joda.time.Period.<init>(Period.java:674)
	at org.joda.time.base.AbstractPeriod.toPeriod(AbstractPeriod.java:147)
	at org.joda.time.format.PeriodFormatter.parsePeriod(PeriodFormatter.java:308)
	at org.joda.time.Days.parseDays(Days.java:203)
	at org.joda.time.TestDays.testFactory_parseDays_String(TestDays.java:175)

testFactory_parseHours_String(org.joda.time.TestHours)  Time elapsed: 0.001 sec  <<< ERROR!
java.lang.IllegalArgumentException: No period converter found for type: org.joda.time.MutablePeriod
	at org.joda.time.convert.ConverterManager.getPeriodConverter(ConverterManager.java:83)
	at org.joda.time.base.BasePeriod.<init>(BasePeriod.java:272)
	at org.joda.time.Period.<init>(Period.java:674)
	at org.joda.time.base.AbstractPeriod.toPeriod(AbstractPeriod.java:147)
	at org.joda.time.format.PeriodFormatter.parsePeriod(PeriodFormatter.java:308)
	at org.joda.time.Hours.parseHours(Hours.java:205)
	at org.joda.time.TestHours.testFactory_parseHours_String(TestHours.java:144)

testFactory_parseMinutes_String(org.joda.time.TestMinutes)  Time elapsed: 0 sec  <<< ERROR!
java.lang.IllegalArgumentException: No period converter found for type: org.joda.time.MutablePeriod
	at org.joda.time.convert.ConverterManager.getPeriodConverter(ConverterManager.java:83)
	at org.joda.time.base.BasePeriod.<init>(BasePeriod.java:272)
	at org.joda.time.Period.<init>(Period.java:674)
	at org.joda.time.base.AbstractPeriod.toPeriod(AbstractPeriod.java:147)
	at org.joda.time.format.PeriodFormatter.parsePeriod(PeriodFormatter.java:308)
	at org.joda.time.Minutes.parseMinutes(Minutes.java:185)
	at org.joda.time.TestMinutes.testFactory_parseMinutes_String(TestMinutes.java:134)

testFactory_parseSeconds_String(org.joda.time.TestSeconds)  Time elapsed: 0.001 sec  <<< ERROR!
java.lang.IllegalArgumentException: No period converter found for type: org.joda.time.MutablePeriod
	at org.joda.time.convert.ConverterManager.getPeriodConverter(ConverterManager.java:83)
	at org.joda.time.base.BasePeriod.<init>(BasePeriod.java:272)
	at org.joda.time.Period.<init>(Period.java:674)
	at org.joda.time.base.AbstractPeriod.toPeriod(AbstractPeriod.java:147)
	at org.joda.time.format.PeriodFormatter.parsePeriod(PeriodFormatter.java:308)
	at org.joda.time.Seconds.parseSeconds(Seconds.java:185)
	at org.joda.time.TestSeconds.testFactory_parseSeconds_String(TestSeconds.java:131)

testYears(org.joda.time.TestStringConvert)  Time elapsed: 0.032 sec  <<< ERROR!
java.lang.IllegalArgumentException: No period converter found for type: org.joda.time.MutablePeriod
	at org.joda.time.convert.ConverterManager.getPeriodConverter(ConverterManager.java:83)
	at org.joda.time.base.BasePeriod.<init>(BasePeriod.java:272)
	at org.joda.time.Period.<init>(Period.java:674)
	at org.joda.time.base.AbstractPeriod.toPeriod(AbstractPeriod.java:147)
	at org.joda.time.format.PeriodFormatter.parsePeriod(PeriodFormatter.java:308)
	at org.joda.time.Years.parseYears(Years.java:162)
	at sun.reflect.NativeMethodAccessorImpl.invoke0(Native Method)
	at sun.reflect.NativeMethodAccessorImpl.invoke(NativeMethodAccessorImpl.java:57)
	at sun.reflect.DelegatingMethodAccessorImpl.invoke(DelegatingMethodAccessorImpl.java:43)
	at java.lang.reflect.Method.invoke(Method.java:606)
	at org.joda.convert.MethodsStringConverter.convertFromString(MethodsStringConverter.java:70)
	at org.joda.convert.StringConvert.convertFromString(StringConvert.java:163)
	at org.joda.time.TestStringConvert.testYears(TestStringConvert.java:158)

testMonths(org.joda.time.TestStringConvert)  Time elapsed: 0.001 sec  <<< ERROR!
java.lang.IllegalArgumentException: No period converter found for type: org.joda.time.MutablePeriod
	at org.joda.time.convert.ConverterManager.getPeriodConverter(ConverterManager.java:83)
	at org.joda.time.base.BasePeriod.<init>(BasePeriod.java:272)
	at org.joda.time.Period.<init>(Period.java:674)
	at org.joda.time.base.AbstractPeriod.toPeriod(AbstractPeriod.java:147)
	at org.joda.time.format.PeriodFormatter.parsePeriod(PeriodFormatter.java:308)
	at org.joda.time.Months.parseMonths(Months.java:198)
	at sun.reflect.NativeMethodAccessorImpl.invoke0(Native Method)
	at sun.reflect.NativeMethodAccessorImpl.invoke(NativeMethodAccessorImpl.java:57)
	at sun.reflect.DelegatingMethodAccessorImpl.invoke(DelegatingMethodAccessorImpl.java:43)
	at java.lang.reflect.Method.invoke(Method.java:606)
	at org.joda.convert.MethodsStringConverter.convertFromString(MethodsStringConverter.java:70)
	at org.joda.convert.StringConvert.convertFromString(StringConvert.java:163)
	at org.joda.time.TestStringConvert.testMonths(TestStringConvert.java:165)

testWeeks(org.joda.time.TestStringConvert)  Time elapsed: 0.001 sec  <<< ERROR!
java.lang.IllegalArgumentException: No period converter found for type: org.joda.time.MutablePeriod
	at org.joda.time.convert.ConverterManager.getPeriodConverter(ConverterManager.java:83)
	at org.joda.time.base.BasePeriod.<init>(BasePeriod.java:272)
	at org.joda.time.Period.<init>(Period.java:674)
	at org.joda.time.base.AbstractPeriod.toPeriod(AbstractPeriod.java:147)
	at org.joda.time.format.PeriodFormatter.parsePeriod(PeriodFormatter.java:308)
	at org.joda.time.Weeks.parseWeeks(Weeks.java:185)
	at sun.reflect.NativeMethodAccessorImpl.invoke0(Native Method)
	at sun.reflect.NativeMethodAccessorImpl.invoke(NativeMethodAccessorImpl.java:57)
	at sun.reflect.DelegatingMethodAccessorImpl.invoke(DelegatingMethodAccessorImpl.java:43)
	at java.lang.reflect.Method.invoke(Method.java:606)
	at org.joda.convert.MethodsStringConverter.convertFromString(MethodsStringConverter.java:70)
	at org.joda.convert.StringConvert.convertFromString(StringConvert.java:163)
	at org.joda.time.TestStringConvert.testWeeks(TestStringConvert.java:172)

testDays(org.joda.time.TestStringConvert)  Time elapsed: 0.001 sec  <<< ERROR!
java.lang.IllegalArgumentException: No period converter found for type: org.joda.time.MutablePeriod
	at org.joda.time.convert.ConverterManager.getPeriodConverter(ConverterManager.java:83)
	at org.joda.time.base.BasePeriod.<init>(BasePeriod.java:272)
	at org.joda.time.Period.<init>(Period.java:674)
	at org.joda.time.base.AbstractPeriod.toPeriod(AbstractPeriod.java:147)
	at org.joda.time.format.PeriodFormatter.parsePeriod(PeriodFormatter.java:308)
	at org.joda.time.Days.parseDays(Days.java:203)
	at sun.reflect.NativeMethodAccessorImpl.invoke0(Native Method)
	at sun.reflect.NativeMethodAccessorImpl.invoke(NativeMethodAccessorImpl.java:57)
	at sun.reflect.DelegatingMethodAccessorImpl.invoke(DelegatingMethodAccessorImpl.java:43)
	at java.lang.reflect.Method.invoke(Method.java:606)
	at org.joda.convert.MethodsStringConverter.convertFromString(MethodsStringConverter.java:70)
	at org.joda.convert.StringConvert.convertFromString(StringConvert.java:163)
	at org.joda.time.TestStringConvert.testDays(TestStringConvert.java:179)

testHours(org.joda.time.TestStringConvert)  Time elapsed: 0 sec  <<< ERROR!
java.lang.IllegalArgumentException: No period converter found for type: org.joda.time.MutablePeriod
	at org.joda.time.convert.ConverterManager.getPeriodConverter(ConverterManager.java:83)
	at org.joda.time.base.BasePeriod.<init>(BasePeriod.java:272)
	at org.joda.time.Period.<init>(Period.java:674)
	at org.joda.time.base.AbstractPeriod.toPeriod(AbstractPeriod.java:147)
	at org.joda.time.format.PeriodFormatter.parsePeriod(PeriodFormatter.java:308)
	at org.joda.time.Hours.parseHours(Hours.java:205)
	at sun.reflect.NativeMethodAccessorImpl.invoke0(Native Method)
	at sun.reflect.NativeMethodAccessorImpl.invoke(NativeMethodAccessorImpl.java:57)
	at sun.reflect.DelegatingMethodAccessorImpl.invoke(DelegatingMethodAccessorImpl.java:43)
	at java.lang.reflect.Method.invoke(Method.java:606)
	at org.joda.convert.MethodsStringConverter.convertFromString(MethodsStringConverter.java:70)
	at org.joda.convert.StringConvert.convertFromString(StringConvert.java:163)
	at org.joda.time.TestStringConvert.testHours(TestStringConvert.java:186)

testMinutes(org.joda.time.TestStringConvert)  Time elapsed: 0 sec  <<< ERROR!
java.lang.IllegalArgumentException: No period converter found for type: org.joda.time.MutablePeriod
	at org.joda.time.convert.ConverterManager.getPeriodConverter(ConverterManager.java:83)
	at org.joda.time.base.BasePeriod.<init>(BasePeriod.java:272)
	at org.joda.time.Period.<init>(Period.java:674)
	at org.joda.time.base.AbstractPeriod.toPeriod(AbstractPeriod.java:147)
	at org.joda.time.format.PeriodFormatter.parsePeriod(PeriodFormatter.java:308)
	at org.joda.time.Minutes.parseMinutes(Minutes.java:185)
	at sun.reflect.NativeMethodAccessorImpl.invoke0(Native Method)
	at sun.reflect.NativeMethodAccessorImpl.invoke(NativeMethodAccessorImpl.java:57)
	at sun.reflect.DelegatingMethodAccessorImpl.invoke(DelegatingMethodAccessorImpl.java:43)
	at java.lang.reflect.Method.invoke(Method.java:606)
	at org.joda.convert.MethodsStringConverter.convertFromString(MethodsStringConverter.java:70)
	at org.joda.convert.StringConvert.convertFromString(StringConvert.java:163)
	at org.joda.time.TestStringConvert.testMinutes(TestStringConvert.java:193)

testSeconds(org.joda.time.TestStringConvert)  Time elapsed: 0.001 sec  <<< ERROR!
java.lang.IllegalArgumentException: No period converter found for type: org.joda.time.MutablePeriod
	at org.joda.time.convert.ConverterManager.getPeriodConverter(ConverterManager.java:83)
	at org.joda.time.base.BasePeriod.<init>(BasePeriod.java:272)
	at org.joda.time.Period.<init>(Period.java:674)
	at org.joda.time.base.AbstractPeriod.toPeriod(AbstractPeriod.java:147)
	at org.joda.time.format.PeriodFormatter.parsePeriod(PeriodFormatter.java:308)
	at org.joda.time.Seconds.parseSeconds(Seconds.java:185)
	at sun.reflect.NativeMethodAccessorImpl.invoke0(Native Method)
	at sun.reflect.NativeMethodAccessorImpl.invoke(NativeMethodAccessorImpl.java:57)
	at sun.reflect.DelegatingMethodAccessorImpl.invoke(DelegatingMethodAccessorImpl.java:43)
	at java.lang.reflect.Method.invoke(Method.java:606)
	at org.joda.convert.MethodsStringConverter.convertFromString(MethodsStringConverter.java:70)
	at org.joda.convert.StringConvert.convertFromString(StringConvert.java:163)
	at org.joda.time.TestStringConvert.testSeconds(TestStringConvert.java:200)

testMutablePeriod(org.joda.time.TestStringConvert)  Time elapsed: 0.002 sec  <<< ERROR!
java.lang.IllegalArgumentException: No period converter found for type: org.joda.time.MutablePeriod
	at org.joda.time.convert.ConverterManager.getPeriodConverter(ConverterManager.java:83)
	at org.joda.time.base.BasePeriod.<init>(BasePeriod.java:272)
	at org.joda.time.Period.<init>(Period.java:674)
	at org.joda.time.base.AbstractPeriod.toPeriod(AbstractPeriod.java:147)
	at org.joda.time.format.PeriodFormatter.parsePeriod(PeriodFormatter.java:308)
	at org.joda.time.MutablePeriod.parse(MutablePeriod.java:85)
	at org.joda.time.MutablePeriod.parse(MutablePeriod.java:74)
	at sun.reflect.NativeMethodAccessorImpl.invoke0(Native Method)
	at sun.reflect.NativeMethodAccessorImpl.invoke(NativeMethodAccessorImpl.java:57)
	at sun.reflect.DelegatingMethodAccessorImpl.invoke(DelegatingMethodAccessorImpl.java:43)
	at java.lang.reflect.Method.invoke(Method.java:606)
	at org.joda.convert.MethodsStringConverter.convertFromString(MethodsStringConverter.java:70)
	at org.joda.convert.StringConvert.convertFromString(StringConvert.java:163)
	at org.joda.time.TestStringConvert.testMutablePeriod(TestStringConvert.java:151)

testPeriod(org.joda.time.TestStringConvert)  Time elapsed: 0.002 sec  <<< ERROR!
java.lang.IllegalArgumentException: No period converter found for type: org.joda.time.MutablePeriod
	at org.joda.time.convert.ConverterManager.getPeriodConverter(ConverterManager.java:83)
	at org.joda.time.base.BasePeriod.<init>(BasePeriod.java:272)
	at org.joda.time.Period.<init>(Period.java:674)
	at org.joda.time.base.AbstractPeriod.toPeriod(AbstractPeriod.java:147)
	at org.joda.time.format.PeriodFormatter.parsePeriod(PeriodFormatter.java:308)
	at org.joda.time.Period.parse(Period.java:92)
	at org.joda.time.Period.parse(Period.java:81)
	at sun.reflect.NativeMethodAccessorImpl.invoke0(Native Method)
	at sun.reflect.NativeMethodAccessorImpl.invoke(NativeMethodAccessorImpl.java:57)
	at sun.reflect.DelegatingMethodAccessorImpl.invoke(DelegatingMethodAccessorImpl.java:43)
	at java.lang.reflect.Method.invoke(Method.java:606)
	at org.joda.convert.MethodsStringConverter.convertFromString(MethodsStringConverter.java:70)
	at org.joda.convert.StringConvert.convertFromString(StringConvert.java:163)
	at org.joda.time.TestStringConvert.testPeriod(TestStringConvert.java:144)

testGetPeriodConverter(org.joda.time.convert.TestConverterManager)  Time elapsed: 0 sec  <<< ERROR!
java.lang.IllegalArgumentException: No period converter found for type: org.joda.time.Period
	at org.joda.time.convert.ConverterManager.getPeriodConverter(ConverterManager.java:83)
	at org.joda.time.convert.TestConverterManager.testGetPeriodConverter(TestConverterManager.java:692)

testGetPeriodConverterRemovedNull(org.joda.time.convert.TestConverterManager)  Time elapsed: 0 sec  <<< FAILURE!
junit.framework.AssertionFailedError
	at junit.framework.Assert.fail(Assert.java:47)
	at junit.framework.Assert.fail(Assert.java:53)
	at org.joda.time.convert.TestConverterManager.testGetPeriodConverterRemovedNull(TestConverterManager.java:718)

testAddPeriodConverter1(org.joda.time.convert.TestConverterManager)  Time elapsed: 0.001 sec  <<< ERROR!
java.lang.IllegalArgumentException: No period converter found for type: java.lang.Boolean
	at org.joda.time.convert.ConverterManager.getPeriodConverter(ConverterManager.java:83)
	at org.joda.time.convert.TestConverterManager.testAddPeriodConverter1(TestConverterManager.java:742)

testAddPeriodConverter2(org.joda.time.convert.TestConverterManager)  Time elapsed: 0.001 sec  <<< ERROR!
java.lang.IllegalArgumentException: No period converter found for type: java.lang.String
	at org.joda.time.convert.ConverterManager.getPeriodConverter(ConverterManager.java:83)
	at org.joda.time.convert.TestConverterManager.testAddPeriodConverter2(TestConverterManager.java:759)

testSetIntoInterval_Object_Chronology1(org.joda.time.convert.TestStringConverter)  Time elapsed: 0 sec  <<< ERROR!
java.lang.IllegalArgumentException: No period converter found for type: org.joda.time.MutablePeriod
	at org.joda.time.convert.ConverterManager.getPeriodConverter(ConverterManager.java:83)
	at org.joda.time.base.BasePeriod.<init>(BasePeriod.java:272)
	at org.joda.time.Period.<init>(Period.java:674)
	at org.joda.time.base.AbstractPeriod.toPeriod(AbstractPeriod.java:147)
	at org.joda.time.format.PeriodFormatter.parsePeriod(PeriodFormatter.java:308)
	at org.joda.time.convert.StringConverter.setInto(StringConverter.java:223)
	at org.joda.time.convert.TestStringConverter.testSetIntoInterval_Object_Chronology1(TestStringConverter.java:476)

testSetIntoInterval_Object_Chronology4(org.joda.time.convert.TestStringConverter)  Time elapsed: 0 sec  <<< ERROR!
java.lang.IllegalArgumentException: No period converter found for type: org.joda.time.MutablePeriod
	at org.joda.time.convert.ConverterManager.getPeriodConverter(ConverterManager.java:83)
	at org.joda.time.base.BasePeriod.<init>(BasePeriod.java:272)
	at org.joda.time.Period.<init>(Period.java:674)
	at org.joda.time.base.AbstractPeriod.toPeriod(AbstractPeriod.java:147)
	at org.joda.time.format.PeriodFormatter.parsePeriod(PeriodFormatter.java:308)
	at org.joda.time.convert.StringConverter.setInto(StringConverter.java:223)
	at org.joda.time.convert.TestStringConverter.testSetIntoInterval_Object_Chronology4(TestStringConverter.java:500)

testSetIntoInterval_Object_Chronology5(org.joda.time.convert.TestStringConverter)  Time elapsed: 0.001 sec  <<< ERROR!
java.lang.IllegalArgumentException: No period converter found for type: org.joda.time.MutablePeriod
	at org.joda.time.convert.ConverterManager.getPeriodConverter(ConverterManager.java:83)
	at org.joda.time.base.BasePeriod.<init>(BasePeriod.java:272)
	at org.joda.time.Period.<init>(Period.java:674)
	at org.joda.time.base.AbstractPeriod.toPeriod(AbstractPeriod.java:147)
	at org.joda.time.format.PeriodFormatter.parsePeriod(PeriodFormatter.java:308)
	at org.joda.time.convert.StringConverter.setInto(StringConverter.java:210)
	at org.joda.time.convert.TestStringConverter.testSetIntoInterval_Object_Chronology5(TestStringConverter.java:508)

testSetIntoInterval_Object_Chronology2(org.joda.time.convert.TestStringConverter)  Time elapsed: 0.001 sec  <<< ERROR!
java.lang.IllegalArgumentException: No period converter found for type: org.joda.time.MutablePeriod
	at org.joda.time.convert.ConverterManager.getPeriodConverter(ConverterManager.java:83)
	at org.joda.time.base.BasePeriod.<init>(BasePeriod.java:272)
	at org.joda.time.Period.<init>(Period.java:674)
	at org.joda.time.base.AbstractPeriod.toPeriod(AbstractPeriod.java:147)
	at org.joda.time.format.PeriodFormatter.parsePeriod(PeriodFormatter.java:308)
	at org.joda.time.convert.StringConverter.setInto(StringConverter.java:210)
	at org.joda.time.convert.TestStringConverter.testSetIntoInterval_Object_Chronology2(TestStringConverter.java:484)

testParsePeriod_simple(org.joda.time.format.TestPeriodFormatter)  Time elapsed: 0.001 sec  <<< ERROR!
java.lang.IllegalArgumentException: No period converter found for type: org.joda.time.MutablePeriod
	at org.joda.time.convert.ConverterManager.getPeriodConverter(ConverterManager.java:83)
	at org.joda.time.base.BasePeriod.<init>(BasePeriod.java:272)
	at org.joda.time.Period.<init>(Period.java:674)
	at org.joda.time.base.AbstractPeriod.toPeriod(AbstractPeriod.java:147)
	at org.joda.time.format.PeriodFormatter.parsePeriod(PeriodFormatter.java:308)
	at org.joda.time.format.TestPeriodFormatter.testParsePeriod_simple(TestPeriodFormatter.java:189)

testParsePeriod_parseType(org.joda.time.format.TestPeriodFormatter)  Time elapsed: 0 sec  <<< ERROR!
java.lang.IllegalArgumentException: No period converter found for type: org.joda.time.MutablePeriod
	at org.joda.time.convert.ConverterManager.getPeriodConverter(ConverterManager.java:83)
	at org.joda.time.base.BasePeriod.<init>(BasePeriod.java:272)
	at org.joda.time.Period.<init>(Period.java:674)
	at org.joda.time.base.AbstractPeriod.toPeriod(AbstractPeriod.java:147)
	at org.joda.time.format.PeriodFormatter.parsePeriod(PeriodFormatter.java:308)
	at org.joda.time.format.TestPeriodFormatter.testParsePeriod_parseType(TestPeriodFormatter.java:199)

testPrinterParserMethods(org.joda.time.format.TestPeriodFormatter)  Time elapsed: 0.001 sec  <<< ERROR!
java.lang.IllegalArgumentException: No period converter found for type: org.joda.time.MutablePeriod
	at org.joda.time.convert.ConverterManager.getPeriodConverter(ConverterManager.java:83)
	at org.joda.time.base.BasePeriod.<init>(BasePeriod.java:272)
	at org.joda.time.Period.<init>(Period.java:674)
	at org.joda.time.base.AbstractPeriod.toPeriod(AbstractPeriod.java:147)
	at org.joda.time.format.PeriodFormatter.parsePeriod(PeriodFormatter.java:308)
	at org.joda.time.format.TestPeriodFormatter.testPrinterParserMethods(TestPeriodFormatter.java:161)

test_getDefault_parseOneField(org.joda.time.format.TestPeriodFormat)  Time elapsed: 0 sec  <<< ERROR!
java.lang.IllegalArgumentException: No period converter found for type: org.joda.time.MutablePeriod
	at org.joda.time.convert.ConverterManager.getPeriodConverter(ConverterManager.java:83)
	at org.joda.time.base.BasePeriod.<init>(BasePeriod.java:272)
	at org.joda.time.Period.<init>(Period.java:674)
	at org.joda.time.base.AbstractPeriod.toPeriod(AbstractPeriod.java:147)
	at org.joda.time.format.PeriodFormatter.parsePeriod(PeriodFormatter.java:308)
	at org.joda.time.format.TestPeriodFormat.test_getDefault_parseOneField(TestPeriodFormat.java:97)

test_getDefault_parseTwoFields(org.joda.time.format.TestPeriodFormat)  Time elapsed: 0 sec  <<< ERROR!
java.lang.IllegalArgumentException: No period converter found for type: org.joda.time.MutablePeriod
	at org.joda.time.convert.ConverterManager.getPeriodConverter(ConverterManager.java:83)
	at org.joda.time.base.BasePeriod.<init>(BasePeriod.java:272)
	at org.joda.time.Period.<init>(Period.java:674)
	at org.joda.time.base.AbstractPeriod.toPeriod(AbstractPeriod.java:147)
	at org.joda.time.format.PeriodFormatter.parsePeriod(PeriodFormatter.java:308)
	at org.joda.time.format.TestPeriodFormat.test_getDefault_parseTwoFields(TestPeriodFormat.java:103)

test_wordBased_fr_parseOneField(org.joda.time.format.TestPeriodFormat)  Time elapsed: 0 sec  <<< ERROR!
java.lang.IllegalArgumentException: No period converter found for type: org.joda.time.MutablePeriod
	at org.joda.time.convert.ConverterManager.getPeriodConverter(ConverterManager.java:83)
	at org.joda.time.base.BasePeriod.<init>(BasePeriod.java:272)
	at org.joda.time.Period.<init>(Period.java:674)
	at org.joda.time.base.AbstractPeriod.toPeriod(AbstractPeriod.java:147)
	at org.joda.time.format.PeriodFormatter.parsePeriod(PeriodFormatter.java:308)
	at org.joda.time.format.TestPeriodFormat.test_wordBased_fr_parseOneField(TestPeriodFormat.java:152)

test_wordBased_fr_parseTwoFields(org.joda.time.format.TestPeriodFormat)  Time elapsed: 0.001 sec  <<< ERROR!
java.lang.IllegalArgumentException: No period converter found for type: org.joda.time.MutablePeriod
	at org.joda.time.convert.ConverterManager.getPeriodConverter(ConverterManager.java:83)
	at org.joda.time.base.BasePeriod.<init>(BasePeriod.java:272)
	at org.joda.time.Period.<init>(Period.java:674)
	at org.joda.time.base.AbstractPeriod.toPeriod(AbstractPeriod.java:147)
	at org.joda.time.format.PeriodFormatter.parsePeriod(PeriodFormatter.java:308)
	at org.joda.time.format.TestPeriodFormat.test_wordBased_fr_parseTwoFields(TestPeriodFormat.java:158)

test_wordBased_pt_parseOneField(org.joda.time.format.TestPeriodFormat)  Time elapsed: 0 sec  <<< ERROR!
java.lang.IllegalArgumentException: No period converter found for type: org.joda.time.MutablePeriod
	at org.joda.time.convert.ConverterManager.getPeriodConverter(ConverterManager.java:83)
	at org.joda.time.base.BasePeriod.<init>(BasePeriod.java:272)
	at org.joda.time.Period.<init>(Period.java:674)
	at org.joda.time.base.AbstractPeriod.toPeriod(AbstractPeriod.java:147)
	at org.joda.time.format.PeriodFormatter.parsePeriod(PeriodFormatter.java:308)
	at org.joda.time.format.TestPeriodFormat.test_wordBased_pt_parseOneField(TestPeriodFormat.java:189)

test_wordBased_pt_parseTwoFields(org.joda.time.format.TestPeriodFormat)  Time elapsed: 0.001 sec  <<< ERROR!
java.lang.IllegalArgumentException: No period converter found for type: org.joda.time.MutablePeriod
	at org.joda.time.convert.ConverterManager.getPeriodConverter(ConverterManager.java:83)
	at org.joda.time.base.BasePeriod.<init>(BasePeriod.java:272)
	at org.joda.time.Period.<init>(Period.java:674)
	at org.joda.time.base.AbstractPeriod.toPeriod(AbstractPeriod.java:147)
	at org.joda.time.format.PeriodFormatter.parsePeriod(PeriodFormatter.java:308)
	at org.joda.time.format.TestPeriodFormat.test_wordBased_pt_parseTwoFields(TestPeriodFormat.java:195)

test_wordBased_es_parseOneField(org.joda.time.format.TestPeriodFormat)  Time elapsed: 0 sec  <<< ERROR!
java.lang.IllegalArgumentException: No period converter found for type: org.joda.time.MutablePeriod
	at org.joda.time.convert.ConverterManager.getPeriodConverter(ConverterManager.java:83)
	at org.joda.time.base.BasePeriod.<init>(BasePeriod.java:272)
	at org.joda.time.Period.<init>(Period.java:674)
	at org.joda.time.base.AbstractPeriod.toPeriod(AbstractPeriod.java:147)
	at org.joda.time.format.PeriodFormatter.parsePeriod(PeriodFormatter.java:308)
	at org.joda.time.format.TestPeriodFormat.test_wordBased_es_parseOneField(TestPeriodFormat.java:226)

test_wordBased_es_parseTwoFields(org.joda.time.format.TestPeriodFormat)  Time elapsed: 0.001 sec  <<< ERROR!
java.lang.IllegalArgumentException: No period converter found for type: org.joda.time.MutablePeriod
	at org.joda.time.convert.ConverterManager.getPeriodConverter(ConverterManager.java:83)
	at org.joda.time.base.BasePeriod.<init>(BasePeriod.java:272)
	at org.joda.time.Period.<init>(Period.java:674)
	at org.joda.time.base.AbstractPeriod.toPeriod(AbstractPeriod.java:147)
	at org.joda.time.format.PeriodFormatter.parsePeriod(PeriodFormatter.java:308)
	at org.joda.time.format.TestPeriodFormat.test_wordBased_es_parseTwoFields(TestPeriodFormat.java:232)

test_wordBased_de_parseOneField(org.joda.time.format.TestPeriodFormat)  Time elapsed: 0 sec  <<< ERROR!
java.lang.IllegalArgumentException: No period converter found for type: org.joda.time.MutablePeriod
	at org.joda.time.convert.ConverterManager.getPeriodConverter(ConverterManager.java:83)
	at org.joda.time.base.BasePeriod.<init>(BasePeriod.java:272)
	at org.joda.time.Period.<init>(Period.java:674)
	at org.joda.time.base.AbstractPeriod.toPeriod(AbstractPeriod.java:147)
	at org.joda.time.format.PeriodFormatter.parsePeriod(PeriodFormatter.java:308)
	at org.joda.time.format.TestPeriodFormat.test_wordBased_de_parseOneField(TestPeriodFormat.java:263)

test_wordBased_de_parseTwoFields(org.joda.time.format.TestPeriodFormat)  Time elapsed: 0.001 sec  <<< ERROR!
java.lang.IllegalArgumentException: No period converter found for type: org.joda.time.MutablePeriod
	at org.joda.time.convert.ConverterManager.getPeriodConverter(ConverterManager.java:83)
	at org.joda.time.base.BasePeriod.<init>(BasePeriod.java:272)
	at org.joda.time.Period.<init>(Period.java:674)
	at org.joda.time.base.AbstractPeriod.toPeriod(AbstractPeriod.java:147)
	at org.joda.time.format.PeriodFormatter.parsePeriod(PeriodFormatter.java:308)
	at org.joda.time.format.TestPeriodFormat.test_wordBased_de_parseTwoFields(TestPeriodFormat.java:269)

test_wordBased_nl_parseOneField(org.joda.time.format.TestPeriodFormat)  Time elapsed: 0.001 sec  <<< ERROR!
java.lang.IllegalArgumentException: No period converter found for type: org.joda.time.MutablePeriod
	at org.joda.time.convert.ConverterManager.getPeriodConverter(ConverterManager.java:83)
	at org.joda.time.base.BasePeriod.<init>(BasePeriod.java:272)
	at org.joda.time.Period.<init>(Period.java:674)
	at org.joda.time.base.AbstractPeriod.toPeriod(AbstractPeriod.java:147)
	at org.joda.time.format.PeriodFormatter.parsePeriod(PeriodFormatter.java:308)
	at org.joda.time.format.TestPeriodFormat.test_wordBased_nl_parseOneField(TestPeriodFormat.java:300)

test_wordBased_nl_parseTwoFields(org.joda.time.format.TestPeriodFormat)  Time elapsed: 0 sec  <<< ERROR!
java.lang.IllegalArgumentException: No period converter found for type: org.joda.time.MutablePeriod
	at org.joda.time.convert.ConverterManager.getPeriodConverter(ConverterManager.java:83)
	at org.joda.time.base.BasePeriod.<init>(BasePeriod.java:272)
	at org.joda.time.Period.<init>(Period.java:674)
	at org.joda.time.base.AbstractPeriod.toPeriod(AbstractPeriod.java:147)
	at org.joda.time.format.PeriodFormatter.parsePeriod(PeriodFormatter.java:308)
	at org.joda.time.format.TestPeriodFormat.test_wordBased_nl_parseTwoFields(TestPeriodFormat.java:306)

test_wordBased_ja_parseOneField(org.joda.time.format.TestPeriodFormat)  Time elapsed: 0 sec  <<< ERROR!
java.lang.IllegalArgumentException: No period converter found for type: org.joda.time.MutablePeriod
	at org.joda.time.convert.ConverterManager.getPeriodConverter(ConverterManager.java:83)
	at org.joda.time.base.BasePeriod.<init>(BasePeriod.java:272)
	at org.joda.time.Period.<init>(Period.java:674)
	at org.joda.time.base.AbstractPeriod.toPeriod(AbstractPeriod.java:147)
	at org.joda.time.format.PeriodFormatter.parsePeriod(PeriodFormatter.java:308)
	at org.joda.time.format.TestPeriodFormat.test_wordBased_ja_parseOneField(TestPeriodFormat.java:355)

test_wordBased_ja_parseTwoFields(org.joda.time.format.TestPeriodFormat)  Time elapsed: 0.001 sec  <<< ERROR!
java.lang.IllegalArgumentException: No period converter found for type: org.joda.time.MutablePeriod
	at org.joda.time.convert.ConverterManager.getPeriodConverter(ConverterManager.java:83)
	at org.joda.time.base.BasePeriod.<init>(BasePeriod.java:272)
	at org.joda.time.Period.<init>(Period.java:674)
	at org.joda.time.base.AbstractPeriod.toPeriod(AbstractPeriod.java:147)
	at org.joda.time.format.PeriodFormatter.parsePeriod(PeriodFormatter.java:308)
	at org.joda.time.format.TestPeriodFormat.test_wordBased_ja_parseTwoFields(TestPeriodFormat.java:361)

test_wordBased_pl_parseOneField(org.joda.time.format.TestPeriodFormat)  Time elapsed: 0 sec  <<< ERROR!
java.lang.IllegalArgumentException: No period converter found for type: org.joda.time.MutablePeriod
	at org.joda.time.convert.ConverterManager.getPeriodConverter(ConverterManager.java:83)
	at org.joda.time.base.BasePeriod.<init>(BasePeriod.java:272)
	at org.joda.time.Period.<init>(Period.java:674)
	at org.joda.time.base.AbstractPeriod.toPeriod(AbstractPeriod.java:147)
	at org.joda.time.format.PeriodFormatter.parsePeriod(PeriodFormatter.java:308)
	at org.joda.time.format.TestPeriodFormat.test_wordBased_pl_parseOneField(TestPeriodFormat.java:398)

test_wordBased_pl_parseTwoFields(org.joda.time.format.TestPeriodFormat)  Time elapsed: 0 sec  <<< ERROR!
java.lang.IllegalArgumentException: No period converter found for type: org.joda.time.MutablePeriod
	at org.joda.time.convert.ConverterManager.getPeriodConverter(ConverterManager.java:83)
	at org.joda.time.base.BasePeriod.<init>(BasePeriod.java:272)
	at org.joda.time.Period.<init>(Period.java:674)
	at org.joda.time.base.AbstractPeriod.toPeriod(AbstractPeriod.java:147)
	at org.joda.time.format.PeriodFormatter.parsePeriod(PeriodFormatter.java:308)
	at org.joda.time.format.TestPeriodFormat.test_wordBased_pl_parseTwoFields(TestPeriodFormat.java:404)

test_wordBased_en_withLocale_pt(org.joda.time.format.TestPeriodFormat)  Time elapsed: 0.001 sec  <<< ERROR!
java.lang.IllegalArgumentException: No period converter found for type: org.joda.time.MutablePeriod
	at org.joda.time.convert.ConverterManager.getPeriodConverter(ConverterManager.java:83)
	at org.joda.time.base.BasePeriod.<init>(BasePeriod.java:272)
	at org.joda.time.Period.<init>(Period.java:674)
	at org.joda.time.base.AbstractPeriod.toPeriod(AbstractPeriod.java:147)
	at org.joda.time.format.PeriodFormatter.parsePeriod(PeriodFormatter.java:308)
	at org.joda.time.format.TestPeriodFormat.test_wordBased_en_withLocale_pt(TestPeriodFormat.java:634)

testParseStandard1(org.joda.time.format.TestISOPeriodFormatParsing)  Time elapsed: 0.001 sec  <<< ERROR!
java.lang.IllegalArgumentException: No period converter found for type: org.joda.time.MutablePeriod
	at org.joda.time.convert.ConverterManager.getPeriodConverter(ConverterManager.java:83)
	at org.joda.time.base.BasePeriod.<init>(BasePeriod.java:272)
	at org.joda.time.Period.<init>(Period.java:674)
	at org.joda.time.base.AbstractPeriod.toPeriod(AbstractPeriod.java:147)
	at org.joda.time.format.PeriodFormatter.parsePeriod(PeriodFormatter.java:308)
	at org.joda.time.format.TestISOPeriodFormatParsing.testParseStandard1(TestISOPeriodFormatParsing.java:94)

testParseStandard6(org.joda.time.format.TestISOPeriodFormatParsing)  Time elapsed: 0 sec  <<< ERROR!
java.lang.IllegalArgumentException: No period converter found for type: org.joda.time.MutablePeriod
	at org.joda.time.convert.ConverterManager.getPeriodConverter(ConverterManager.java:83)
	at org.joda.time.base.BasePeriod.<init>(BasePeriod.java:272)
	at org.joda.time.Period.<init>(Period.java:674)
	at org.joda.time.base.AbstractPeriod.toPeriod(AbstractPeriod.java:147)
	at org.joda.time.format.PeriodFormatter.parsePeriod(PeriodFormatter.java:308)
	at org.joda.time.format.TestISOPeriodFormatParsing.testParseStandard6(TestISOPeriodFormatParsing.java:129)

testParseStandard7(org.joda.time.format.TestISOPeriodFormatParsing)  Time elapsed: 0.001 sec  <<< ERROR!
java.lang.IllegalArgumentException: No period converter found for type: org.joda.time.MutablePeriod
	at org.joda.time.convert.ConverterManager.getPeriodConverter(ConverterManager.java:83)
	at org.joda.time.base.BasePeriod.<init>(BasePeriod.java:272)
	at org.joda.time.Period.<init>(Period.java:674)
	at org.joda.time.base.AbstractPeriod.toPeriod(AbstractPeriod.java:147)
	at org.joda.time.format.PeriodFormatter.parsePeriod(PeriodFormatter.java:308)
	at org.joda.time.format.TestISOPeriodFormatParsing.testParseStandard7(TestISOPeriodFormatParsing.java:136)

testParseStandard8(org.joda.time.format.TestISOPeriodFormatParsing)  Time elapsed: 0 sec  <<< ERROR!
java.lang.IllegalArgumentException: No period converter found for type: org.joda.time.MutablePeriod
	at org.joda.time.convert.ConverterManager.getPeriodConverter(ConverterManager.java:83)
	at org.joda.time.base.BasePeriod.<init>(BasePeriod.java:272)
	at org.joda.time.Period.<init>(Period.java:674)
	at org.joda.time.base.AbstractPeriod.toPeriod(AbstractPeriod.java:147)
	at org.joda.time.format.PeriodFormatter.parsePeriod(PeriodFormatter.java:308)
	at org.joda.time.format.TestISOPeriodFormatParsing.testParseStandard8(TestISOPeriodFormatParsing.java:143)

testParseStandard9(org.joda.time.format.TestISOPeriodFormatParsing)  Time elapsed: 0.001 sec  <<< ERROR!
java.lang.IllegalArgumentException: No period converter found for type: org.joda.time.MutablePeriod
	at org.joda.time.convert.ConverterManager.getPeriodConverter(ConverterManager.java:83)
	at org.joda.time.base.BasePeriod.<init>(BasePeriod.java:272)
	at org.joda.time.Period.<init>(Period.java:674)
	at org.joda.time.base.AbstractPeriod.toPeriod(AbstractPeriod.java:147)
	at org.joda.time.format.PeriodFormatter.parsePeriod(PeriodFormatter.java:308)
	at org.joda.time.format.TestISOPeriodFormatParsing.testParseStandard9(TestISOPeriodFormatParsing.java:150)

testParseStandard10(org.joda.time.format.TestISOPeriodFormatParsing)  Time elapsed: 0 sec  <<< ERROR!
java.lang.IllegalArgumentException: No period converter found for type: org.joda.time.MutablePeriod
	at org.joda.time.convert.ConverterManager.getPeriodConverter(ConverterManager.java:83)
	at org.joda.time.base.BasePeriod.<init>(BasePeriod.java:272)
	at org.joda.time.Period.<init>(Period.java:674)
	at org.joda.time.base.AbstractPeriod.toPeriod(AbstractPeriod.java:147)
	at org.joda.time.format.PeriodFormatter.parsePeriod(PeriodFormatter.java:308)
	at org.joda.time.format.TestISOPeriodFormatParsing.testParseStandard10(TestISOPeriodFormatParsing.java:157)

testParseStandard11(org.joda.time.format.TestISOPeriodFormatParsing)  Time elapsed: 0.001 sec  <<< ERROR!
java.lang.IllegalArgumentException: No period converter found for type: org.joda.time.MutablePeriod
	at org.joda.time.convert.ConverterManager.getPeriodConverter(ConverterManager.java:83)
	at org.joda.time.base.BasePeriod.<init>(BasePeriod.java:272)
	at org.joda.time.Period.<init>(Period.java:674)
	at org.joda.time.base.AbstractPeriod.toPeriod(AbstractPeriod.java:147)
	at org.joda.time.format.PeriodFormatter.parsePeriod(PeriodFormatter.java:308)
	at org.joda.time.format.TestISOPeriodFormatParsing.testParseStandard11(TestISOPeriodFormatParsing.java:164)

testParseStandard2(org.joda.time.format.TestISOPeriodFormatParsing)  Time elapsed: 0 sec  <<< ERROR!
java.lang.IllegalArgumentException: No period converter found for type: org.joda.time.MutablePeriod
	at org.joda.time.convert.ConverterManager.getPeriodConverter(ConverterManager.java:83)
	at org.joda.time.base.BasePeriod.<init>(BasePeriod.java:272)
	at org.joda.time.Period.<init>(Period.java:674)
	at org.joda.time.base.AbstractPeriod.toPeriod(AbstractPeriod.java:147)
	at org.joda.time.format.PeriodFormatter.parsePeriod(PeriodFormatter.java:308)
	at org.joda.time.format.TestISOPeriodFormatParsing.testParseStandard2(TestISOPeriodFormatParsing.java:101)

testParseStandard3(org.joda.time.format.TestISOPeriodFormatParsing)  Time elapsed: 0.001 sec  <<< ERROR!
java.lang.IllegalArgumentException: No period converter found for type: org.joda.time.MutablePeriod
	at org.joda.time.convert.ConverterManager.getPeriodConverter(ConverterManager.java:83)
	at org.joda.time.base.BasePeriod.<init>(BasePeriod.java:272)
	at org.joda.time.Period.<init>(Period.java:674)
	at org.joda.time.base.AbstractPeriod.toPeriod(AbstractPeriod.java:147)
	at org.joda.time.format.PeriodFormatter.parsePeriod(PeriodFormatter.java:308)
	at org.joda.time.format.TestISOPeriodFormatParsing.testParseStandard3(TestISOPeriodFormatParsing.java:108)

testParseStandard4(org.joda.time.format.TestISOPeriodFormatParsing)  Time elapsed: 0 sec  <<< ERROR!
java.lang.IllegalArgumentException: No period converter found for type: org.joda.time.MutablePeriod
	at org.joda.time.convert.ConverterManager.getPeriodConverter(ConverterManager.java:83)
	at org.joda.time.base.BasePeriod.<init>(BasePeriod.java:272)
	at org.joda.time.Period.<init>(Period.java:674)
	at org.joda.time.base.AbstractPeriod.toPeriod(AbstractPeriod.java:147)
	at org.joda.time.format.PeriodFormatter.parsePeriod(PeriodFormatter.java:308)
	at org.joda.time.format.TestISOPeriodFormatParsing.testParseStandard4(TestISOPeriodFormatParsing.java:115)

testParseStandard5(org.joda.time.format.TestISOPeriodFormatParsing)  Time elapsed: 0.001 sec  <<< ERROR!
java.lang.IllegalArgumentException: No period converter found for type: org.joda.time.MutablePeriod
	at org.joda.time.convert.ConverterManager.getPeriodConverter(ConverterManager.java:83)
	at org.joda.time.base.BasePeriod.<init>(BasePeriod.java:272)
	at org.joda.time.Period.<init>(Period.java:674)
	at org.joda.time.base.AbstractPeriod.toPeriod(AbstractPeriod.java:147)
	at org.joda.time.format.PeriodFormatter.parsePeriod(PeriodFormatter.java:308)
	at org.joda.time.format.TestISOPeriodFormatParsing.testParseStandard5(TestISOPeriodFormatParsing.java:122)

testParseNegativeMillis1(org.joda.time.format.TestPeriodFormatParsing)  Time elapsed: 0 sec  <<< ERROR!
java.lang.IllegalArgumentException: No period converter found for type: org.joda.time.MutablePeriod
	at org.joda.time.convert.ConverterManager.getPeriodConverter(ConverterManager.java:83)
	at org.joda.time.base.BasePeriod.<init>(BasePeriod.java:272)
	at org.joda.time.Period.<init>(Period.java:674)
	at org.joda.time.base.AbstractPeriod.toPeriod(AbstractPeriod.java:147)
	at org.joda.time.format.PeriodFormatter.parsePeriod(PeriodFormatter.java:308)
	at org.joda.time.Period.parse(Period.java:92)
	at org.joda.time.Period.parse(Period.java:81)
	at org.joda.time.format.TestPeriodFormatParsing.testParseNegativeMillis1(TestPeriodFormatParsing.java:102)

testParseNegativeMillis2(org.joda.time.format.TestPeriodFormatParsing)  Time elapsed: 0.001 sec  <<< ERROR!
java.lang.IllegalArgumentException: No period converter found for type: org.joda.time.MutablePeriod
	at org.joda.time.convert.ConverterManager.getPeriodConverter(ConverterManager.java:83)
	at org.joda.time.base.BasePeriod.<init>(BasePeriod.java:272)
	at org.joda.time.Period.<init>(Period.java:674)
	at org.joda.time.base.AbstractPeriod.toPeriod(AbstractPeriod.java:147)
	at org.joda.time.format.PeriodFormatter.parsePeriod(PeriodFormatter.java:308)
	at org.joda.time.Period.parse(Period.java:92)
	at org.joda.time.Period.parse(Period.java:81)
	at org.joda.time.format.TestPeriodFormatParsing.testParseNegativeMillis2(TestPeriodFormatParsing.java:110)

testParseCustom1(org.joda.time.format.TestPeriodFormatParsing)  Time elapsed: 0 sec  <<< ERROR!
java.lang.IllegalArgumentException: No period converter found for type: org.joda.time.MutablePeriod
	at org.joda.time.convert.ConverterManager.getPeriodConverter(ConverterManager.java:83)
	at org.joda.time.base.BasePeriod.<init>(BasePeriod.java:272)
	at org.joda.time.Period.<init>(Period.java:674)
	at org.joda.time.base.AbstractPeriod.toPeriod(AbstractPeriod.java:147)
	at org.joda.time.format.PeriodFormatter.parsePeriod(PeriodFormatter.java:308)
	at org.joda.time.format.TestPeriodFormatParsing.testParseCustom1(TestPeriodFormatParsing.java:127)

testParseStandard1(org.joda.time.format.TestPeriodFormatParsing)  Time elapsed: 0.001 sec  <<< ERROR!
java.lang.IllegalArgumentException: No period converter found for type: org.joda.time.MutablePeriod
	at org.joda.time.convert.ConverterManager.getPeriodConverter(ConverterManager.java:83)
	at org.joda.time.base.BasePeriod.<init>(BasePeriod.java:272)
	at org.joda.time.Period.<init>(Period.java:674)
	at org.joda.time.base.AbstractPeriod.toPeriod(AbstractPeriod.java:147)
	at org.joda.time.format.PeriodFormatter.parsePeriod(PeriodFormatter.java:308)
	at org.joda.time.format.TestPeriodFormatParsing.testParseStandard1(TestPeriodFormatParsing.java:94)

testFormatPrefixSimple4IgnoringPrefix(org.joda.time.format.TestPeriodFormatterBuilder)  Time elapsed: 0.001 sec  <<< ERROR!
java.lang.IllegalArgumentException: No period converter found for type: org.joda.time.MutablePeriod
	at org.joda.time.convert.ConverterManager.getPeriodConverter(ConverterManager.java:83)
	at org.joda.time.base.BasePeriod.<init>(BasePeriod.java:272)
	at org.joda.time.Period.<init>(Period.java:674)
	at org.joda.time.base.AbstractPeriod.toPeriod(AbstractPeriod.java:147)
	at org.joda.time.format.PeriodFormatter.parsePeriod(PeriodFormatter.java:308)
	at org.joda.time.format.TestPeriodFormatterBuilder.testFormatPrefixSimple4IgnoringPrefix(TestPeriodFormatterBuilder.java:348)

testPluralAffixParseOrder(org.joda.time.format.TestPeriodFormatterBuilder)  Time elapsed: 0 sec  <<< ERROR!
java.lang.IllegalArgumentException: No period converter found for type: org.joda.time.MutablePeriod
	at org.joda.time.convert.ConverterManager.getPeriodConverter(ConverterManager.java:83)
	at org.joda.time.base.BasePeriod.<init>(BasePeriod.java:272)
	at org.joda.time.Period.<init>(Period.java:674)
	at org.joda.time.base.AbstractPeriod.toPeriod(AbstractPeriod.java:147)
	at org.joda.time.format.PeriodFormatter.parsePeriod(PeriodFormatter.java:308)
	at org.joda.time.format.TestPeriodFormatterBuilder.testPluralAffixParseOrder(TestPeriodFormatterBuilder.java:357)

testFormatPrefixPlural4IgnoringPrefix(org.joda.time.format.TestPeriodFormatterBuilder)  Time elapsed: 0 sec  <<< ERROR!
java.lang.IllegalArgumentException: No period converter found for type: org.joda.time.MutablePeriod
	at org.joda.time.convert.ConverterManager.getPeriodConverter(ConverterManager.java:83)
	at org.joda.time.base.BasePeriod.<init>(BasePeriod.java:272)
	at org.joda.time.Period.<init>(Period.java:674)
	at org.joda.time.base.AbstractPeriod.toPeriod(AbstractPeriod.java:147)
	at org.joda.time.format.PeriodFormatter.parsePeriod(PeriodFormatter.java:308)
	at org.joda.time.format.TestPeriodFormatterBuilder.testFormatPrefixPlural4IgnoringPrefix(TestPeriodFormatterBuilder.java:407)

testRegExAffixParseOrder(org.joda.time.format.TestPeriodFormatterBuilder)  Time elapsed: 0.001 sec  <<< ERROR!
java.lang.IllegalArgumentException: No period converter found for type: org.joda.time.MutablePeriod
	at org.joda.time.convert.ConverterManager.getPeriodConverter(ConverterManager.java:83)
	at org.joda.time.base.BasePeriod.<init>(BasePeriod.java:272)
	at org.joda.time.Period.<init>(Period.java:674)
	at org.joda.time.base.AbstractPeriod.toPeriod(AbstractPeriod.java:147)
	at org.joda.time.format.PeriodFormatter.parsePeriod(PeriodFormatter.java:308)
	at org.joda.time.format.TestPeriodFormatterBuilder.testRegExAffixParseOrder(TestPeriodFormatterBuilder.java:424)

testFormatPrefixRegEx4IgnoringPrefix(org.joda.time.format.TestPeriodFormatterBuilder)  Time elapsed: 0.001 sec  <<< ERROR!
java.lang.IllegalArgumentException: No period converter found for type: org.joda.time.MutablePeriod
	at org.joda.time.convert.ConverterManager.getPeriodConverter(ConverterManager.java:83)
	at org.joda.time.base.BasePeriod.<init>(BasePeriod.java:272)
	at org.joda.time.Period.<init>(Period.java:674)
	at org.joda.time.base.AbstractPeriod.toPeriod(AbstractPeriod.java:147)
	at org.joda.time.format.PeriodFormatter.parsePeriod(PeriodFormatter.java:308)
	at org.joda.time.format.TestPeriodFormatterBuilder.testFormatPrefixRegEx4IgnoringPrefix(TestPeriodFormatterBuilder.java:492)

testFormatPrefixComposite1(org.joda.time.format.TestPeriodFormatterBuilder)  Time elapsed: 0.001 sec  <<< ERROR!
java.lang.IllegalArgumentException: No period converter found for type: org.joda.time.MutablePeriod
	at org.joda.time.convert.ConverterManager.getPeriodConverter(ConverterManager.java:83)
	at org.joda.time.base.BasePeriod.<init>(BasePeriod.java:272)
	at org.joda.time.Period.<init>(Period.java:674)
	at org.joda.time.base.AbstractPeriod.toPeriod(AbstractPeriod.java:147)
	at org.joda.time.format.PeriodFormatter.parsePeriod(PeriodFormatter.java:308)
	at org.joda.time.format.TestPeriodFormatterBuilder.testFormatPrefixComposite1(TestPeriodFormatterBuilder.java:513)

testFormatPrefixSimple5IgnoringPrefix(org.joda.time.format.TestPeriodFormatterBuilder)  Time elapsed: 0.001 sec  <<< ERROR!
java.lang.IllegalArgumentException: No period converter found for type: org.joda.time.MutablePeriod
	at org.joda.time.convert.ConverterManager.getPeriodConverter(ConverterManager.java:83)
	at org.joda.time.base.BasePeriod.<init>(BasePeriod.java:272)
	at org.joda.time.Period.<init>(Period.java:674)
	at org.joda.time.base.AbstractPeriod.toPeriod(AbstractPeriod.java:147)
	at org.joda.time.format.PeriodFormatter.parsePeriod(PeriodFormatter.java:308)
	at org.joda.time.format.TestPeriodFormatterBuilder.testFormatPrefixSimple5IgnoringPrefix(TestPeriodFormatterBuilder.java:563)

testFormatPrefixSimple6IgnoringPrefix(org.joda.time.format.TestPeriodFormatterBuilder)  Time elapsed: 0 sec  <<< ERROR!
java.lang.IllegalArgumentException: No period converter found for type: org.joda.time.MutablePeriod
	at org.joda.time.convert.ConverterManager.getPeriodConverter(ConverterManager.java:83)
	at org.joda.time.base.BasePeriod.<init>(BasePeriod.java:272)
	at org.joda.time.Period.<init>(Period.java:674)
	at org.joda.time.base.AbstractPeriod.toPeriod(AbstractPeriod.java:147)
	at org.joda.time.format.PeriodFormatter.parsePeriod(PeriodFormatter.java:308)
	at org.joda.time.format.TestPeriodFormatterBuilder.testFormatPrefixSimple6IgnoringPrefix(TestPeriodFormatterBuilder.java:574)

testFormatSuffixPlural4IgnoringPrefix(org.joda.time.format.TestPeriodFormatterBuilder)  Time elapsed: 0 sec  <<< ERROR!
java.lang.IllegalArgumentException: No period converter found for type: org.joda.time.MutablePeriod
	at org.joda.time.convert.ConverterManager.getPeriodConverter(ConverterManager.java:83)
	at org.joda.time.base.BasePeriod.<init>(BasePeriod.java:272)
	at org.joda.time.Period.<init>(Period.java:674)
	at org.joda.time.base.AbstractPeriod.toPeriod(AbstractPeriod.java:147)
	at org.joda.time.format.PeriodFormatter.parsePeriod(PeriodFormatter.java:308)
	at org.joda.time.format.TestPeriodFormatterBuilder.testFormatSuffixPlural4IgnoringPrefix(TestPeriodFormatterBuilder.java:631)

testFormatSuffixRegEx5IgnoringAffix(org.joda.time.format.TestPeriodFormatterBuilder)  Time elapsed: 0 sec  <<< ERROR!
java.lang.IllegalArgumentException: No period converter found for type: org.joda.time.MutablePeriod
	at org.joda.time.convert.ConverterManager.getPeriodConverter(ConverterManager.java:83)
	at org.joda.time.base.BasePeriod.<init>(BasePeriod.java:272)
	at org.joda.time.Period.<init>(Period.java:674)
	at org.joda.time.base.AbstractPeriod.toPeriod(AbstractPeriod.java:147)
	at org.joda.time.format.PeriodFormatter.parsePeriod(PeriodFormatter.java:308)
	at org.joda.time.format.TestPeriodFormatterBuilder.testFormatSuffixRegEx5IgnoringAffix(TestPeriodFormatterBuilder.java:723)

testFormatSuffixComposite1(org.joda.time.format.TestPeriodFormatterBuilder)  Time elapsed: 0.001 sec  <<< ERROR!
java.lang.IllegalArgumentException: No period converter found for type: org.joda.time.MutablePeriod
	at org.joda.time.convert.ConverterManager.getPeriodConverter(ConverterManager.java:83)
	at org.joda.time.base.BasePeriod.<init>(BasePeriod.java:272)
	at org.joda.time.Period.<init>(Period.java:674)
	at org.joda.time.base.AbstractPeriod.toPeriod(AbstractPeriod.java:147)
	at org.joda.time.format.PeriodFormatter.parsePeriod(PeriodFormatter.java:308)
	at org.joda.time.format.TestPeriodFormatterBuilder.testFormatSuffixComposite1(TestPeriodFormatterBuilder.java:743)

testFormatSuffixComposite5IgnoringAffix(org.joda.time.format.TestPeriodFormatterBuilder)  Time elapsed: 0 sec  <<< ERROR!
java.lang.IllegalArgumentException: No period converter found for type: org.joda.time.MutablePeriod
	at org.joda.time.convert.ConverterManager.getPeriodConverter(ConverterManager.java:83)
	at org.joda.time.base.BasePeriod.<init>(BasePeriod.java:272)
	at org.joda.time.Period.<init>(Period.java:674)
	at org.joda.time.base.AbstractPeriod.toPeriod(AbstractPeriod.java:147)
	at org.joda.time.format.PeriodFormatter.parsePeriod(PeriodFormatter.java:308)
	at org.joda.time.format.TestPeriodFormatterBuilder.testFormatSuffixComposite5IgnoringAffix(TestPeriodFormatterBuilder.java:757)

testFormatAppend_PrinterParser_null_Parser(org.joda.time.format.TestPeriodFormatterBuilder)  Time elapsed: 0 sec  <<< ERROR!
java.lang.IllegalArgumentException: No period converter found for type: org.joda.time.MutablePeriod
	at org.joda.time.convert.ConverterManager.getPeriodConverter(ConverterManager.java:83)
	at org.joda.time.base.BasePeriod.<init>(BasePeriod.java:272)
	at org.joda.time.Period.<init>(Period.java:674)
	at org.joda.time.base.AbstractPeriod.toPeriod(AbstractPeriod.java:147)
	at org.joda.time.format.PeriodFormatter.parsePeriod(PeriodFormatter.java:308)
	at org.joda.time.format.TestPeriodFormatterBuilder.testFormatAppend_PrinterParser_null_Parser(TestPeriodFormatterBuilder.java:1104)

testFormatAppend_PrinterParser_PrinterParser(org.joda.time.format.TestPeriodFormatterBuilder)  Time elapsed: 0 sec  <<< ERROR!
java.lang.IllegalArgumentException: No period converter found for type: org.joda.time.MutablePeriod
	at org.joda.time.convert.ConverterManager.getPeriodConverter(ConverterManager.java:83)
	at org.joda.time.base.BasePeriod.<init>(BasePeriod.java:272)
	at org.joda.time.Period.<init>(Period.java:674)
	at org.joda.time.base.AbstractPeriod.toPeriod(AbstractPeriod.java:147)
	at org.joda.time.format.PeriodFormatter.parsePeriod(PeriodFormatter.java:308)
	at org.joda.time.format.TestPeriodFormatterBuilder.testFormatAppend_PrinterParser_PrinterParser(TestPeriodFormatterBuilder.java:1116)

testBug2495455(org.joda.time.format.TestPeriodFormatterBuilder)  Time elapsed: 0 sec  <<< ERROR!
java.lang.IllegalArgumentException: No period converter found for type: org.joda.time.MutablePeriod
	at org.joda.time.convert.ConverterManager.getPeriodConverter(ConverterManager.java:83)
	at org.joda.time.base.BasePeriod.<init>(BasePeriod.java:272)
	at org.joda.time.Period.<init>(Period.java:674)
	at org.joda.time.base.AbstractPeriod.toPeriod(AbstractPeriod.java:147)
	at org.joda.time.format.PeriodFormatter.parsePeriod(PeriodFormatter.java:308)
	at org.joda.time.format.TestPeriodFormatterBuilder.testBug2495455(TestPeriodFormatterBuilder.java:1166)

testMonthsAndMinutesAreConsideredSeparateAndCaseIsNotIgnored(org.joda.time.format.TestPeriodFormatterBuilder)  Time elapsed: 0 sec  <<< ERROR!
java.lang.IllegalArgumentException: No period converter found for type: org.joda.time.MutablePeriod
	at org.joda.time.convert.ConverterManager.getPeriodConverter(ConverterManager.java:83)
	at org.joda.time.base.BasePeriod.<init>(BasePeriod.java:272)
	at org.joda.time.Period.<init>(Period.java:674)
	at org.joda.time.base.AbstractPeriod.toPeriod(AbstractPeriod.java:147)
	at org.joda.time.format.PeriodFormatter.parsePeriod(PeriodFormatter.java:308)
	at org.joda.time.format.TestPeriodFormatterBuilder.testMonthsAndMinutesAreConsideredSeparateAndCaseIsNotIgnored(TestPeriodFormatterBuilder.java:1179)


Results :

Failed tests: 
  org.joda.time.convert.TestConverterManager#testGetPeriodConverterRemovedNull AssertionFailedError
Tests in error: 
  org.joda.time.TestDays#testFactory_parseDays_String IllegalArgumentException N...
  org.joda.time.TestDuration_Basics#testToPeriod_Chronology IllegalArgumentException
  org.joda.time.TestDuration_Basics#testToPeriod_PeriodType IllegalArgumentException
  org.joda.time.TestDuration_Basics#testToPeriod_PeriodType_Chronology IllegalArgumentException
  org.joda.time.TestHours#testFactory_parseHours_String IllegalArgumentException
  org.joda.time.TestInterval_Constructors#testParse_noFormatter IllegalArgumentException
  org.joda.time.TestMinutes#testFactory_parseMinutes_String IllegalArgumentException
  org.joda.time.TestMonths#testFactory_parseMonths_String IllegalArgumentException
  org.joda.time.TestMutableInterval_Constructors#testParse_noFormatter IllegalArgumentException
  org.joda.time.TestMutablePeriod_Basics#testToMutablePeriod IllegalArgumentException
  org.joda.time.TestMutablePeriod_Basics#testToPeriod IllegalArgumentException N...
  org.joda.time.TestMutablePeriod_Constructors#testConstructor_Object1 IllegalArgumentException
  org.joda.time.TestMutablePeriod_Constructors#testConstructor_Object2 IllegalArgumentException
  org.joda.time.TestMutablePeriod_Constructors#testConstructor_Object3 IllegalArgumentException
  org.joda.time.TestMutablePeriod_Constructors#testConstructor_Object4 IllegalArgumentException
  org.joda.time.TestMutablePeriod_Constructors#testConstructor_Object_Chronology1 IllegalArgumentException
  org.joda.time.TestMutablePeriod_Constructors#testConstructor_Object_Chronology2 IllegalArgumentException
  org.joda.time.TestMutablePeriod_Constructors#testConstructor_Object_PeriodType1 IllegalArgumentException
  org.joda.time.TestMutablePeriod_Constructors#testConstructor_Object_PeriodType2 IllegalArgumentException
  org.joda.time.TestMutablePeriod_Constructors#testConstructor_Object_PeriodType3 IllegalArgumentException
  org.joda.time.TestMutablePeriod_Constructors#testConstructor_Object_PeriodType4 IllegalArgumentException
  org.joda.time.TestMutablePeriod_Constructors#testParse_noFormatter IllegalArgumentException
  org.joda.time.TestPeriod_Basics#testToMutablePeriod IllegalArgumentException N...
  org.joda.time.TestPeriod_Basics#testWithPeriodType2 IllegalArgumentException N...
  org.joda.time.TestPeriod_Basics#testWithPeriodType5 IllegalArgumentException N...
  org.joda.time.TestPeriod_Constructors#testConstructor_Object1 IllegalArgumentException
  org.joda.time.TestPeriod_Constructors#testConstructor_Object2 IllegalArgumentException
  org.joda.time.TestPeriod_Constructors#testConstructor_Object3 IllegalArgumentException
  org.joda.time.TestPeriod_Constructors#testConstructor_Object4 IllegalArgumentException
  org.joda.time.TestPeriod_Constructors#testConstructor_Object_PeriodType1 IllegalArgumentException
  org.joda.time.TestPeriod_Constructors#testConstructor_Object_PeriodType2 IllegalArgumentException
  org.joda.time.TestPeriod_Constructors#testConstructor_Object_PeriodType3 IllegalArgumentException
  org.joda.time.TestPeriod_Constructors#testConstructor_Object_PeriodType4 IllegalArgumentException
  org.joda.time.TestPeriod_Constructors#testParse_noFormatter IllegalArgumentException
  org.joda.time.TestSeconds#testFactory_parseSeconds_String IllegalArgumentException
  org.joda.time.TestStringConvert#testDays IllegalArgumentException No period co...
  org.joda.time.TestStringConvert#testHours IllegalArgumentException No period c...
  org.joda.time.TestStringConvert#testMinutes IllegalArgumentException No period...
  org.joda.time.TestStringConvert#testMonths IllegalArgumentException No period ...
  org.joda.time.TestStringConvert#testMutablePeriod IllegalArgumentException No ...
  org.joda.time.TestStringConvert#testPeriod IllegalArgumentException No period ...
  org.joda.time.TestStringConvert#testSeconds IllegalArgumentException No period...
  org.joda.time.TestStringConvert#testWeeks IllegalArgumentException No period c...
  org.joda.time.TestStringConvert#testYears IllegalArgumentException No period c...
  org.joda.time.TestWeeks#testFactory_parseWeeks_String IllegalArgumentException
  org.joda.time.TestYears#testFactory_parseYears_String IllegalArgumentException
  org.joda.time.convert.TestConverterManager#testAddPeriodConverter1 IllegalArgumentException
  org.joda.time.convert.TestConverterManager#testAddPeriodConverter2 IllegalArgumentException
  org.joda.time.convert.TestConverterManager#testGetPeriodConverter IllegalArgumentException
  org.joda.time.convert.TestStringConverter#testSetIntoInterval_Object_Chronology1 IllegalArgumentException
  org.joda.time.convert.TestStringConverter#testSetIntoInterval_Object_Chronology2 IllegalArgumentException
  org.joda.time.convert.TestStringConverter#testSetIntoInterval_Object_Chronology4 IllegalArgumentException
  org.joda.time.convert.TestStringConverter#testSetIntoInterval_Object_Chronology5 IllegalArgumentException
  org.joda.time.format.TestISOPeriodFormatParsing#testParseStandard1 IllegalArgumentException
  org.joda.time.format.TestISOPeriodFormatParsing#testParseStandard10 IllegalArgumentException
  org.joda.time.format.TestISOPeriodFormatParsing#testParseStandard11 IllegalArgumentException
  org.joda.time.format.TestISOPeriodFormatParsing#testParseStandard2 IllegalArgumentException
  org.joda.time.format.TestISOPeriodFormatParsing#testParseStandard3 IllegalArgumentException
  org.joda.time.format.TestISOPeriodFormatParsing#testParseStandard4 IllegalArgumentException
  org.joda.time.format.TestISOPeriodFormatParsing#testParseStandard5 IllegalArgumentException
  org.joda.time.format.TestISOPeriodFormatParsing#testParseStandard6 IllegalArgumentException
  org.joda.time.format.TestISOPeriodFormatParsing#testParseStandard7 IllegalArgumentException
  org.joda.time.format.TestISOPeriodFormatParsing#testParseStandard8 IllegalArgumentException
  org.joda.time.format.TestISOPeriodFormatParsing#testParseStandard9 IllegalArgumentException
  org.joda.time.format.TestPeriodFormat#test_getDefault_parseOneField IllegalArgumentException
  org.joda.time.format.TestPeriodFormat#test_getDefault_parseTwoFields IllegalArgumentException
  org.joda.time.format.TestPeriodFormat#test_wordBased_de_parseOneField IllegalArgumentException
  org.joda.time.format.TestPeriodFormat#test_wordBased_de_parseTwoFields IllegalArgumentException
  org.joda.time.format.TestPeriodFormat#test_wordBased_en_withLocale_pt IllegalArgumentException
  org.joda.time.format.TestPeriodFormat#test_wordBased_es_parseOneField IllegalArgumentException
  org.joda.time.format.TestPeriodFormat#test_wordBased_es_parseTwoFields IllegalArgumentException
  org.joda.time.format.TestPeriodFormat#test_wordBased_fr_parseOneField IllegalArgumentException
  org.joda.time.format.TestPeriodFormat#test_wordBased_fr_parseTwoFields IllegalArgumentException
  org.joda.time.format.TestPeriodFormat#test_wordBased_ja_parseOneField IllegalArgumentException
  org.joda.time.format.TestPeriodFormat#test_wordBased_ja_parseTwoFields IllegalArgumentException
  org.joda.time.format.TestPeriodFormat#test_wordBased_nl_parseOneField IllegalArgumentException
  org.joda.time.format.TestPeriodFormat#test_wordBased_nl_parseTwoFields IllegalArgumentException
  org.joda.time.format.TestPeriodFormat#test_wordBased_pl_parseOneField IllegalArgumentException
  org.joda.time.format.TestPeriodFormat#test_wordBased_pl_parseTwoFields IllegalArgumentException
  org.joda.time.format.TestPeriodFormat#test_wordBased_pt_parseOneField IllegalArgumentException
  org.joda.time.format.TestPeriodFormat#test_wordBased_pt_parseTwoFields IllegalArgumentException
  org.joda.time.format.TestPeriodFormatParsing#testParseCustom1 IllegalArgumentException
  org.joda.time.format.TestPeriodFormatParsing#testParseNegativeMillis1 IllegalArgumentException
  org.joda.time.format.TestPeriodFormatParsing#testParseNegativeMillis2 IllegalArgumentException
  org.joda.time.format.TestPeriodFormatParsing#testParseStandard1 IllegalArgumentException
  org.joda.time.format.TestPeriodFormatter#testParsePeriod_parseType IllegalArgumentException
  org.joda.time.format.TestPeriodFormatter#testParsePeriod_simple IllegalArgumentException
  org.joda.time.format.TestPeriodFormatter#testPrinterParserMethods IllegalArgumentException
  org.joda.time.format.TestPeriodFormatterBuilder#testBug2495455 IllegalArgumentException
  org.joda.time.format.TestPeriodFormatterBuilder#testFormatAppend_PrinterParser_PrinterParser IllegalArgumentException
  org.joda.time.format.TestPeriodFormatterBuilder#testFormatAppend_PrinterParser_null_Parser IllegalArgumentException
  org.joda.time.format.TestPeriodFormatterBuilder#testFormatPrefixComposite1 IllegalArgumentException
  org.joda.time.format.TestPeriodFormatterBuilder#testFormatPrefixPlural4IgnoringPrefix IllegalArgumentException
  org.joda.time.format.TestPeriodFormatterBuilder#testFormatPrefixRegEx4IgnoringPrefix IllegalArgumentException
  org.joda.time.format.TestPeriodFormatterBuilder#testFormatPrefixSimple4IgnoringPrefix IllegalArgumentException
  org.joda.time.format.TestPeriodFormatterBuilder#testFormatPrefixSimple5IgnoringPrefix IllegalArgumentException
  org.joda.time.format.TestPeriodFormatterBuilder#testFormatPrefixSimple6IgnoringPrefix IllegalArgumentException
  org.joda.time.format.TestPeriodFormatterBuilder#testFormatSuffixComposite1 IllegalArgumentException
  org.joda.time.format.TestPeriodFormatterBuilder#testFormatSuffixComposite5IgnoringAffix IllegalArgumentException
  org.joda.time.format.TestPeriodFormatterBuilder#testFormatSuffixPlural4IgnoringPrefix IllegalArgumentException
  org.joda.time.format.TestPeriodFormatterBuilder#testFormatSuffixRegEx5IgnoringAffix IllegalArgumentException
  org.joda.time.format.TestPeriodFormatterBuilder#testMonthsAndMinutesAreConsideredSeparateAndCaseIsNotIgnored IllegalArgumentException
  org.joda.time.format.TestPeriodFormatterBuilder#testPluralAffixParseOrder IllegalArgumentException
  org.joda.time.format.TestPeriodFormatterBuilder#testRegExAffixParseOrder IllegalArgumentException

Tests run: 4157, Failures: 1, Errors: 104, Skipped: 0

[INFO] ------------------------------------------------------------------------
[INFO] BUILD FAILURE
[INFO] ------------------------------------------------------------------------
[INFO] Total time: 15.627s
[INFO] Finished at: Thu Aug 06 02:50:13 BST 2015
[INFO] Final Memory: 8M/218M
[INFO] ------------------------------------------------------------------------
[ERROR] Failed to execute goal org.apache.maven.plugins:maven-surefire-plugin:2.18.1:test (default-test) on project joda-time: There are test failures.
[ERROR] 
[ERROR] Please refer to /home/perham/Study/LittleDarwin/Cases/joda-time-2.8.1/target/surefire-reports for the individual test results.
[ERROR] -> [Help 1]
[ERROR] 
[ERROR] To see the full stack trace of the errors, re-run Maven with the -e switch.
[ERROR] Re-run Maven using the -X switch to enable full debug logging.
[ERROR] 
[ERROR] For more information about the errors and possible solutions, please read the following articles:
[ERROR] [Help 1] http://cwiki.apache.org/confluence/display/MAVEN/MojoFailureException
