[INFO] Scanning for projects...
[INFO]                                                                         
[INFO] ------------------------------------------------------------------------
[INFO] Building Joda-Time 2.8.1
[INFO] ------------------------------------------------------------------------
[INFO] 
[INFO] --- maven-resources-plugin:2.7:resources (default-resources) @ joda-time ---
[INFO] Using 'UTF-8' encoding to copy filtered resources.
[INFO] Copying 2 resources to META-INF
[INFO] Copying 10 resources
[INFO] 
[INFO] --- maven-compiler-plugin:3.3:compile (default-compile) @ joda-time ---
[INFO] Changes detected - recompiling the module!
[INFO] Compiling 166 source files to /home/perham/Study/LittleDarwin/Cases/joda-time-2.8.1/target/classes
[INFO] 
[INFO] --- exec-maven-plugin:1.4.0:java (compile-tzdb) @ joda-time ---
Writing zoneinfo files
Writing ZoneInfoMap
[INFO] 
[INFO] --- maven-resources-plugin:2.7:testResources (default-testResources) @ joda-time ---
[INFO] Using 'UTF-8' encoding to copy filtered resources.
[INFO] Copying 34 resources
[INFO] 
[INFO] --- maven-compiler-plugin:3.3:testCompile (default-testCompile) @ joda-time ---
[INFO] Nothing to compile - all classes are up to date
[INFO] 
[INFO] --- maven-surefire-plugin:2.18.1:test (default-test) @ joda-time ---
[INFO] Surefire report directory: /home/perham/Study/LittleDarwin/Cases/joda-time-2.8.1/target/surefire-reports

-------------------------------------------------------
 T E S T S
-------------------------------------------------------
Running org.joda.time.TestAllPackages

TestBuddhistChronology.testCalendar

TestCopticChronology.testCalendar

TestEthiopicChronology.testCalendar

TestIslamicChronology.testCalendar

Testing Gregorian chronology over 1000 iterations
100% complete (i=1000)

Testing Julian chronology over 1000 iterations
100% complete (i=1000)
Writing zoneinfo files
Writing ZoneInfoMap
Tests run: 4157, Failures: 0, Errors: 11, Skipped: 0, Time elapsed: 5.277 sec <<< FAILURE! - in org.joda.time.TestAllPackages
testConstructor_Object6(org.joda.time.TestInterval_Constructors)  Time elapsed: 0.004 sec  <<< ERROR!
java.lang.NullPointerException
	at org.joda.time.convert.ConverterManager.checkAlterIntervalConverters(ConverterManager.java:118)
	at org.joda.time.convert.ConverterManager.addIntervalConverter(ConverterManager.java:107)
	at org.joda.time.TestInterval_Constructors.testConstructor_Object6(TestInterval_Constructors.java:614)

testConstructor_Object5(org.joda.time.TestInterval_Constructors)  Time elapsed: 0.001 sec  <<< ERROR!
java.lang.NullPointerException
	at org.joda.time.convert.ConverterManager.checkAlterIntervalConverters(ConverterManager.java:118)
	at org.joda.time.convert.ConverterManager.addIntervalConverter(ConverterManager.java:107)
	at org.joda.time.TestInterval_Constructors.testConstructor_Object5(TestInterval_Constructors.java:589)

testConstructor_Object6(org.joda.time.TestMutableInterval_Constructors)  Time elapsed: 0.005 sec  <<< ERROR!
java.lang.NullPointerException
	at org.joda.time.convert.ConverterManager.checkAlterIntervalConverters(ConverterManager.java:118)
	at org.joda.time.convert.ConverterManager.addIntervalConverter(ConverterManager.java:107)
	at org.joda.time.TestMutableInterval_Constructors.testConstructor_Object6(TestMutableInterval_Constructors.java:590)

testConstructor_Object5(org.joda.time.TestMutableInterval_Constructors)  Time elapsed: 0 sec  <<< ERROR!
java.lang.NullPointerException
	at org.joda.time.convert.ConverterManager.checkAlterIntervalConverters(ConverterManager.java:118)
	at org.joda.time.convert.ConverterManager.addIntervalConverter(ConverterManager.java:107)
	at org.joda.time.TestMutableInterval_Constructors.testConstructor_Object5(TestMutableInterval_Constructors.java:565)

testGetIntervalConverterRemovedNull(org.joda.time.convert.TestConverterManager)  Time elapsed: 0.001 sec  <<< ERROR!
java.lang.NullPointerException
	at org.joda.time.convert.ConverterManager.checkAlterIntervalConverters(ConverterManager.java:118)
	at org.joda.time.convert.ConverterManager.addIntervalConverter(ConverterManager.java:107)
	at org.joda.time.convert.TestConverterManager.testGetIntervalConverterRemovedNull(TestConverterManager.java:870)

testAddIntervalConverter1(org.joda.time.convert.TestConverterManager)  Time elapsed: 0.001 sec  <<< ERROR!
java.lang.NullPointerException
	at org.joda.time.convert.ConverterManager.checkAlterIntervalConverters(ConverterManager.java:118)
	at org.joda.time.convert.ConverterManager.removeIntervalConverter(ConverterManager.java:112)
	at org.joda.time.convert.TestConverterManager.testAddIntervalConverter1(TestConverterManager.java:894)

testAddIntervalConverter2(org.joda.time.convert.TestConverterManager)  Time elapsed: 0.001 sec  <<< ERROR!
java.lang.NullPointerException
	at org.joda.time.convert.ConverterManager.checkAlterIntervalConverters(ConverterManager.java:118)
	at org.joda.time.convert.ConverterManager.addIntervalConverter(ConverterManager.java:107)
	at org.joda.time.convert.TestConverterManager.testAddIntervalConverter2(TestConverterManager.java:911)

testAddIntervalConverter3(org.joda.time.convert.TestConverterManager)  Time elapsed: 0 sec  <<< ERROR!
java.lang.NullPointerException
	at org.joda.time.convert.ConverterManager.checkAlterIntervalConverters(ConverterManager.java:118)
	at org.joda.time.convert.ConverterManager.addIntervalConverter(ConverterManager.java:107)
	at org.joda.time.convert.TestConverterManager.testAddIntervalConverter3(TestConverterManager.java:917)

testRemoveIntervalConverter1(org.joda.time.convert.TestConverterManager)  Time elapsed: 0.001 sec  <<< ERROR!
java.lang.NullPointerException
	at org.joda.time.convert.ConverterManager.checkAlterIntervalConverters(ConverterManager.java:118)
	at org.joda.time.convert.ConverterManager.addIntervalConverter(ConverterManager.java:107)
	at org.joda.time.convert.TestConverterManager.testRemoveIntervalConverter1(TestConverterManager.java:947)

testRemoveIntervalConverter2(org.joda.time.convert.TestConverterManager)  Time elapsed: 0 sec  <<< ERROR!
java.lang.NullPointerException
	at org.joda.time.convert.ConverterManager.checkAlterIntervalConverters(ConverterManager.java:118)
	at org.joda.time.convert.ConverterManager.removeIntervalConverter(ConverterManager.java:112)
	at org.joda.time.convert.TestConverterManager.testRemoveIntervalConverter2(TestConverterManager.java:958)

testRemoveIntervalConverter3(org.joda.time.convert.TestConverterManager)  Time elapsed: 0.001 sec  <<< ERROR!
java.lang.NullPointerException
	at org.joda.time.convert.ConverterManager.checkAlterIntervalConverters(ConverterManager.java:118)
	at org.joda.time.convert.ConverterManager.removeIntervalConverter(ConverterManager.java:112)
	at org.joda.time.convert.TestConverterManager.testRemoveIntervalConverter3(TestConverterManager.java:964)


Results :

Tests in error: 
  org.joda.time.TestInterval_Constructors#testConstructor_Object5 NullPointerException
  org.joda.time.TestInterval_Constructors#testConstructor_Object6 NullPointerException
  org.joda.time.TestMutableInterval_Constructors#testConstructor_Object5 NullPointerException
  org.joda.time.TestMutableInterval_Constructors#testConstructor_Object6 NullPointerException
  org.joda.time.convert.TestConverterManager#testAddIntervalConverter1 NullPointerException
  org.joda.time.convert.TestConverterManager#testAddIntervalConverter2 NullPointerException
  org.joda.time.convert.TestConverterManager#testAddIntervalConverter3 NullPointerException
  org.joda.time.convert.TestConverterManager#testGetIntervalConverterRemovedNull NullPointerException
  org.joda.time.convert.TestConverterManager#testRemoveIntervalConverter1 NullPointerException
  org.joda.time.convert.TestConverterManager#testRemoveIntervalConverter2 NullPointerException
  org.joda.time.convert.TestConverterManager#testRemoveIntervalConverter3 NullPointerException

Tests run: 4157, Failures: 0, Errors: 11, Skipped: 0

[INFO] ------------------------------------------------------------------------
[INFO] BUILD FAILURE
[INFO] ------------------------------------------------------------------------
[INFO] Total time: 15.252s
[INFO] Finished at: Thu Aug 06 02:47:18 BST 2015
[INFO] Final Memory: 9M/213M
[INFO] ------------------------------------------------------------------------
[ERROR] Failed to execute goal org.apache.maven.plugins:maven-surefire-plugin:2.18.1:test (default-test) on project joda-time: There are test failures.
[ERROR] 
[ERROR] Please refer to /home/perham/Study/LittleDarwin/Cases/joda-time-2.8.1/target/surefire-reports for the individual test results.
[ERROR] -> [Help 1]
[ERROR] 
[ERROR] To see the full stack trace of the errors, re-run Maven with the -e switch.
[ERROR] Re-run Maven using the -X switch to enable full debug logging.
[ERROR] 
[ERROR] For more information about the errors and possible solutions, please read the following articles:
[ERROR] [Help 1] http://cwiki.apache.org/confluence/display/MAVEN/MojoFailureException
