[INFO] Scanning for projects...
[INFO]                                                                         
[INFO] ------------------------------------------------------------------------
[INFO] Building Joda-Time 2.8.1
[INFO] ------------------------------------------------------------------------
[INFO] 
[INFO] --- maven-resources-plugin:2.7:resources (default-resources) @ joda-time ---
[INFO] Using 'UTF-8' encoding to copy filtered resources.
[INFO] Copying 2 resources to META-INF
[INFO] Copying 10 resources
[INFO] 
[INFO] --- maven-compiler-plugin:3.3:compile (default-compile) @ joda-time ---
[INFO] Changes detected - recompiling the module!
[INFO] Compiling 166 source files to /home/perham/Study/LittleDarwin/Cases/joda-time-2.8.1/target/classes
[INFO] 
[INFO] --- exec-maven-plugin:1.4.0:java (compile-tzdb) @ joda-time ---
Writing zoneinfo files
Writing ZoneInfoMap
[INFO] 
[INFO] --- maven-resources-plugin:2.7:testResources (default-testResources) @ joda-time ---
[INFO] Using 'UTF-8' encoding to copy filtered resources.
[INFO] Copying 34 resources
[INFO] 
[INFO] --- maven-compiler-plugin:3.3:testCompile (default-testCompile) @ joda-time ---
[INFO] Nothing to compile - all classes are up to date
[INFO] 
[INFO] --- maven-surefire-plugin:2.18.1:test (default-test) @ joda-time ---
[INFO] Surefire report directory: /home/perham/Study/LittleDarwin/Cases/joda-time-2.8.1/target/surefire-reports

-------------------------------------------------------
 T E S T S
-------------------------------------------------------
Running org.joda.time.TestAllPackages

TestBuddhistChronology.testCalendar

TestCopticChronology.testCalendar

TestEthiopicChronology.testCalendar

TestIslamicChronology.testCalendar

Testing Gregorian chronology over 1000 iterations
100% complete (i=1000)

Testing Julian chronology over 1000 iterations
100% complete (i=1000)
Writing zoneinfo files
Writing ZoneInfoMap
Tests run: 4157, Failures: 9, Errors: 1, Skipped: 0, Time elapsed: 5.349 sec <<< FAILURE! - in org.joda.time.TestAllPackages
testToString(org.joda.time.convert.TestCalendarConverter)  Time elapsed: 0.001 sec  <<< FAILURE!
junit.framework.ComparisonFailure: expected:<Converter[[java.util.Calendar]]> but was:<Converter[[null]]>
	at junit.framework.Assert.assertEquals(Assert.java:81)
	at junit.framework.Assert.assertEquals(Assert.java:87)
	at org.joda.time.convert.TestCalendarConverter.testToString(TestCalendarConverter.java:178)

testToString(org.joda.time.convert.TestDateConverter)  Time elapsed: 0.001 sec  <<< FAILURE!
junit.framework.ComparisonFailure: expected:<Converter[[java.util.Date]]> but was:<Converter[[null]]>
	at junit.framework.Assert.assertEquals(Assert.java:81)
	at junit.framework.Assert.assertEquals(Assert.java:87)
	at org.joda.time.convert.TestDateConverter.testToString(TestDateConverter.java:116)

testToString(org.joda.time.convert.TestLongConverter)  Time elapsed: 0.001 sec  <<< FAILURE!
junit.framework.ComparisonFailure: expected:<Converter[[java.lang.Long]]> but was:<Converter[[null]]>
	at junit.framework.Assert.assertEquals(Assert.java:81)
	at junit.framework.Assert.assertEquals(Assert.java:87)
	at org.joda.time.convert.TestLongConverter.testToString(TestLongConverter.java:118)

testToString(org.joda.time.convert.TestNullConverter)  Time elapsed: 0.001 sec  <<< ERROR!
java.lang.NullPointerException
	at org.joda.time.convert.AbstractConverter.toString(AbstractConverter.java:25)
	at org.joda.time.convert.TestNullConverter.testToString(TestNullConverter.java:188)

testToString(org.joda.time.convert.TestReadableDurationConverter)  Time elapsed: 0.001 sec  <<< FAILURE!
junit.framework.ComparisonFailure: expected:<Converter[[org.joda.time.ReadableDuration]]> but was:<Converter[[null]]>
	at junit.framework.Assert.assertEquals(Assert.java:81)
	at junit.framework.Assert.assertEquals(Assert.java:87)
	at org.joda.time.convert.TestReadableDurationConverter.testToString(TestReadableDurationConverter.java:128)

testToString(org.joda.time.convert.TestReadableIntervalConverter)  Time elapsed: 0 sec  <<< FAILURE!
junit.framework.ComparisonFailure: expected:<Converter[[org.joda.time.ReadableInterva]l]> but was:<Converter[[nul]l]>
	at junit.framework.Assert.assertEquals(Assert.java:81)
	at junit.framework.Assert.assertEquals(Assert.java:87)
	at org.joda.time.convert.TestReadableIntervalConverter.testToString(TestReadableIntervalConverter.java:185)

testToString(org.joda.time.convert.TestReadableInstantConverter)  Time elapsed: 0.001 sec  <<< FAILURE!
junit.framework.ComparisonFailure: expected:<Converter[[org.joda.time.ReadableInstant]]> but was:<Converter[[null]]>
	at junit.framework.Assert.assertEquals(Assert.java:81)
	at junit.framework.Assert.assertEquals(Assert.java:87)
	at org.joda.time.convert.TestReadableInstantConverter.testToString(TestReadableInstantConverter.java:144)

testToString(org.joda.time.convert.TestReadablePartialConverter)  Time elapsed: 0.001 sec  <<< FAILURE!
junit.framework.ComparisonFailure: expected:<Converter[[org.joda.time.ReadablePartia]l]> but was:<Converter[[nul]l]>
	at junit.framework.Assert.assertEquals(Assert.java:81)
	at junit.framework.Assert.assertEquals(Assert.java:87)
	at org.joda.time.convert.TestReadablePartialConverter.testToString(TestReadablePartialConverter.java:144)

testToString(org.joda.time.convert.TestReadablePeriodConverter)  Time elapsed: 0.001 sec  <<< FAILURE!
junit.framework.ComparisonFailure: expected:<Converter[[org.joda.time.ReadablePeriod]]> but was:<Converter[[null]]>
	at junit.framework.Assert.assertEquals(Assert.java:81)
	at junit.framework.Assert.assertEquals(Assert.java:87)
	at org.joda.time.convert.TestReadablePeriodConverter.testToString(TestReadablePeriodConverter.java:111)

testToString(org.joda.time.convert.TestStringConverter)  Time elapsed: 0.001 sec  <<< FAILURE!
junit.framework.ComparisonFailure: expected:<Converter[[java.lang.String]]> but was:<Converter[[null]]>
	at junit.framework.Assert.assertEquals(Assert.java:81)
	at junit.framework.Assert.assertEquals(Assert.java:87)
	at org.joda.time.convert.TestStringConverter.testToString(TestStringConverter.java:580)


Results :

Failed tests: 
  org.joda.time.convert.TestCalendarConverter#testToString ComparisonFailure exp...
  org.joda.time.convert.TestDateConverter#testToString ComparisonFailure expecte...
  org.joda.time.convert.TestLongConverter#testToString ComparisonFailure expecte...
  org.joda.time.convert.TestReadableDurationConverter#testToString ComparisonFailure
  org.joda.time.convert.TestReadableInstantConverter#testToString ComparisonFailure
  org.joda.time.convert.TestReadableIntervalConverter#testToString ComparisonFailure
  org.joda.time.convert.TestReadablePartialConverter#testToString ComparisonFailure
  org.joda.time.convert.TestReadablePeriodConverter#testToString ComparisonFailure
  org.joda.time.convert.TestStringConverter#testToString ComparisonFailure expec...
Tests in error: 
  org.joda.time.convert.TestNullConverter#testToString NullPointerException

Tests run: 4157, Failures: 9, Errors: 1, Skipped: 0

[INFO] ------------------------------------------------------------------------
[INFO] BUILD FAILURE
[INFO] ------------------------------------------------------------------------
[INFO] Total time: 16.522s
[INFO] Finished at: Thu Aug 06 02:46:09 BST 2015
[INFO] Final Memory: 9M/213M
[INFO] ------------------------------------------------------------------------
[ERROR] Failed to execute goal org.apache.maven.plugins:maven-surefire-plugin:2.18.1:test (default-test) on project joda-time: There are test failures.
[ERROR] 
[ERROR] Please refer to /home/perham/Study/LittleDarwin/Cases/joda-time-2.8.1/target/surefire-reports for the individual test results.
[ERROR] -> [Help 1]
[ERROR] 
[ERROR] To see the full stack trace of the errors, re-run Maven with the -e switch.
[ERROR] Re-run Maven using the -X switch to enable full debug logging.
[ERROR] 
[ERROR] For more information about the errors and possible solutions, please read the following articles:
[ERROR] [Help 1] http://cwiki.apache.org/confluence/display/MAVEN/MojoFailureException
