[INFO] Scanning for projects...
[INFO]                                                                         
[INFO] ------------------------------------------------------------------------
[INFO] Building Joda-Time 2.8.1
[INFO] ------------------------------------------------------------------------
[INFO] 
[INFO] --- maven-resources-plugin:2.7:resources (default-resources) @ joda-time ---
[INFO] Using 'UTF-8' encoding to copy filtered resources.
[INFO] Copying 2 resources to META-INF
[INFO] Copying 10 resources
[INFO] 
[INFO] --- maven-compiler-plugin:3.3:compile (default-compile) @ joda-time ---
[INFO] Changes detected - recompiling the module!
[INFO] Compiling 166 source files to /home/perham/Study/LittleDarwin/Cases/joda-time-2.8.1/target/classes
[INFO] 
[INFO] --- exec-maven-plugin:1.4.0:java (compile-tzdb) @ joda-time ---
Writing zoneinfo files
Writing ZoneInfoMap
[INFO] 
[INFO] --- maven-resources-plugin:2.7:testResources (default-testResources) @ joda-time ---
[INFO] Using 'UTF-8' encoding to copy filtered resources.
[INFO] Copying 34 resources
[INFO] 
[INFO] --- maven-compiler-plugin:3.3:testCompile (default-testCompile) @ joda-time ---
[INFO] Nothing to compile - all classes are up to date
[INFO] 
[INFO] --- maven-surefire-plugin:2.18.1:test (default-test) @ joda-time ---
[INFO] Surefire report directory: /home/perham/Study/LittleDarwin/Cases/joda-time-2.8.1/target/surefire-reports

-------------------------------------------------------
 T E S T S
-------------------------------------------------------
Running org.joda.time.TestAllPackages

TestBuddhistChronology.testCalendar

TestCopticChronology.testCalendar

TestEthiopicChronology.testCalendar

TestIslamicChronology.testCalendar

Testing Gregorian chronology over 1000 iterations
100% complete (i=1000)

Testing Julian chronology over 1000 iterations
100% complete (i=1000)
Writing zoneinfo files
Writing ZoneInfoMap
Tests run: 4157, Failures: 0, Errors: 43, Skipped: 0, Time elapsed: 5.312 sec <<< FAILURE! - in org.joda.time.TestAllPackages
testPropertyGetDifferenceHourOfDay(org.joda.time.TestDateTime_Properties)  Time elapsed: 0.005 sec  <<< ERROR!
java.lang.ArithmeticException: Adding time zone offset caused overflow
	at org.joda.time.chrono.ZonedChronology$ZonedDateTimeField.getOffsetToAdd(ZonedChronology.java:227)
	at org.joda.time.chrono.ZonedChronology$ZonedDateTimeField.getDifference(ZonedChronology.java:188)
	at org.joda.time.field.AbstractReadableInstantFieldProperty.getDifference(AbstractReadableInstantFieldProperty.java:216)
	at org.joda.time.TestDateTime_Properties.testPropertyGetDifferenceHourOfDay(TestDateTime_Properties.java:1112)

testPropertyRoundFloorHourOfDay(org.joda.time.TestDateTime_Properties)  Time elapsed: 0 sec  <<< ERROR!
java.lang.ArithmeticException: Adding time zone offset caused overflow
	at org.joda.time.chrono.ZonedChronology$ZonedDateTimeField.getOffsetToAdd(ZonedChronology.java:227)
	at org.joda.time.chrono.ZonedChronology$ZonedDateTimeField.roundFloor(ZonedChronology.java:199)
	at org.joda.time.DateTime$Property.roundFloorCopy(DateTime.java:2328)
	at org.joda.time.TestDateTime_Properties.testPropertyRoundFloorHourOfDay(TestDateTime_Properties.java:1124)

testPropertyRoundCeilingHourOfDay(org.joda.time.TestDateTime_Properties)  Time elapsed: 0.001 sec  <<< ERROR!
java.lang.ArithmeticException: Adding time zone offset caused overflow
	at org.joda.time.chrono.ZonedChronology$ZonedDateTimeField.getOffsetToAdd(ZonedChronology.java:227)
	at org.joda.time.chrono.ZonedChronology$ZonedDateTimeField.roundCeiling(ZonedChronology.java:205)
	at org.joda.time.DateTime$Property.roundCeilingCopy(DateTime.java:2337)
	at org.joda.time.TestDateTime_Properties.testPropertyRoundCeilingHourOfDay(TestDateTime_Properties.java:1130)

testPropertyRoundHalfFloorHourOfDay(org.joda.time.TestDateTime_Properties)  Time elapsed: 0.001 sec  <<< ERROR!
java.lang.ArithmeticException: Adding time zone offset caused overflow
	at org.joda.time.chrono.ZonedChronology$ZonedDateTimeField.getOffsetToAdd(ZonedChronology.java:227)
	at org.joda.time.chrono.ZonedChronology$ZonedDateTimeField.roundFloor(ZonedChronology.java:199)
	at org.joda.time.field.BaseDateTimeField.roundHalfFloor(BaseDateTimeField.java:903)
	at org.joda.time.DateTime$Property.roundHalfFloorCopy(DateTime.java:2347)
	at org.joda.time.TestDateTime_Properties.testPropertyRoundHalfFloorHourOfDay(TestDateTime_Properties.java:1136)

testPropertyRoundHalfCeilingHourOfDay(org.joda.time.TestDateTime_Properties)  Time elapsed: 0.001 sec  <<< ERROR!
java.lang.ArithmeticException: Adding time zone offset caused overflow
	at org.joda.time.chrono.ZonedChronology$ZonedDateTimeField.getOffsetToAdd(ZonedChronology.java:227)
	at org.joda.time.chrono.ZonedChronology$ZonedDateTimeField.roundFloor(ZonedChronology.java:199)
	at org.joda.time.field.BaseDateTimeField.roundHalfCeiling(BaseDateTimeField.java:927)
	at org.joda.time.DateTime$Property.roundHalfCeilingCopy(DateTime.java:2357)
	at org.joda.time.TestDateTime_Properties.testPropertyRoundHalfCeilingHourOfDay(TestDateTime_Properties.java:1150)

testPropertyRoundHalfEvenHourOfDay(org.joda.time.TestDateTime_Properties)  Time elapsed: 0.002 sec  <<< ERROR!
java.lang.ArithmeticException: Adding time zone offset caused overflow
	at org.joda.time.chrono.ZonedChronology$ZonedDateTimeField.getOffsetToAdd(ZonedChronology.java:227)
	at org.joda.time.chrono.ZonedChronology$ZonedDateTimeField.roundFloor(ZonedChronology.java:199)
	at org.joda.time.field.BaseDateTimeField.roundHalfEven(BaseDateTimeField.java:955)
	at org.joda.time.DateTime$Property.roundHalfEvenCopy(DateTime.java:2368)
	at org.joda.time.TestDateTime_Properties.testPropertyRoundHalfEvenHourOfDay(TestDateTime_Properties.java:1164)

testPropertyToIntervalHourOfDay(org.joda.time.TestDateTime_Properties)  Time elapsed: 0 sec  <<< ERROR!
java.lang.ArithmeticException: Adding time zone offset caused overflow
	at org.joda.time.chrono.ZonedChronology$ZonedDateTimeField.getOffsetToAdd(ZonedChronology.java:227)
	at org.joda.time.chrono.ZonedChronology$ZonedDateTimeField.roundFloor(ZonedChronology.java:199)
	at org.joda.time.field.AbstractReadableInstantFieldProperty.toInterval(AbstractReadableInstantFieldProperty.java:371)
	at org.joda.time.TestDateTime_Properties.testPropertyToIntervalHourOfDay(TestDateTime_Properties.java:1342)

testPropertyToIntervalMinuteOfHour(org.joda.time.TestDateTime_Properties)  Time elapsed: 0.001 sec  <<< ERROR!
java.lang.ArithmeticException: Adding time zone offset caused overflow
	at org.joda.time.chrono.ZonedChronology$ZonedDateTimeField.getOffsetToAdd(ZonedChronology.java:227)
	at org.joda.time.chrono.ZonedChronology$ZonedDateTimeField.roundFloor(ZonedChronology.java:199)
	at org.joda.time.field.AbstractReadableInstantFieldProperty.toInterval(AbstractReadableInstantFieldProperty.java:371)
	at org.joda.time.TestDateTime_Properties.testPropertyToIntervalMinuteOfHour(TestDateTime_Properties.java:1354)

testPropertyToIntervalSecondOfMinute(org.joda.time.TestDateTime_Properties)  Time elapsed: 0 sec  <<< ERROR!
java.lang.ArithmeticException: Adding time zone offset caused overflow
	at org.joda.time.chrono.ZonedChronology$ZonedDateTimeField.getOffsetToAdd(ZonedChronology.java:227)
	at org.joda.time.chrono.ZonedChronology$ZonedDateTimeField.roundFloor(ZonedChronology.java:199)
	at org.joda.time.field.AbstractReadableInstantFieldProperty.toInterval(AbstractReadableInstantFieldProperty.java:371)
	at org.joda.time.TestDateTime_Properties.testPropertyToIntervalSecondOfMinute(TestDateTime_Properties.java:1361)

testPropertyToIntervalMillisOfSecond(org.joda.time.TestDateTime_Properties)  Time elapsed: 0.001 sec  <<< ERROR!
java.lang.ArithmeticException: Adding time zone offset caused overflow
	at org.joda.time.chrono.ZonedChronology$ZonedDateTimeField.getOffsetToAdd(ZonedChronology.java:227)
	at org.joda.time.chrono.ZonedChronology$ZonedDateTimeField.roundFloor(ZonedChronology.java:199)
	at org.joda.time.field.AbstractReadableInstantFieldProperty.toInterval(AbstractReadableInstantFieldProperty.java:371)
	at org.joda.time.TestDateTime_Properties.testPropertyToIntervalMillisOfSecond(TestDateTime_Properties.java:1368)

testEqualsHashCode(org.joda.time.TestMutableDateTime_Basics)  Time elapsed: 0.001 sec  <<< ERROR!
java.lang.ArithmeticException: Adding time zone offset caused overflow
	at org.joda.time.chrono.ZonedChronology$ZonedDateTimeField.getOffsetToAdd(ZonedChronology.java:227)
	at org.joda.time.chrono.ZonedChronology$ZonedDateTimeField.roundFloor(ZonedChronology.java:199)
	at org.joda.time.MutableDateTime.setMillis(MutableDateTime.java:457)
	at org.joda.time.MutableDateTime.setRounding(MutableDateTime.java:440)
	at org.joda.time.MutableDateTime.setRounding(MutableDateTime.java:417)
	at org.joda.time.TestMutableDateTime_Basics.testEqualsHashCode(TestMutableDateTime_Basics.java:236)

testRounding1(org.joda.time.TestMutableDateTime_Basics)  Time elapsed: 0 sec  <<< ERROR!
java.lang.ArithmeticException: Adding time zone offset caused overflow
	at org.joda.time.chrono.ZonedChronology$ZonedDateTimeField.getOffsetToAdd(ZonedChronology.java:227)
	at org.joda.time.chrono.ZonedChronology$ZonedDateTimeField.roundFloor(ZonedChronology.java:199)
	at org.joda.time.MutableDateTime.setMillis(MutableDateTime.java:457)
	at org.joda.time.MutableDateTime.setRounding(MutableDateTime.java:440)
	at org.joda.time.MutableDateTime.setRounding(MutableDateTime.java:417)
	at org.joda.time.TestMutableDateTime_Basics.testRounding1(TestMutableDateTime_Basics.java:630)

testRounding2(org.joda.time.TestMutableDateTime_Basics)  Time elapsed: 0.001 sec  <<< ERROR!
java.lang.ArithmeticException: Adding time zone offset caused overflow
	at org.joda.time.chrono.ZonedChronology$ZonedDateTimeField.getOffsetToAdd(ZonedChronology.java:227)
	at org.joda.time.chrono.ZonedChronology$ZonedDateTimeField.roundCeiling(ZonedChronology.java:205)
	at org.joda.time.MutableDateTime.setMillis(MutableDateTime.java:460)
	at org.joda.time.MutableDateTime.setRounding(MutableDateTime.java:440)
	at org.joda.time.TestMutableDateTime_Basics.testRounding2(TestMutableDateTime_Basics.java:638)

testRounding3(org.joda.time.TestMutableDateTime_Basics)  Time elapsed: 0 sec  <<< ERROR!
java.lang.ArithmeticException: Adding time zone offset caused overflow
	at org.joda.time.chrono.ZonedChronology$ZonedDateTimeField.getOffsetToAdd(ZonedChronology.java:227)
	at org.joda.time.chrono.ZonedChronology$ZonedDateTimeField.roundFloor(ZonedChronology.java:199)
	at org.joda.time.field.BaseDateTimeField.roundHalfCeiling(BaseDateTimeField.java:927)
	at org.joda.time.MutableDateTime.setMillis(MutableDateTime.java:466)
	at org.joda.time.MutableDateTime.setRounding(MutableDateTime.java:440)
	at org.joda.time.TestMutableDateTime_Basics.testRounding3(TestMutableDateTime_Basics.java:646)

testRounding4(org.joda.time.TestMutableDateTime_Basics)  Time elapsed: 0.001 sec  <<< ERROR!
java.lang.ArithmeticException: Adding time zone offset caused overflow
	at org.joda.time.chrono.ZonedChronology$ZonedDateTimeField.getOffsetToAdd(ZonedChronology.java:227)
	at org.joda.time.chrono.ZonedChronology$ZonedDateTimeField.roundFloor(ZonedChronology.java:199)
	at org.joda.time.field.BaseDateTimeField.roundHalfFloor(BaseDateTimeField.java:903)
	at org.joda.time.MutableDateTime.setMillis(MutableDateTime.java:463)
	at org.joda.time.MutableDateTime.setRounding(MutableDateTime.java:440)
	at org.joda.time.TestMutableDateTime_Basics.testRounding4(TestMutableDateTime_Basics.java:658)

testRounding5(org.joda.time.TestMutableDateTime_Basics)  Time elapsed: 0.001 sec  <<< ERROR!
java.lang.ArithmeticException: Adding time zone offset caused overflow
	at org.joda.time.chrono.ZonedChronology$ZonedDateTimeField.getOffsetToAdd(ZonedChronology.java:227)
	at org.joda.time.chrono.ZonedChronology$ZonedDateTimeField.roundFloor(ZonedChronology.java:199)
	at org.joda.time.field.BaseDateTimeField.roundHalfEven(BaseDateTimeField.java:955)
	at org.joda.time.MutableDateTime.setMillis(MutableDateTime.java:469)
	at org.joda.time.MutableDateTime.setRounding(MutableDateTime.java:440)
	at org.joda.time.TestMutableDateTime_Basics.testRounding5(TestMutableDateTime_Basics.java:670)

testRounding8(org.joda.time.TestMutableDateTime_Basics)  Time elapsed: 0.001 sec  <<< ERROR!
java.lang.ArithmeticException: Adding time zone offset caused overflow
	at org.joda.time.chrono.ZonedChronology$ZonedDateTimeField.getOffsetToAdd(ZonedChronology.java:227)
	at org.joda.time.chrono.ZonedChronology$ZonedDateTimeField.roundCeiling(ZonedChronology.java:205)
	at org.joda.time.MutableDateTime.setMillis(MutableDateTime.java:460)
	at org.joda.time.MutableDateTime.setRounding(MutableDateTime.java:440)
	at org.joda.time.TestMutableDateTime_Basics.testRounding8(TestMutableDateTime_Basics.java:705)

testPropertyRoundFloorHourOfDay(org.joda.time.TestMutableDateTime_Properties)  Time elapsed: 0.001 sec  <<< ERROR!
java.lang.ArithmeticException: Adding time zone offset caused overflow
	at org.joda.time.chrono.ZonedChronology$ZonedDateTimeField.getOffsetToAdd(ZonedChronology.java:227)
	at org.joda.time.chrono.ZonedChronology$ZonedDateTimeField.roundFloor(ZonedChronology.java:199)
	at org.joda.time.MutableDateTime$Property.roundFloor(MutableDateTime.java:1423)
	at org.joda.time.TestMutableDateTime_Properties.testPropertyRoundFloorHourOfDay(TestMutableDateTime_Properties.java:528)

testPropertyRoundCeilingHourOfDay(org.joda.time.TestMutableDateTime_Properties)  Time elapsed: 0.001 sec  <<< ERROR!
java.lang.ArithmeticException: Adding time zone offset caused overflow
	at org.joda.time.chrono.ZonedChronology$ZonedDateTimeField.getOffsetToAdd(ZonedChronology.java:227)
	at org.joda.time.chrono.ZonedChronology$ZonedDateTimeField.roundCeiling(ZonedChronology.java:205)
	at org.joda.time.MutableDateTime$Property.roundCeiling(MutableDateTime.java:1434)
	at org.joda.time.TestMutableDateTime_Properties.testPropertyRoundCeilingHourOfDay(TestMutableDateTime_Properties.java:534)

testPropertyRoundHalfFloorHourOfDay(org.joda.time.TestMutableDateTime_Properties)  Time elapsed: 0 sec  <<< ERROR!
java.lang.ArithmeticException: Adding time zone offset caused overflow
	at org.joda.time.chrono.ZonedChronology$ZonedDateTimeField.getOffsetToAdd(ZonedChronology.java:227)
	at org.joda.time.chrono.ZonedChronology$ZonedDateTimeField.roundFloor(ZonedChronology.java:199)
	at org.joda.time.field.BaseDateTimeField.roundHalfFloor(BaseDateTimeField.java:903)
	at org.joda.time.MutableDateTime$Property.roundHalfFloor(MutableDateTime.java:1446)
	at org.joda.time.TestMutableDateTime_Properties.testPropertyRoundHalfFloorHourOfDay(TestMutableDateTime_Properties.java:540)

testPropertyRoundHalfCeilingHourOfDay(org.joda.time.TestMutableDateTime_Properties)  Time elapsed: 0.001 sec  <<< ERROR!
java.lang.ArithmeticException: Adding time zone offset caused overflow
	at org.joda.time.chrono.ZonedChronology$ZonedDateTimeField.getOffsetToAdd(ZonedChronology.java:227)
	at org.joda.time.chrono.ZonedChronology$ZonedDateTimeField.roundFloor(ZonedChronology.java:199)
	at org.joda.time.field.BaseDateTimeField.roundHalfCeiling(BaseDateTimeField.java:927)
	at org.joda.time.MutableDateTime$Property.roundHalfCeiling(MutableDateTime.java:1458)
	at org.joda.time.TestMutableDateTime_Properties.testPropertyRoundHalfCeilingHourOfDay(TestMutableDateTime_Properties.java:554)

testPropertyRoundHalfEvenHourOfDay(org.joda.time.TestMutableDateTime_Properties)  Time elapsed: 0 sec  <<< ERROR!
java.lang.ArithmeticException: Adding time zone offset caused overflow
	at org.joda.time.chrono.ZonedChronology$ZonedDateTimeField.getOffsetToAdd(ZonedChronology.java:227)
	at org.joda.time.chrono.ZonedChronology$ZonedDateTimeField.roundFloor(ZonedChronology.java:199)
	at org.joda.time.field.BaseDateTimeField.roundHalfEven(BaseDateTimeField.java:955)
	at org.joda.time.MutableDateTime$Property.roundHalfEven(MutableDateTime.java:1470)
	at org.joda.time.TestMutableDateTime_Properties.testPropertyRoundHalfEvenHourOfDay(TestMutableDateTime_Properties.java:568)

testPropertyToIntervalHourOfDay(org.joda.time.TestMutableDateTime_Properties)  Time elapsed: 0.001 sec  <<< ERROR!
java.lang.ArithmeticException: Adding time zone offset caused overflow
	at org.joda.time.chrono.ZonedChronology$ZonedDateTimeField.getOffsetToAdd(ZonedChronology.java:227)
	at org.joda.time.chrono.ZonedChronology$ZonedDateTimeField.roundFloor(ZonedChronology.java:199)
	at org.joda.time.field.AbstractReadableInstantFieldProperty.toInterval(AbstractReadableInstantFieldProperty.java:371)
	at org.joda.time.TestMutableDateTime_Properties.testPropertyToIntervalHourOfDay(TestMutableDateTime_Properties.java:740)

testPropertyToIntervalMinuteOfHour(org.joda.time.TestMutableDateTime_Properties)  Time elapsed: 0 sec  <<< ERROR!
java.lang.ArithmeticException: Adding time zone offset caused overflow
	at org.joda.time.chrono.ZonedChronology$ZonedDateTimeField.getOffsetToAdd(ZonedChronology.java:227)
	at org.joda.time.chrono.ZonedChronology$ZonedDateTimeField.roundFloor(ZonedChronology.java:199)
	at org.joda.time.field.AbstractReadableInstantFieldProperty.toInterval(AbstractReadableInstantFieldProperty.java:371)
	at org.joda.time.TestMutableDateTime_Properties.testPropertyToIntervalMinuteOfHour(TestMutableDateTime_Properties.java:754)

testPropertyToIntervalSecondOfMinute(org.joda.time.TestMutableDateTime_Properties)  Time elapsed: 0.001 sec  <<< ERROR!
java.lang.ArithmeticException: Adding time zone offset caused overflow
	at org.joda.time.chrono.ZonedChronology$ZonedDateTimeField.getOffsetToAdd(ZonedChronology.java:227)
	at org.joda.time.chrono.ZonedChronology$ZonedDateTimeField.roundFloor(ZonedChronology.java:199)
	at org.joda.time.field.AbstractReadableInstantFieldProperty.toInterval(AbstractReadableInstantFieldProperty.java:371)
	at org.joda.time.TestMutableDateTime_Properties.testPropertyToIntervalSecondOfMinute(TestMutableDateTime_Properties.java:762)

testPropertyToIntervalMillisOfSecond(org.joda.time.TestMutableDateTime_Properties)  Time elapsed: 0 sec  <<< ERROR!
java.lang.ArithmeticException: Adding time zone offset caused overflow
	at org.joda.time.chrono.ZonedChronology$ZonedDateTimeField.getOffsetToAdd(ZonedChronology.java:227)
	at org.joda.time.chrono.ZonedChronology$ZonedDateTimeField.roundFloor(ZonedChronology.java:199)
	at org.joda.time.field.AbstractReadableInstantFieldProperty.toInterval(AbstractReadableInstantFieldProperty.java:371)
	at org.joda.time.TestMutableDateTime_Properties.testPropertyToIntervalMillisOfSecond(TestMutableDateTime_Properties.java:770)

testPropertyGetDifferenceMonthOfYear(org.joda.time.TestDateMidnight_Properties)  Time elapsed: 0.001 sec  <<< ERROR!
java.lang.ArithmeticException: Adding time zone offset caused overflow
	at org.joda.time.chrono.ZonedChronology$ZonedDateTimeField.getOffsetToAdd(ZonedChronology.java:227)
	at org.joda.time.chrono.ZonedChronology$ZonedDateTimeField.getDifference(ZonedChronology.java:188)
	at org.joda.time.field.AbstractReadableInstantFieldProperty.getDifference(AbstractReadableInstantFieldProperty.java:216)
	at org.joda.time.TestDateMidnight_Properties.testPropertyGetDifferenceMonthOfYear(TestDateMidnight_Properties.java:301)

testConstructor_RP_RI7(org.joda.time.TestInterval_Constructors)  Time elapsed: 0 sec  <<< ERROR!
java.lang.ArithmeticException: Adding time zone offset caused overflow
	at org.joda.time.chrono.ZonedChronology$ZonedDateTimeField.getOffsetToAdd(ZonedChronology.java:227)
	at org.joda.time.chrono.ZonedChronology$ZonedDateTimeField.add(ZonedChronology.java:159)
	at org.joda.time.TestInterval_Constructors.testConstructor_RP_RI7(TestInterval_Constructors.java:419)

testConstructor_RI_RD4(org.joda.time.TestInterval_Constructors)  Time elapsed: 0 sec  <<< ERROR!
java.lang.ArithmeticException: Adding time zone offset caused overflow
	at org.joda.time.chrono.ZonedChronology$ZonedDateTimeField.getOffsetToAdd(ZonedChronology.java:227)
	at org.joda.time.chrono.ZonedChronology$ZonedDateTimeField.add(ZonedChronology.java:159)
	at org.joda.time.TestInterval_Constructors.testConstructor_RI_RD4(TestInterval_Constructors.java:465)

testConstructor_RD_RI4(org.joda.time.TestInterval_Constructors)  Time elapsed: 0.001 sec  <<< ERROR!
java.lang.ArithmeticException: Adding time zone offset caused overflow
	at org.joda.time.chrono.ZonedChronology$ZonedDateTimeField.getOffsetToAdd(ZonedChronology.java:227)
	at org.joda.time.chrono.ZonedChronology$ZonedDateTimeField.add(ZonedChronology.java:159)
	at org.joda.time.TestInterval_Constructors.testConstructor_RD_RI4(TestInterval_Constructors.java:513)

testConstructor_RI_RP7(org.joda.time.TestInterval_Constructors)  Time elapsed: 0 sec  <<< ERROR!
java.lang.ArithmeticException: Adding time zone offset caused overflow
	at org.joda.time.chrono.ZonedChronology$ZonedDateTimeField.getOffsetToAdd(ZonedChronology.java:227)
	at org.joda.time.chrono.ZonedChronology$ZonedDateTimeField.add(ZonedChronology.java:159)
	at org.joda.time.TestInterval_Constructors.testConstructor_RI_RP7(TestInterval_Constructors.java:335)

testConstructor_RP_RI7(org.joda.time.TestMutableInterval_Constructors)  Time elapsed: 0 sec  <<< ERROR!
java.lang.ArithmeticException: Adding time zone offset caused overflow
	at org.joda.time.chrono.ZonedChronology$ZonedDateTimeField.getOffsetToAdd(ZonedChronology.java:227)
	at org.joda.time.chrono.ZonedChronology$ZonedDateTimeField.add(ZonedChronology.java:159)
	at org.joda.time.TestMutableInterval_Constructors.testConstructor_RP_RI7(TestMutableInterval_Constructors.java:395)

testConstructor_RI_RD4(org.joda.time.TestMutableInterval_Constructors)  Time elapsed: 0 sec  <<< ERROR!
java.lang.ArithmeticException: Adding time zone offset caused overflow
	at org.joda.time.chrono.ZonedChronology$ZonedDateTimeField.getOffsetToAdd(ZonedChronology.java:227)
	at org.joda.time.chrono.ZonedChronology$ZonedDateTimeField.add(ZonedChronology.java:159)
	at org.joda.time.TestMutableInterval_Constructors.testConstructor_RI_RD4(TestMutableInterval_Constructors.java:441)

testConstructor_RD_RI4(org.joda.time.TestMutableInterval_Constructors)  Time elapsed: 0 sec  <<< ERROR!
java.lang.ArithmeticException: Adding time zone offset caused overflow
	at org.joda.time.chrono.ZonedChronology$ZonedDateTimeField.getOffsetToAdd(ZonedChronology.java:227)
	at org.joda.time.chrono.ZonedChronology$ZonedDateTimeField.add(ZonedChronology.java:159)
	at org.joda.time.TestMutableInterval_Constructors.testConstructor_RD_RI4(TestMutableInterval_Constructors.java:489)

testConstructor_RI_RP7(org.joda.time.TestMutableInterval_Constructors)  Time elapsed: 0.001 sec  <<< ERROR!
java.lang.ArithmeticException: Adding time zone offset caused overflow
	at org.joda.time.chrono.ZonedChronology$ZonedDateTimeField.getOffsetToAdd(ZonedChronology.java:227)
	at org.joda.time.chrono.ZonedChronology$ZonedDateTimeField.add(ZonedChronology.java:159)
	at org.joda.time.TestMutableInterval_Constructors.testConstructor_RI_RP7(TestMutableInterval_Constructors.java:311)

testBasicComps3(org.joda.time.TestDateTimeComparator)  Time elapsed: 0.001 sec  <<< ERROR!
java.lang.ArithmeticException: Adding time zone offset caused overflow
	at org.joda.time.chrono.ZonedChronology$ZonedDateTimeField.getOffsetToAdd(ZonedChronology.java:227)
	at org.joda.time.chrono.ZonedChronology$ZonedDateTimeField.roundFloor(ZonedChronology.java:199)
	at org.joda.time.DateTimeComparator.compare(DateTimeComparator.java:201)
	at org.joda.time.TestDateTimeComparator.testBasicComps3(TestDateTimeComparator.java:360)

testBasicComps4(org.joda.time.TestDateTimeComparator)  Time elapsed: 0 sec  <<< ERROR!
java.lang.ArithmeticException: Adding time zone offset caused overflow
	at org.joda.time.chrono.ZonedChronology$ZonedDateTimeField.getOffsetToAdd(ZonedChronology.java:227)
	at org.joda.time.chrono.ZonedChronology$ZonedDateTimeField.roundFloor(ZonedChronology.java:199)
	at org.joda.time.DateTimeComparator.compare(DateTimeComparator.java:201)
	at org.joda.time.TestDateTimeComparator.testBasicComps4(TestDateTimeComparator.java:383)

testBasicComps5(org.joda.time.TestDateTimeComparator)  Time elapsed: 0.001 sec  <<< ERROR!
java.lang.ArithmeticException: Adding time zone offset caused overflow
	at org.joda.time.chrono.ZonedChronology$ZonedDateTimeField.getOffsetToAdd(ZonedChronology.java:227)
	at org.joda.time.chrono.ZonedChronology$ZonedDateTimeField.roundFloor(ZonedChronology.java:199)
	at org.joda.time.DateTimeComparator.compare(DateTimeComparator.java:201)
	at org.joda.time.TestDateTimeComparator.testBasicComps5(TestDateTimeComparator.java:405)

test_roundFloor_long(org.joda.time.field.TestOffsetDateTimeField)  Time elapsed: 0.001 sec  <<< ERROR!
java.lang.ArithmeticException: Adding time zone offset caused overflow
	at org.joda.time.chrono.ZonedChronology$ZonedDateTimeField.getOffsetToAdd(ZonedChronology.java:227)
	at org.joda.time.chrono.ZonedChronology$ZonedDateTimeField.roundFloor(ZonedChronology.java:199)
	at org.joda.time.field.OffsetDateTimeField.roundFloor(OffsetDateTimeField.java:188)
	at org.joda.time.field.TestOffsetDateTimeField.test_roundFloor_long(TestOffsetDateTimeField.java:471)

test_roundCeiling_long(org.joda.time.field.TestOffsetDateTimeField)  Time elapsed: 0 sec  <<< ERROR!
java.lang.ArithmeticException: Adding time zone offset caused overflow
	at org.joda.time.chrono.ZonedChronology$ZonedDateTimeField.getOffsetToAdd(ZonedChronology.java:227)
	at org.joda.time.chrono.ZonedChronology$ZonedDateTimeField.roundCeiling(ZonedChronology.java:205)
	at org.joda.time.field.OffsetDateTimeField.roundCeiling(OffsetDateTimeField.java:192)
	at org.joda.time.field.TestOffsetDateTimeField.test_roundCeiling_long(TestOffsetDateTimeField.java:485)

test_roundHalfFloor_long(org.joda.time.field.TestOffsetDateTimeField)  Time elapsed: 0 sec  <<< ERROR!
java.lang.ArithmeticException: Adding time zone offset caused overflow
	at org.joda.time.chrono.ZonedChronology$ZonedDateTimeField.getOffsetToAdd(ZonedChronology.java:227)
	at org.joda.time.chrono.ZonedChronology$ZonedDateTimeField.roundFloor(ZonedChronology.java:199)
	at org.joda.time.field.BaseDateTimeField.roundHalfFloor(BaseDateTimeField.java:903)
	at org.joda.time.field.OffsetDateTimeField.roundHalfFloor(OffsetDateTimeField.java:196)
	at org.joda.time.field.TestOffsetDateTimeField.test_roundHalfFloor_long(TestOffsetDateTimeField.java:495)

test_roundHalfCeiling_long(org.joda.time.field.TestOffsetDateTimeField)  Time elapsed: 0.001 sec  <<< ERROR!
java.lang.ArithmeticException: Adding time zone offset caused overflow
	at org.joda.time.chrono.ZonedChronology$ZonedDateTimeField.getOffsetToAdd(ZonedChronology.java:227)
	at org.joda.time.chrono.ZonedChronology$ZonedDateTimeField.roundFloor(ZonedChronology.java:199)
	at org.joda.time.field.BaseDateTimeField.roundHalfCeiling(BaseDateTimeField.java:927)
	at org.joda.time.field.OffsetDateTimeField.roundHalfCeiling(OffsetDateTimeField.java:200)
	at org.joda.time.field.TestOffsetDateTimeField.test_roundHalfCeiling_long(TestOffsetDateTimeField.java:504)

test_roundHalfEven_long(org.joda.time.field.TestOffsetDateTimeField)  Time elapsed: 0 sec  <<< ERROR!
java.lang.ArithmeticException: Adding time zone offset caused overflow
	at org.joda.time.chrono.ZonedChronology$ZonedDateTimeField.getOffsetToAdd(ZonedChronology.java:227)
	at org.joda.time.chrono.ZonedChronology$ZonedDateTimeField.roundFloor(ZonedChronology.java:199)
	at org.joda.time.field.BaseDateTimeField.roundHalfEven(BaseDateTimeField.java:955)
	at org.joda.time.field.OffsetDateTimeField.roundHalfEven(OffsetDateTimeField.java:204)
	at org.joda.time.field.TestOffsetDateTimeField.test_roundHalfEven_long(TestOffsetDateTimeField.java:513)


Results :

Tests in error: 
  org.joda.time.TestDateMidnight_Properties#testPropertyGetDifferenceMonthOfYear ArithmeticException
  org.joda.time.TestDateTimeComparator#testBasicComps3 ArithmeticException Addin...
  org.joda.time.TestDateTimeComparator#testBasicComps4 ArithmeticException Addin...
  org.joda.time.TestDateTimeComparator#testBasicComps5 ArithmeticException Addin...
  org.joda.time.TestDateTime_Properties#testPropertyGetDifferenceHourOfDay ArithmeticException
  org.joda.time.TestDateTime_Properties#testPropertyRoundCeilingHourOfDay ArithmeticException
  org.joda.time.TestDateTime_Properties#testPropertyRoundFloorHourOfDay ArithmeticException
  org.joda.time.TestDateTime_Properties#testPropertyRoundHalfCeilingHourOfDay ArithmeticException
  org.joda.time.TestDateTime_Properties#testPropertyRoundHalfEvenHourOfDay ArithmeticException
  org.joda.time.TestDateTime_Properties#testPropertyRoundHalfFloorHourOfDay ArithmeticException
  org.joda.time.TestDateTime_Properties#testPropertyToIntervalHourOfDay ArithmeticException
  org.joda.time.TestDateTime_Properties#testPropertyToIntervalMillisOfSecond ArithmeticException
  org.joda.time.TestDateTime_Properties#testPropertyToIntervalMinuteOfHour ArithmeticException
  org.joda.time.TestDateTime_Properties#testPropertyToIntervalSecondOfMinute ArithmeticException
  org.joda.time.TestInterval_Constructors#testConstructor_RD_RI4 ArithmeticException
  org.joda.time.TestInterval_Constructors#testConstructor_RI_RD4 ArithmeticException
  org.joda.time.TestInterval_Constructors#testConstructor_RI_RP7 ArithmeticException
  org.joda.time.TestInterval_Constructors#testConstructor_RP_RI7 ArithmeticException
  org.joda.time.TestMutableDateTime_Basics#testEqualsHashCode ArithmeticException
  org.joda.time.TestMutableDateTime_Basics#testRounding1 ArithmeticException Add...
  org.joda.time.TestMutableDateTime_Basics#testRounding2 ArithmeticException Add...
  org.joda.time.TestMutableDateTime_Basics#testRounding3 ArithmeticException Add...
  org.joda.time.TestMutableDateTime_Basics#testRounding4 ArithmeticException Add...
  org.joda.time.TestMutableDateTime_Basics#testRounding5 ArithmeticException Add...
  org.joda.time.TestMutableDateTime_Basics#testRounding8 ArithmeticException Add...
  org.joda.time.TestMutableDateTime_Properties#testPropertyRoundCeilingHourOfDay ArithmeticException
  org.joda.time.TestMutableDateTime_Properties#testPropertyRoundFloorHourOfDay ArithmeticException
  org.joda.time.TestMutableDateTime_Properties#testPropertyRoundHalfCeilingHourOfDay ArithmeticException
  org.joda.time.TestMutableDateTime_Properties#testPropertyRoundHalfEvenHourOfDay ArithmeticException
  org.joda.time.TestMutableDateTime_Properties#testPropertyRoundHalfFloorHourOfDay ArithmeticException
  org.joda.time.TestMutableDateTime_Properties#testPropertyToIntervalHourOfDay ArithmeticException
  org.joda.time.TestMutableDateTime_Properties#testPropertyToIntervalMillisOfSecond ArithmeticException
  org.joda.time.TestMutableDateTime_Properties#testPropertyToIntervalMinuteOfHour ArithmeticException
  org.joda.time.TestMutableDateTime_Properties#testPropertyToIntervalSecondOfMinute ArithmeticException
  org.joda.time.TestMutableInterval_Constructors#testConstructor_RD_RI4 ArithmeticException
  org.joda.time.TestMutableInterval_Constructors#testConstructor_RI_RD4 ArithmeticException
  org.joda.time.TestMutableInterval_Constructors#testConstructor_RI_RP7 ArithmeticException
  org.joda.time.TestMutableInterval_Constructors#testConstructor_RP_RI7 ArithmeticException
  org.joda.time.field.TestOffsetDateTimeField#test_roundCeiling_long ArithmeticException
  org.joda.time.field.TestOffsetDateTimeField#test_roundFloor_long ArithmeticException
  org.joda.time.field.TestOffsetDateTimeField#test_roundHalfCeiling_long ArithmeticException
  org.joda.time.field.TestOffsetDateTimeField#test_roundHalfEven_long ArithmeticException
  org.joda.time.field.TestOffsetDateTimeField#test_roundHalfFloor_long ArithmeticException

Tests run: 4157, Failures: 0, Errors: 43, Skipped: 0

[INFO] ------------------------------------------------------------------------
[INFO] BUILD FAILURE
[INFO] ------------------------------------------------------------------------
[INFO] Total time: 16.037s
[INFO] Finished at: Thu Aug 06 02:36:32 BST 2015
[INFO] Final Memory: 7M/157M
[INFO] ------------------------------------------------------------------------
[ERROR] Failed to execute goal org.apache.maven.plugins:maven-surefire-plugin:2.18.1:test (default-test) on project joda-time: There are test failures.
[ERROR] 
[ERROR] Please refer to /home/perham/Study/LittleDarwin/Cases/joda-time-2.8.1/target/surefire-reports for the individual test results.
[ERROR] -> [Help 1]
[ERROR] 
[ERROR] To see the full stack trace of the errors, re-run Maven with the -e switch.
[ERROR] Re-run Maven using the -X switch to enable full debug logging.
[ERROR] 
[ERROR] For more information about the errors and possible solutions, please read the following articles:
[ERROR] [Help 1] http://cwiki.apache.org/confluence/display/MAVEN/MojoFailureException
