[INFO] Scanning for projects...
[INFO]                                                                         
[INFO] ------------------------------------------------------------------------
[INFO] Building Joda-Time 2.8.1
[INFO] ------------------------------------------------------------------------
[INFO] 
[INFO] --- maven-resources-plugin:2.7:resources (default-resources) @ joda-time ---
[INFO] Using 'UTF-8' encoding to copy filtered resources.
[INFO] Copying 2 resources to META-INF
[INFO] Copying 10 resources
[INFO] 
[INFO] --- maven-compiler-plugin:3.3:compile (default-compile) @ joda-time ---
[INFO] Changes detected - recompiling the module!
[INFO] Compiling 166 source files to /home/perham/Study/LittleDarwin/Cases/joda-time-2.8.1/target/classes
[INFO] 
[INFO] --- exec-maven-plugin:1.4.0:java (compile-tzdb) @ joda-time ---
Writing zoneinfo files
Writing ZoneInfoMap
[INFO] 
[INFO] --- maven-resources-plugin:2.7:testResources (default-testResources) @ joda-time ---
[INFO] Using 'UTF-8' encoding to copy filtered resources.
[INFO] Copying 34 resources
[INFO] 
[INFO] --- maven-compiler-plugin:3.3:testCompile (default-testCompile) @ joda-time ---
[INFO] Nothing to compile - all classes are up to date
[INFO] 
[INFO] --- maven-surefire-plugin:2.18.1:test (default-test) @ joda-time ---
[INFO] Surefire report directory: /home/perham/Study/LittleDarwin/Cases/joda-time-2.8.1/target/surefire-reports

-------------------------------------------------------
 T E S T S
-------------------------------------------------------
Running org.joda.time.TestAllPackages

TestBuddhistChronology.testCalendar

TestCopticChronology.testCalendar

TestEthiopicChronology.testCalendar

TestIslamicChronology.testCalendar

Testing Gregorian chronology over 1000 iterations
100% complete (i=1000)

Testing Julian chronology over 1000 iterations
100% complete (i=1000)
Writing zoneinfo files
Writing ZoneInfoMap
Tests run: 4157, Failures: 30, Errors: 3, Skipped: 0, Time elapsed: 5.226 sec <<< FAILURE! - in org.joda.time.TestAllPackages
testWithDurationAdded_RP_int(org.joda.time.TestDateTime_Basics)  Time elapsed: 0.005 sec  <<< FAILURE!
junit.framework.AssertionFailedError: expected:<2003-07-28T06:08:10.012-00:01:15> but was:<2003-07-28T06:28:10.012-00:01:15>
	at junit.framework.Assert.fail(Assert.java:47)
	at junit.framework.Assert.failNotEquals(Assert.java:280)
	at junit.framework.Assert.assertEquals(Assert.java:64)
	at junit.framework.Assert.assertEquals(Assert.java:71)
	at org.joda.time.TestDateTime_Basics.testWithDurationAdded_RP_int(TestDateTime_Basics.java:1020)

testPlus_RP(org.joda.time.TestDateTime_Basics)  Time elapsed: 0.004 sec  <<< FAILURE!
junit.framework.AssertionFailedError: expected:<2003-07-28T06:08:10.012-00:01:15> but was:<2003-07-28T06:28:10.012-00:01:15>
	at junit.framework.Assert.fail(Assert.java:47)
	at junit.framework.Assert.failNotEquals(Assert.java:280)
	at junit.framework.Assert.assertEquals(Assert.java:64)
	at junit.framework.Assert.assertEquals(Assert.java:71)
	at org.joda.time.TestDateTime_Basics.testPlus_RP(TestDateTime_Basics.java:1059)

testMinus_RP(org.joda.time.TestDateTime_Basics)  Time elapsed: 0.001 sec  <<< FAILURE!
junit.framework.AssertionFailedError: expected:<2001-03-26T00:01:02.003-00:01:15> but was:<2001-03-26T00:21:02.003-00:01:15>
	at junit.framework.Assert.fail(Assert.java:47)
	at junit.framework.Assert.failNotEquals(Assert.java:280)
	at junit.framework.Assert.assertEquals(Assert.java:64)
	at junit.framework.Assert.assertEquals(Assert.java:71)
	at org.joda.time.TestDateTime_Basics.testMinus_RP(TestDateTime_Basics.java:1167)

testAdd_RP1(org.joda.time.TestMutableDateTime_Adds)  Time elapsed: 0.002 sec  <<< FAILURE!
junit.framework.ComparisonFailure: expected:<2003-07-[10T0]6:07:08.009+01:00> but was:<2003-07-[09T1]6:07:08.009+01:00>
	at junit.framework.Assert.assertEquals(Assert.java:81)
	at junit.framework.Assert.assertEquals(Assert.java:87)
	at org.joda.time.TestMutableDateTime_Adds.testAdd_RP1(TestMutableDateTime_Adds.java:145)

testAdd_RP_int1(org.joda.time.TestMutableDateTime_Adds)  Time elapsed: 0 sec  <<< FAILURE!
junit.framework.AssertionFailedError: expected:<1018009437996> but was:<1017995037996>
	at junit.framework.Assert.fail(Assert.java:47)
	at junit.framework.Assert.failNotEquals(Assert.java:280)
	at junit.framework.Assert.assertEquals(Assert.java:64)
	at junit.framework.Assert.assertEquals(Assert.java:133)
	at junit.framework.Assert.assertEquals(Assert.java:139)
	at org.joda.time.TestMutableDateTime_Adds.testAdd_RP_int1(TestMutableDateTime_Adds.java:159)

testToInterval(org.joda.time.TestDateMidnight_Basics)  Time elapsed: 0.001 sec  <<< FAILURE!
junit.framework.AssertionFailedError: expected:<1718-07-27T00:00:00.000+01:00/1718-07-27T00:00:00.000+01:00> but was:<1718-07-27T00:00:00.000+01:00/1718-07-28T00:00:00.000+01:00>
	at junit.framework.Assert.fail(Assert.java:47)
	at junit.framework.Assert.failNotEquals(Assert.java:280)
	at junit.framework.Assert.assertEquals(Assert.java:64)
	at junit.framework.Assert.assertEquals(Assert.java:71)
	at org.joda.time.TestDateMidnight_Basics.testToInterval(TestDateMidnight_Basics.java:657)

testParse_noFormatter(org.joda.time.TestInterval_Constructors)  Time elapsed: 0.002 sec  <<< FAILURE!
junit.framework.AssertionFailedError: expected:<2010-06-30T12:30:00.000+02:00/2010-07-01T14:30:00.000+02:00> but was:<2010-06-30T12:30:00.000+02:00/2010-07-01T06:30:00.000+02:00>
	at junit.framework.Assert.fail(Assert.java:47)
	at junit.framework.Assert.failNotEquals(Assert.java:280)
	at junit.framework.Assert.assertEquals(Assert.java:64)
	at junit.framework.Assert.assertEquals(Assert.java:71)
	at org.joda.time.TestInterval_Constructors.testParse_noFormatter(TestInterval_Constructors.java:109)

testConstructor_RI_RP1(org.joda.time.TestInterval_Constructors)  Time elapsed: 0.001 sec  <<< FAILURE!
junit.framework.AssertionFailedError: expected:<1039399200000> but was:<1039377600000>
	at junit.framework.Assert.fail(Assert.java:47)
	at junit.framework.Assert.failNotEquals(Assert.java:280)
	at junit.framework.Assert.assertEquals(Assert.java:64)
	at junit.framework.Assert.assertEquals(Assert.java:133)
	at junit.framework.Assert.assertEquals(Assert.java:139)
	at org.joda.time.TestInterval_Constructors.testConstructor_RI_RP1(TestInterval_Constructors.java:277)

testConstructor_RI_RP4(org.joda.time.TestInterval_Constructors)  Time elapsed: 0.001 sec  <<< ERROR!
java.lang.IllegalArgumentException: The end instant must be greater or equal to the start
	at org.joda.time.base.AbstractInterval.checkInterval(AbstractInterval.java:63)
	at org.joda.time.base.BaseInterval.<init>(BaseInterval.java:153)
	at org.joda.time.Interval.<init>(Interval.java:161)
	at org.joda.time.TestInterval_Constructors.testConstructor_RI_RP4(TestInterval_Constructors.java:313)

testConstructor_RI_RP7(org.joda.time.TestInterval_Constructors)  Time elapsed: 0 sec  <<< FAILURE!
junit.framework.AssertionFailedError: expected:<1039399200000> but was:<1039377600000>
	at junit.framework.Assert.fail(Assert.java:47)
	at junit.framework.Assert.failNotEquals(Assert.java:280)
	at junit.framework.Assert.assertEquals(Assert.java:64)
	at junit.framework.Assert.assertEquals(Assert.java:133)
	at junit.framework.Assert.assertEquals(Assert.java:139)
	at org.joda.time.TestInterval_Constructors.testConstructor_RI_RP7(TestInterval_Constructors.java:339)

testConstructor_RP_RI1(org.joda.time.TestInterval_Constructors)  Time elapsed: 0.001 sec  <<< FAILURE!
junit.framework.AssertionFailedError: expected:<1007856000000> but was:<1007834400000>
	at junit.framework.Assert.fail(Assert.java:47)
	at junit.framework.Assert.failNotEquals(Assert.java:280)
	at junit.framework.Assert.assertEquals(Assert.java:64)
	at junit.framework.Assert.assertEquals(Assert.java:133)
	at junit.framework.Assert.assertEquals(Assert.java:139)
	at org.joda.time.TestInterval_Constructors.testConstructor_RP_RI1(TestInterval_Constructors.java:360)

testConstructor_RP_RI4(org.joda.time.TestInterval_Constructors)  Time elapsed: 0.001 sec  <<< FAILURE!
junit.framework.AssertionFailedError: expected:<1023577199977> but was:<1023548399977>
	at junit.framework.Assert.fail(Assert.java:47)
	at junit.framework.Assert.failNotEquals(Assert.java:280)
	at junit.framework.Assert.assertEquals(Assert.java:64)
	at junit.framework.Assert.assertEquals(Assert.java:133)
	at junit.framework.Assert.assertEquals(Assert.java:139)
	at org.joda.time.TestInterval_Constructors.testConstructor_RP_RI4(TestInterval_Constructors.java:398)

testConstructor_RP_RI7(org.joda.time.TestInterval_Constructors)  Time elapsed: 0.001 sec  <<< FAILURE!
junit.framework.AssertionFailedError: expected:<1007856000000> but was:<1007834400000>
	at junit.framework.Assert.fail(Assert.java:47)
	at junit.framework.Assert.failNotEquals(Assert.java:280)
	at junit.framework.Assert.assertEquals(Assert.java:64)
	at junit.framework.Assert.assertEquals(Assert.java:133)
	at junit.framework.Assert.assertEquals(Assert.java:139)
	at org.joda.time.TestInterval_Constructors.testConstructor_RP_RI7(TestInterval_Constructors.java:422)

testConstructor_RP_RI8(org.joda.time.TestInterval_Constructors)  Time elapsed: 0 sec  <<< FAILURE!
junit.framework.AssertionFailedError
	at junit.framework.Assert.fail(Assert.java:47)
	at junit.framework.Assert.fail(Assert.java:53)
	at org.joda.time.TestInterval_Constructors.testConstructor_RP_RI8(TestInterval_Constructors.java:431)

testWithPeriodBeforeEnd3(org.joda.time.TestInterval_Basics)  Time elapsed: 0.001 sec  <<< FAILURE!
junit.framework.AssertionFailedError
	at junit.framework.Assert.fail(Assert.java:47)
	at junit.framework.Assert.fail(Assert.java:53)
	at org.joda.time.TestInterval_Basics.testWithPeriodBeforeEnd3(TestInterval_Basics.java:1271)

testToInterval_Zone(org.joda.time.TestLocalDate_Basics)  Time elapsed: 0.001 sec  <<< FAILURE!
junit.framework.AssertionFailedError: expected:<2005-06-09T00:00:00.000+09:00/2005-06-09T06:00:00.000+09:00> but was:<2005-06-09T00:00:00.000+09:00/2005-06-10T00:00:00.000+09:00>
	at junit.framework.Assert.fail(Assert.java:47)
	at junit.framework.Assert.failNotEquals(Assert.java:280)
	at junit.framework.Assert.assertEquals(Assert.java:64)
	at junit.framework.Assert.assertEquals(Assert.java:71)
	at org.joda.time.TestLocalDate_Basics.testToInterval_Zone(TestLocalDate_Basics.java:977)

testParse_noFormatter(org.joda.time.TestMutableInterval_Constructors)  Time elapsed: 0.002 sec  <<< FAILURE!
junit.framework.AssertionFailedError: expected:<2010-06-30T12:30:00.000+02:00/2010-07-01T14:30:00.000+02:00> but was:<2010-06-30T12:30:00.000+02:00/2010-07-01T06:30:00.000+02:00>
	at junit.framework.Assert.fail(Assert.java:47)
	at junit.framework.Assert.failNotEquals(Assert.java:280)
	at junit.framework.Assert.assertEquals(Assert.java:64)
	at junit.framework.Assert.assertEquals(Assert.java:71)
	at org.joda.time.TestMutableInterval_Constructors.testParse_noFormatter(TestMutableInterval_Constructors.java:115)

testConstructor_RI_RP1(org.joda.time.TestMutableInterval_Constructors)  Time elapsed: 0.001 sec  <<< FAILURE!
junit.framework.AssertionFailedError: expected:<1039399200000> but was:<1039377600000>
	at junit.framework.Assert.fail(Assert.java:47)
	at junit.framework.Assert.failNotEquals(Assert.java:280)
	at junit.framework.Assert.assertEquals(Assert.java:64)
	at junit.framework.Assert.assertEquals(Assert.java:133)
	at junit.framework.Assert.assertEquals(Assert.java:139)
	at org.joda.time.TestMutableInterval_Constructors.testConstructor_RI_RP1(TestMutableInterval_Constructors.java:253)

testConstructor_RI_RP4(org.joda.time.TestMutableInterval_Constructors)  Time elapsed: 0.001 sec  <<< ERROR!
java.lang.IllegalArgumentException: The end instant must be greater or equal to the start
	at org.joda.time.base.AbstractInterval.checkInterval(AbstractInterval.java:63)
	at org.joda.time.base.BaseInterval.<init>(BaseInterval.java:153)
	at org.joda.time.MutableInterval.<init>(MutableInterval.java:154)
	at org.joda.time.TestMutableInterval_Constructors.testConstructor_RI_RP4(TestMutableInterval_Constructors.java:289)

testConstructor_RI_RP7(org.joda.time.TestMutableInterval_Constructors)  Time elapsed: 0.001 sec  <<< FAILURE!
junit.framework.AssertionFailedError: expected:<1039399200000> but was:<1039377600000>
	at junit.framework.Assert.fail(Assert.java:47)
	at junit.framework.Assert.failNotEquals(Assert.java:280)
	at junit.framework.Assert.assertEquals(Assert.java:64)
	at junit.framework.Assert.assertEquals(Assert.java:133)
	at junit.framework.Assert.assertEquals(Assert.java:139)
	at org.joda.time.TestMutableInterval_Constructors.testConstructor_RI_RP7(TestMutableInterval_Constructors.java:315)

testConstructor_RP_RI1(org.joda.time.TestMutableInterval_Constructors)  Time elapsed: 0 sec  <<< FAILURE!
junit.framework.AssertionFailedError: expected:<1007856000000> but was:<1007834400000>
	at junit.framework.Assert.fail(Assert.java:47)
	at junit.framework.Assert.failNotEquals(Assert.java:280)
	at junit.framework.Assert.assertEquals(Assert.java:64)
	at junit.framework.Assert.assertEquals(Assert.java:133)
	at junit.framework.Assert.assertEquals(Assert.java:139)
	at org.joda.time.TestMutableInterval_Constructors.testConstructor_RP_RI1(TestMutableInterval_Constructors.java:336)

testConstructor_RP_RI4(org.joda.time.TestMutableInterval_Constructors)  Time elapsed: 0 sec  <<< FAILURE!
junit.framework.AssertionFailedError: expected:<1023577199977> but was:<1023548399977>
	at junit.framework.Assert.fail(Assert.java:47)
	at junit.framework.Assert.failNotEquals(Assert.java:280)
	at junit.framework.Assert.assertEquals(Assert.java:64)
	at junit.framework.Assert.assertEquals(Assert.java:133)
	at junit.framework.Assert.assertEquals(Assert.java:139)
	at org.joda.time.TestMutableInterval_Constructors.testConstructor_RP_RI4(TestMutableInterval_Constructors.java:374)

testConstructor_RP_RI7(org.joda.time.TestMutableInterval_Constructors)  Time elapsed: 0.001 sec  <<< FAILURE!
junit.framework.AssertionFailedError: expected:<1007856000000> but was:<1007834400000>
	at junit.framework.Assert.fail(Assert.java:47)
	at junit.framework.Assert.failNotEquals(Assert.java:280)
	at junit.framework.Assert.assertEquals(Assert.java:64)
	at junit.framework.Assert.assertEquals(Assert.java:133)
	at junit.framework.Assert.assertEquals(Assert.java:139)
	at org.joda.time.TestMutableInterval_Constructors.testConstructor_RP_RI7(TestMutableInterval_Constructors.java:398)

testConstructor_RP_RI8(org.joda.time.TestMutableInterval_Constructors)  Time elapsed: 0 sec  <<< FAILURE!
junit.framework.AssertionFailedError
	at junit.framework.Assert.fail(Assert.java:47)
	at junit.framework.Assert.fail(Assert.java:53)
	at org.joda.time.TestMutableInterval_Constructors.testConstructor_RP_RI8(TestMutableInterval_Constructors.java:407)

testSetPeriodAfterStart_RI1(org.joda.time.TestMutableInterval_Updates)  Time elapsed: 0.001 sec  <<< ERROR!
java.lang.IllegalArgumentException: The end instant must be greater or equal to the start
	at org.joda.time.base.AbstractInterval.checkInterval(AbstractInterval.java:63)
	at org.joda.time.base.BaseInterval.setInterval(BaseInterval.java:248)
	at org.joda.time.MutableInterval.setEndMillis(MutableInterval.java:296)
	at org.joda.time.MutableInterval.setPeriodAfterStart(MutableInterval.java:371)
	at org.joda.time.TestMutableInterval_Updates.testSetPeriodAfterStart_RI1(TestMutableInterval_Updates.java:355)

testSetPeriodBeforeEnd_RI1(org.joda.time.TestMutableInterval_Updates)  Time elapsed: 0.001 sec  <<< FAILURE!
junit.framework.AssertionFailedError: expected:<1052231279877> but was:<1052224079877>
	at junit.framework.Assert.fail(Assert.java:47)
	at junit.framework.Assert.failNotEquals(Assert.java:280)
	at junit.framework.Assert.assertEquals(Assert.java:64)
	at junit.framework.Assert.assertEquals(Assert.java:133)
	at junit.framework.Assert.assertEquals(Assert.java:139)
	at org.joda.time.TestMutableInterval_Updates.testSetPeriodBeforeEnd_RI1(TestMutableInterval_Updates.java:379)

testSePeriodBeforeEnd_RI2(org.joda.time.TestMutableInterval_Updates)  Time elapsed: 0 sec  <<< FAILURE!
junit.framework.AssertionFailedError
	at junit.framework.Assert.fail(Assert.java:47)
	at junit.framework.Assert.fail(Assert.java:53)
	at org.joda.time.TestMutableInterval_Updates.testSePeriodBeforeEnd_RI2(TestMutableInterval_Updates.java:387)

testToInterval_Zone(org.joda.time.TestYearMonthDay_Basics)  Time elapsed: 0 sec  <<< FAILURE!
junit.framework.AssertionFailedError: expected:<2005-06-09T00:00:00.000+09:00/2005-06-09T06:00:00.000+09:00> but was:<2005-06-09T00:00:00.000+09:00/2005-06-10T00:00:00.000+09:00>
	at junit.framework.Assert.fail(Assert.java:47)
	at junit.framework.Assert.failNotEquals(Assert.java:280)
	at junit.framework.Assert.assertEquals(Assert.java:64)
	at junit.framework.Assert.assertEquals(Assert.java:71)
	at org.joda.time.TestYearMonthDay_Basics.testToInterval_Zone(TestYearMonthDay_Basics.java:730)

testSetIntoInterval_Object_Chronology1(org.joda.time.convert.TestStringConverter)  Time elapsed: 0.001 sec  <<< FAILURE!
junit.framework.AssertionFailedError: expected:<2005-08-09T00:00:00.000+01:00> but was:<2005-08-08T20:00:00.000+01:00>
	at junit.framework.Assert.fail(Assert.java:47)
	at junit.framework.Assert.failNotEquals(Assert.java:280)
	at junit.framework.Assert.assertEquals(Assert.java:64)
	at junit.framework.Assert.assertEquals(Assert.java:71)
	at org.joda.time.convert.TestStringConverter.testSetIntoInterval_Object_Chronology1(TestStringConverter.java:478)

testSetIntoInterval_Object_Chronology2(org.joda.time.convert.TestStringConverter)  Time elapsed: 0 sec  <<< FAILURE!
junit.framework.AssertionFailedError: expected:<2003-04-09T00:00:00.000+01:00> but was:<2003-04-08T20:00:00.000+01:00>
	at junit.framework.Assert.fail(Assert.java:47)
	at junit.framework.Assert.failNotEquals(Assert.java:280)
	at junit.framework.Assert.assertEquals(Assert.java:64)
	at junit.framework.Assert.assertEquals(Assert.java:71)
	at org.joda.time.convert.TestStringConverter.testSetIntoInterval_Object_Chronology2(TestStringConverter.java:485)

testSetIntoInterval_Object_Chronology4(org.joda.time.convert.TestStringConverter)  Time elapsed: 0 sec  <<< FAILURE!
junit.framework.AssertionFailedError: expected:<2005-08-08T19:00:00.000+01:00> but was:<2005-08-08T15:00:00.000+01:00>
	at junit.framework.Assert.fail(Assert.java:47)
	at junit.framework.Assert.failNotEquals(Assert.java:280)
	at junit.framework.Assert.assertEquals(Assert.java:64)
	at junit.framework.Assert.assertEquals(Assert.java:71)
	at org.joda.time.convert.TestStringConverter.testSetIntoInterval_Object_Chronology4(TestStringConverter.java:502)

testSetIntoInterval_Object_Chronology5(org.joda.time.convert.TestStringConverter)  Time elapsed: 0.001 sec  <<< FAILURE!
junit.framework.AssertionFailedError: expected:<2003-04-08T19:00:00.000+01:00> but was:<2003-04-08T15:00:00.000+01:00>
	at junit.framework.Assert.fail(Assert.java:47)
	at junit.framework.Assert.failNotEquals(Assert.java:280)
	at junit.framework.Assert.assertEquals(Assert.java:64)
	at junit.framework.Assert.assertEquals(Assert.java:71)
	at org.joda.time.convert.TestStringConverter.testSetIntoInterval_Object_Chronology5(TestStringConverter.java:509)

test_add_long_long(org.joda.time.field.TestOffsetDateTimeField)  Time elapsed: 0 sec  <<< FAILURE!
junit.framework.AssertionFailedError: expected:<1001> but was:<-7198999>
	at junit.framework.Assert.fail(Assert.java:47)
	at junit.framework.Assert.failNotEquals(Assert.java:280)
	at junit.framework.Assert.assertEquals(Assert.java:64)
	at junit.framework.Assert.assertEquals(Assert.java:133)
	at junit.framework.Assert.assertEquals(Assert.java:139)
	at org.joda.time.field.TestOffsetDateTimeField.test_add_long_long(TestOffsetDateTimeField.java:215)


Results :

Failed tests: 
  org.joda.time.TestDateMidnight_Basics#testToInterval AssertionFailedError expe...
  org.joda.time.TestDateTime_Basics#testMinus_RP AssertionFailedError expected:<...
  org.joda.time.TestDateTime_Basics#testPlus_RP AssertionFailedError expected:<2...
  org.joda.time.TestDateTime_Basics#testWithDurationAdded_RP_int AssertionFailedError
  org.joda.time.TestInterval_Basics#testWithPeriodBeforeEnd3 AssertionFailedError
  org.joda.time.TestInterval_Constructors#testConstructor_RI_RP1 AssertionFailedError
  org.joda.time.TestInterval_Constructors#testConstructor_RI_RP7 AssertionFailedError
  org.joda.time.TestInterval_Constructors#testConstructor_RP_RI1 AssertionFailedError
  org.joda.time.TestInterval_Constructors#testConstructor_RP_RI4 AssertionFailedError
  org.joda.time.TestInterval_Constructors#testConstructor_RP_RI7 AssertionFailedError
  org.joda.time.TestInterval_Constructors#testConstructor_RP_RI8 AssertionFailedError
  org.joda.time.TestInterval_Constructors#testParse_noFormatter AssertionFailedError
  org.joda.time.TestLocalDate_Basics#testToInterval_Zone AssertionFailedError ex...
  org.joda.time.TestMutableDateTime_Adds#testAdd_RP1 ComparisonFailure expected:...
  org.joda.time.TestMutableDateTime_Adds#testAdd_RP_int1 AssertionFailedError ex...
  org.joda.time.TestMutableInterval_Constructors#testConstructor_RI_RP1 AssertionFailedError
  org.joda.time.TestMutableInterval_Constructors#testConstructor_RI_RP7 AssertionFailedError
  org.joda.time.TestMutableInterval_Constructors#testConstructor_RP_RI1 AssertionFailedError
  org.joda.time.TestMutableInterval_Constructors#testConstructor_RP_RI4 AssertionFailedError
  org.joda.time.TestMutableInterval_Constructors#testConstructor_RP_RI7 AssertionFailedError
  org.joda.time.TestMutableInterval_Constructors#testConstructor_RP_RI8 AssertionFailedError
  org.joda.time.TestMutableInterval_Constructors#testParse_noFormatter AssertionFailedError
  org.joda.time.TestMutableInterval_Updates#testSePeriodBeforeEnd_RI2 AssertionFailedError
  org.joda.time.TestMutableInterval_Updates#testSetPeriodBeforeEnd_RI1 AssertionFailedError
  org.joda.time.TestYearMonthDay_Basics#testToInterval_Zone AssertionFailedError
  org.joda.time.convert.TestStringConverter#testSetIntoInterval_Object_Chronology1 AssertionFailedError
  org.joda.time.convert.TestStringConverter#testSetIntoInterval_Object_Chronology2 AssertionFailedError
  org.joda.time.convert.TestStringConverter#testSetIntoInterval_Object_Chronology4 AssertionFailedError
  org.joda.time.convert.TestStringConverter#testSetIntoInterval_Object_Chronology5 AssertionFailedError
  org.joda.time.field.TestOffsetDateTimeField#test_add_long_long AssertionFailedError
Tests in error: 
  org.joda.time.TestInterval_Constructors#testConstructor_RI_RP4 IllegalArgumentException
  org.joda.time.TestMutableInterval_Constructors#testConstructor_RI_RP4 IllegalArgumentException
  org.joda.time.TestMutableInterval_Updates#testSetPeriodAfterStart_RI1 IllegalArgumentException

Tests run: 4157, Failures: 30, Errors: 3, Skipped: 0

[INFO] ------------------------------------------------------------------------
[INFO] BUILD FAILURE
[INFO] ------------------------------------------------------------------------
[INFO] Total time: 15.143s
[INFO] Finished at: Thu Aug 06 02:29:09 BST 2015
[INFO] Final Memory: 9M/213M
[INFO] ------------------------------------------------------------------------
[ERROR] Failed to execute goal org.apache.maven.plugins:maven-surefire-plugin:2.18.1:test (default-test) on project joda-time: There are test failures.
[ERROR] 
[ERROR] Please refer to /home/perham/Study/LittleDarwin/Cases/joda-time-2.8.1/target/surefire-reports for the individual test results.
[ERROR] -> [Help 1]
[ERROR] 
[ERROR] To see the full stack trace of the errors, re-run Maven with the -e switch.
[ERROR] Re-run Maven using the -X switch to enable full debug logging.
[ERROR] 
[ERROR] For more information about the errors and possible solutions, please read the following articles:
[ERROR] [Help 1] http://cwiki.apache.org/confluence/display/MAVEN/MojoFailureException
