[INFO] Scanning for projects...
[INFO]                                                                         
[INFO] ------------------------------------------------------------------------
[INFO] Building Joda-Time 2.8.1
[INFO] ------------------------------------------------------------------------
[INFO] 
[INFO] --- maven-resources-plugin:2.7:resources (default-resources) @ joda-time ---
[INFO] Using 'UTF-8' encoding to copy filtered resources.
[INFO] Copying 2 resources to META-INF
[INFO] Copying 10 resources
[INFO] 
[INFO] --- maven-compiler-plugin:3.3:compile (default-compile) @ joda-time ---
[INFO] Changes detected - recompiling the module!
[INFO] Compiling 166 source files to /home/perham/Study/LittleDarwin/Cases/joda-time-2.8.1/target/classes
[INFO] 
[INFO] --- exec-maven-plugin:1.4.0:java (compile-tzdb) @ joda-time ---
Writing zoneinfo files
Writing ZoneInfoMap
[INFO] 
[INFO] --- maven-resources-plugin:2.7:testResources (default-testResources) @ joda-time ---
[INFO] Using 'UTF-8' encoding to copy filtered resources.
[INFO] Copying 34 resources
[INFO] 
[INFO] --- maven-compiler-plugin:3.3:testCompile (default-testCompile) @ joda-time ---
[INFO] Nothing to compile - all classes are up to date
[INFO] 
[INFO] --- maven-surefire-plugin:2.18.1:test (default-test) @ joda-time ---
[INFO] Surefire report directory: /home/perham/Study/LittleDarwin/Cases/joda-time-2.8.1/target/surefire-reports

-------------------------------------------------------
 T E S T S
-------------------------------------------------------
Running org.joda.time.TestAllPackages

TestBuddhistChronology.testCalendar

TestCopticChronology.testCalendar

TestEthiopicChronology.testCalendar

TestIslamicChronology.testCalendar

Testing Gregorian chronology over 1000 iterations
100% complete (i=1000)

Testing Julian chronology over 1000 iterations
100% complete (i=1000)
Writing zoneinfo files
Writing ZoneInfoMap
Tests run: 4157, Failures: 0, Errors: 54, Skipped: 0, Time elapsed: 5.406 sec <<< FAILURE! - in org.joda.time.TestAllPackages
testToPeriod_PeriodType(org.joda.time.TestDuration_Basics)  Time elapsed: 0.004 sec  <<< ERROR!
java.lang.ArithmeticException: Adding time zone offset caused overflow
	at org.joda.time.chrono.ZonedChronology$ZonedDurationField.getOffsetToAdd(ZonedChronology.java:123)
	at org.joda.time.chrono.ZonedChronology$ZonedDurationField.getDifference(ZonedChronology.java:117)
	at org.joda.time.chrono.BaseChronology.get(BaseChronology.java:285)
	at org.joda.time.base.BasePeriod.<init>(BasePeriod.java:258)
	at org.joda.time.Period.<init>(Period.java:402)
	at org.joda.time.base.BaseDuration.toPeriod(BaseDuration.java:144)
	at org.joda.time.TestDuration_Basics.testToPeriod_PeriodType(TestDuration_Basics.java:502)

testConstructor_long_PeriodType2(org.joda.time.TestPeriod_Constructors)  Time elapsed: 0.001 sec  <<< ERROR!
java.lang.ArithmeticException: Adding time zone offset caused overflow
	at org.joda.time.chrono.ZonedChronology$ZonedDurationField.getOffsetToAdd(ZonedChronology.java:123)
	at org.joda.time.chrono.ZonedChronology$ZonedDurationField.getDifference(ZonedChronology.java:117)
	at org.joda.time.chrono.BaseChronology.get(BaseChronology.java:285)
	at org.joda.time.base.BasePeriod.<init>(BasePeriod.java:258)
	at org.joda.time.Period.<init>(Period.java:402)
	at org.joda.time.TestPeriod_Constructors.testConstructor_long_PeriodType2(TestPeriod_Constructors.java:223)

testConstructor_long_PeriodType3(org.joda.time.TestPeriod_Constructors)  Time elapsed: 0 sec  <<< ERROR!
java.lang.ArithmeticException: Adding time zone offset caused overflow
	at org.joda.time.chrono.ZonedChronology$ZonedDurationField.getOffsetToAdd(ZonedChronology.java:123)
	at org.joda.time.chrono.ZonedChronology$ZonedDurationField.getDifference(ZonedChronology.java:117)
	at org.joda.time.chrono.BaseChronology.get(BaseChronology.java:285)
	at org.joda.time.base.BasePeriod.<init>(BasePeriod.java:258)
	at org.joda.time.Period.<init>(Period.java:402)
	at org.joda.time.TestPeriod_Constructors.testConstructor_long_PeriodType3(TestPeriod_Constructors.java:240)

testConstructor_long_PeriodType4(org.joda.time.TestPeriod_Constructors)  Time elapsed: 0.001 sec  <<< ERROR!
java.lang.ArithmeticException: Adding time zone offset caused overflow
	at org.joda.time.chrono.ZonedChronology$ZonedDurationField.getOffsetToAdd(ZonedChronology.java:123)
	at org.joda.time.chrono.ZonedChronology$ZonedDurationField.getDifference(ZonedChronology.java:117)
	at org.joda.time.chrono.BaseChronology.get(BaseChronology.java:285)
	at org.joda.time.base.BasePeriod.<init>(BasePeriod.java:258)
	at org.joda.time.Period.<init>(Period.java:402)
	at org.joda.time.TestPeriod_Constructors.testConstructor_long_PeriodType4(TestPeriod_Constructors.java:257)

testConstructor_long_Chronology1(org.joda.time.TestPeriod_Constructors)  Time elapsed: 0.001 sec  <<< ERROR!
java.lang.ArithmeticException: Adding time zone offset caused overflow
	at org.joda.time.chrono.ZonedChronology$ZonedDurationField.getOffsetToAdd(ZonedChronology.java:123)
	at org.joda.time.chrono.ZonedChronology$ZonedDurationField.getDifference(ZonedChronology.java:117)
	at org.joda.time.chrono.BaseChronology.get(BaseChronology.java:285)
	at org.joda.time.base.BasePeriod.<init>(BasePeriod.java:258)
	at org.joda.time.Period.<init>(Period.java:423)
	at org.joda.time.TestPeriod_Constructors.testConstructor_long_Chronology1(TestPeriod_Constructors.java:275)

testConstructor_long_Chronology3(org.joda.time.TestPeriod_Constructors)  Time elapsed: 0.001 sec  <<< ERROR!
java.lang.ArithmeticException: Adding time zone offset caused overflow
	at org.joda.time.chrono.ZonedChronology$ZonedDurationField.getOffsetToAdd(ZonedChronology.java:123)
	at org.joda.time.chrono.ZonedChronology$ZonedDurationField.getDifference(ZonedChronology.java:117)
	at org.joda.time.chrono.BaseChronology.get(BaseChronology.java:285)
	at org.joda.time.base.BasePeriod.<init>(BasePeriod.java:258)
	at org.joda.time.Period.<init>(Period.java:423)
	at org.joda.time.TestPeriod_Constructors.testConstructor_long_Chronology3(TestPeriod_Constructors.java:309)

testConstructor_long_PeriodType_Chronology1(org.joda.time.TestPeriod_Constructors)  Time elapsed: 0.001 sec  <<< ERROR!
java.lang.ArithmeticException: Adding time zone offset caused overflow
	at org.joda.time.chrono.ZonedChronology$ZonedDurationField.getOffsetToAdd(ZonedChronology.java:123)
	at org.joda.time.chrono.ZonedChronology$ZonedDurationField.getDifference(ZonedChronology.java:117)
	at org.joda.time.chrono.BaseChronology.get(BaseChronology.java:285)
	at org.joda.time.base.BasePeriod.<init>(BasePeriod.java:258)
	at org.joda.time.Period.<init>(Period.java:444)
	at org.joda.time.TestPeriod_Constructors.testConstructor_long_PeriodType_Chronology1(TestPeriod_Constructors.java:327)

testConstructor_long_PeriodType_Chronology3(org.joda.time.TestPeriod_Constructors)  Time elapsed: 0.003 sec  <<< ERROR!
java.lang.ArithmeticException: Adding time zone offset caused overflow
	at org.joda.time.chrono.ZonedChronology$ZonedDurationField.getOffsetToAdd(ZonedChronology.java:123)
	at org.joda.time.chrono.ZonedChronology$ZonedDurationField.getDifference(ZonedChronology.java:117)
	at org.joda.time.chrono.BaseChronology.get(BaseChronology.java:285)
	at org.joda.time.base.BasePeriod.<init>(BasePeriod.java:258)
	at org.joda.time.Period.<init>(Period.java:444)
	at org.joda.time.TestPeriod_Constructors.testConstructor_long_PeriodType_Chronology3(TestPeriod_Constructors.java:361)

testConstructor_long_PeriodType_Chronology4(org.joda.time.TestPeriod_Constructors)  Time elapsed: 0 sec  <<< ERROR!
java.lang.ArithmeticException: Adding time zone offset caused overflow
	at org.joda.time.chrono.ZonedChronology$ZonedDurationField.getOffsetToAdd(ZonedChronology.java:123)
	at org.joda.time.chrono.ZonedChronology$ZonedDurationField.getDifference(ZonedChronology.java:117)
	at org.joda.time.chrono.BaseChronology.get(BaseChronology.java:285)
	at org.joda.time.base.BasePeriod.<init>(BasePeriod.java:258)
	at org.joda.time.Period.<init>(Period.java:444)
	at org.joda.time.TestPeriod_Constructors.testConstructor_long_PeriodType_Chronology4(TestPeriod_Constructors.java:378)

testConstructor_long_PeriodType1(org.joda.time.TestPeriod_Constructors)  Time elapsed: 0.001 sec  <<< ERROR!
java.lang.ArithmeticException: Adding time zone offset caused overflow
	at org.joda.time.chrono.ZonedChronology$ZonedDurationField.getOffsetToAdd(ZonedChronology.java:123)
	at org.joda.time.chrono.ZonedChronology$ZonedDurationField.getDifference(ZonedChronology.java:117)
	at org.joda.time.chrono.BaseChronology.get(BaseChronology.java:285)
	at org.joda.time.base.BasePeriod.<init>(BasePeriod.java:258)
	at org.joda.time.Period.<init>(Period.java:402)
	at org.joda.time.TestPeriod_Constructors.testConstructor_long_PeriodType1(TestPeriod_Constructors.java:206)

testEqualsHashCode(org.joda.time.TestPeriod_Basics)  Time elapsed: 0.001 sec  <<< ERROR!
java.lang.ArithmeticException: Adding time zone offset caused overflow
	at org.joda.time.chrono.ZonedChronology$ZonedDurationField.getOffsetToAdd(ZonedChronology.java:123)
	at org.joda.time.chrono.ZonedChronology$ZonedDurationField.getDifference(ZonedChronology.java:117)
	at org.joda.time.chrono.BaseChronology.get(BaseChronology.java:285)
	at org.joda.time.base.BasePeriod.<init>(BasePeriod.java:258)
	at org.joda.time.TestPeriod_Basics$MockPeriod.<init>(TestPeriod_Basics.java:222)
	at org.joda.time.TestPeriod_Basics.testEqualsHashCode(TestPeriod_Basics.java:215)

testConstructor_Object_Chronology1(org.joda.time.TestMutablePeriod_Constructors)  Time elapsed: 0 sec  <<< ERROR!
java.lang.ArithmeticException: Adding time zone offset caused overflow
	at org.joda.time.chrono.ZonedChronology$ZonedDurationField.getOffsetToAdd(ZonedChronology.java:123)
	at org.joda.time.chrono.ZonedChronology$ZonedDurationField.getDifference(ZonedChronology.java:117)
	at org.joda.time.chrono.BaseChronology.get(BaseChronology.java:285)
	at org.joda.time.convert.ReadableDurationConverter.setInto(ReadableDurationConverter.java:75)
	at org.joda.time.base.BasePeriod.<init>(BasePeriod.java:279)
	at org.joda.time.MutablePeriod.<init>(MutablePeriod.java:408)
	at org.joda.time.TestMutablePeriod_Constructors.testConstructor_Object_Chronology1(TestMutablePeriod_Constructors.java:942)

testConstructor_long_PeriodType2(org.joda.time.TestMutablePeriod_Constructors)  Time elapsed: 0 sec  <<< ERROR!
java.lang.ArithmeticException: Adding time zone offset caused overflow
	at org.joda.time.chrono.ZonedChronology$ZonedDurationField.getOffsetToAdd(ZonedChronology.java:123)
	at org.joda.time.chrono.ZonedChronology$ZonedDurationField.getDifference(ZonedChronology.java:117)
	at org.joda.time.chrono.BaseChronology.get(BaseChronology.java:285)
	at org.joda.time.base.BasePeriod.<init>(BasePeriod.java:258)
	at org.joda.time.MutablePeriod.<init>(MutablePeriod.java:200)
	at org.joda.time.TestMutablePeriod_Constructors.testConstructor_long_PeriodType2(TestMutablePeriod_Constructors.java:229)

testConstructor_long_PeriodType3(org.joda.time.TestMutablePeriod_Constructors)  Time elapsed: 0.001 sec  <<< ERROR!
java.lang.ArithmeticException: Adding time zone offset caused overflow
	at org.joda.time.chrono.ZonedChronology$ZonedDurationField.getOffsetToAdd(ZonedChronology.java:123)
	at org.joda.time.chrono.ZonedChronology$ZonedDurationField.getDifference(ZonedChronology.java:117)
	at org.joda.time.chrono.BaseChronology.get(BaseChronology.java:285)
	at org.joda.time.base.BasePeriod.<init>(BasePeriod.java:258)
	at org.joda.time.MutablePeriod.<init>(MutablePeriod.java:200)
	at org.joda.time.TestMutablePeriod_Constructors.testConstructor_long_PeriodType3(TestMutablePeriod_Constructors.java:246)

testConstructor_long_PeriodType4(org.joda.time.TestMutablePeriod_Constructors)  Time elapsed: 0 sec  <<< ERROR!
java.lang.ArithmeticException: Adding time zone offset caused overflow
	at org.joda.time.chrono.ZonedChronology$ZonedDurationField.getOffsetToAdd(ZonedChronology.java:123)
	at org.joda.time.chrono.ZonedChronology$ZonedDurationField.getDifference(ZonedChronology.java:117)
	at org.joda.time.chrono.BaseChronology.get(BaseChronology.java:285)
	at org.joda.time.base.BasePeriod.<init>(BasePeriod.java:258)
	at org.joda.time.MutablePeriod.<init>(MutablePeriod.java:200)
	at org.joda.time.TestMutablePeriod_Constructors.testConstructor_long_PeriodType4(TestMutablePeriod_Constructors.java:263)

testConstructor_long_Chronology1(org.joda.time.TestMutablePeriod_Constructors)  Time elapsed: 0.001 sec  <<< ERROR!
java.lang.ArithmeticException: Adding time zone offset caused overflow
	at org.joda.time.chrono.ZonedChronology$ZonedDurationField.getOffsetToAdd(ZonedChronology.java:123)
	at org.joda.time.chrono.ZonedChronology$ZonedDurationField.getDifference(ZonedChronology.java:117)
	at org.joda.time.chrono.BaseChronology.get(BaseChronology.java:285)
	at org.joda.time.base.BasePeriod.<init>(BasePeriod.java:258)
	at org.joda.time.MutablePeriod.<init>(MutablePeriod.java:221)
	at org.joda.time.TestMutablePeriod_Constructors.testConstructor_long_Chronology1(TestMutablePeriod_Constructors.java:281)

testConstructor_long_Chronology3(org.joda.time.TestMutablePeriod_Constructors)  Time elapsed: 0.001 sec  <<< ERROR!
java.lang.ArithmeticException: Adding time zone offset caused overflow
	at org.joda.time.chrono.ZonedChronology$ZonedDurationField.getOffsetToAdd(ZonedChronology.java:123)
	at org.joda.time.chrono.ZonedChronology$ZonedDurationField.getDifference(ZonedChronology.java:117)
	at org.joda.time.chrono.BaseChronology.get(BaseChronology.java:285)
	at org.joda.time.base.BasePeriod.<init>(BasePeriod.java:258)
	at org.joda.time.MutablePeriod.<init>(MutablePeriod.java:221)
	at org.joda.time.TestMutablePeriod_Constructors.testConstructor_long_Chronology3(TestMutablePeriod_Constructors.java:315)

testConstructor_long_PeriodType_Chronology1(org.joda.time.TestMutablePeriod_Constructors)  Time elapsed: 0.001 sec  <<< ERROR!
java.lang.ArithmeticException: Adding time zone offset caused overflow
	at org.joda.time.chrono.ZonedChronology$ZonedDurationField.getOffsetToAdd(ZonedChronology.java:123)
	at org.joda.time.chrono.ZonedChronology$ZonedDurationField.getDifference(ZonedChronology.java:117)
	at org.joda.time.chrono.BaseChronology.get(BaseChronology.java:285)
	at org.joda.time.base.BasePeriod.<init>(BasePeriod.java:258)
	at org.joda.time.MutablePeriod.<init>(MutablePeriod.java:242)
	at org.joda.time.TestMutablePeriod_Constructors.testConstructor_long_PeriodType_Chronology1(TestMutablePeriod_Constructors.java:333)

testConstructor_long_PeriodType_Chronology3(org.joda.time.TestMutablePeriod_Constructors)  Time elapsed: 0.001 sec  <<< ERROR!
java.lang.ArithmeticException: Adding time zone offset caused overflow
	at org.joda.time.chrono.ZonedChronology$ZonedDurationField.getOffsetToAdd(ZonedChronology.java:123)
	at org.joda.time.chrono.ZonedChronology$ZonedDurationField.getDifference(ZonedChronology.java:117)
	at org.joda.time.chrono.BaseChronology.get(BaseChronology.java:285)
	at org.joda.time.base.BasePeriod.<init>(BasePeriod.java:258)
	at org.joda.time.MutablePeriod.<init>(MutablePeriod.java:242)
	at org.joda.time.TestMutablePeriod_Constructors.testConstructor_long_PeriodType_Chronology3(TestMutablePeriod_Constructors.java:367)

testConstructor_long_PeriodType_Chronology4(org.joda.time.TestMutablePeriod_Constructors)  Time elapsed: 0 sec  <<< ERROR!
java.lang.ArithmeticException: Adding time zone offset caused overflow
	at org.joda.time.chrono.ZonedChronology$ZonedDurationField.getOffsetToAdd(ZonedChronology.java:123)
	at org.joda.time.chrono.ZonedChronology$ZonedDurationField.getDifference(ZonedChronology.java:117)
	at org.joda.time.chrono.BaseChronology.get(BaseChronology.java:285)
	at org.joda.time.base.BasePeriod.<init>(BasePeriod.java:258)
	at org.joda.time.MutablePeriod.<init>(MutablePeriod.java:242)
	at org.joda.time.TestMutablePeriod_Constructors.testConstructor_long_PeriodType_Chronology4(TestMutablePeriod_Constructors.java:384)

testConstructor_long_PeriodType1(org.joda.time.TestMutablePeriod_Constructors)  Time elapsed: 0 sec  <<< ERROR!
java.lang.ArithmeticException: Adding time zone offset caused overflow
	at org.joda.time.chrono.ZonedChronology$ZonedDurationField.getOffsetToAdd(ZonedChronology.java:123)
	at org.joda.time.chrono.ZonedChronology$ZonedDurationField.getDifference(ZonedChronology.java:117)
	at org.joda.time.chrono.BaseChronology.get(BaseChronology.java:285)
	at org.joda.time.base.BasePeriod.<init>(BasePeriod.java:258)
	at org.joda.time.MutablePeriod.<init>(MutablePeriod.java:200)
	at org.joda.time.TestMutablePeriod_Constructors.testConstructor_long_PeriodType1(TestMutablePeriod_Constructors.java:212)

testEqualsHashCode(org.joda.time.TestMutablePeriod_Basics)  Time elapsed: 0.001 sec  <<< ERROR!
java.lang.ArithmeticException: Adding time zone offset caused overflow
	at org.joda.time.chrono.ZonedChronology$ZonedDurationField.getOffsetToAdd(ZonedChronology.java:123)
	at org.joda.time.chrono.ZonedChronology$ZonedDurationField.getDifference(ZonedChronology.java:117)
	at org.joda.time.chrono.BaseChronology.get(BaseChronology.java:285)
	at org.joda.time.base.BasePeriod.<init>(BasePeriod.java:258)
	at org.joda.time.TestMutablePeriod_Basics$MockMutablePeriod.<init>(TestMutablePeriod_Basics.java:155)
	at org.joda.time.TestMutablePeriod_Basics.testEqualsHashCode(TestMutablePeriod_Basics.java:149)

testAdd_long1(org.joda.time.TestMutablePeriod_Updates)  Time elapsed: 0 sec  <<< ERROR!
java.lang.ArithmeticException: Adding time zone offset caused overflow
	at org.joda.time.chrono.ZonedChronology$ZonedDurationField.getOffsetToAdd(ZonedChronology.java:123)
	at org.joda.time.chrono.ZonedChronology$ZonedDurationField.getDifference(ZonedChronology.java:117)
	at org.joda.time.chrono.BaseChronology.get(BaseChronology.java:285)
	at org.joda.time.base.BasePeriod.<init>(BasePeriod.java:258)
	at org.joda.time.Period.<init>(Period.java:402)
	at org.joda.time.MutablePeriod.add(MutablePeriod.java:707)
	at org.joda.time.TestMutablePeriod_Updates.testAdd_long1(TestMutablePeriod_Updates.java:1093)

testAdd_RD1(org.joda.time.TestMutablePeriod_Updates)  Time elapsed: 0.001 sec  <<< ERROR!
java.lang.ArithmeticException: Adding time zone offset caused overflow
	at org.joda.time.chrono.ZonedChronology$ZonedDurationField.getOffsetToAdd(ZonedChronology.java:123)
	at org.joda.time.chrono.ZonedChronology$ZonedDurationField.getDifference(ZonedChronology.java:117)
	at org.joda.time.chrono.BaseChronology.get(BaseChronology.java:285)
	at org.joda.time.base.BasePeriod.<init>(BasePeriod.java:258)
	at org.joda.time.Period.<init>(Period.java:402)
	at org.joda.time.MutablePeriod.add(MutablePeriod.java:691)
	at org.joda.time.TestMutablePeriod_Updates.testAdd_RD1(TestMutablePeriod_Updates.java:1191)

testAdd_RD2(org.joda.time.TestMutablePeriod_Updates)  Time elapsed: 0 sec  <<< ERROR!
java.lang.ArithmeticException: Adding time zone offset caused overflow
	at org.joda.time.chrono.ZonedChronology$ZonedDurationField.getOffsetToAdd(ZonedChronology.java:123)
	at org.joda.time.chrono.ZonedChronology$ZonedDurationField.getDifference(ZonedChronology.java:117)
	at org.joda.time.chrono.BaseChronology.get(BaseChronology.java:285)
	at org.joda.time.base.BasePeriod.<init>(BasePeriod.java:258)
	at org.joda.time.MutablePeriod.<init>(MutablePeriod.java:200)
	at org.joda.time.TestMutablePeriod_Updates.testAdd_RD2(TestMutablePeriod_Updates.java:1203)

testAdd_RP2(org.joda.time.TestMutablePeriod_Updates)  Time elapsed: 0.001 sec  <<< ERROR!
java.lang.ArithmeticException: Adding time zone offset caused overflow
	at org.joda.time.chrono.ZonedChronology$ZonedDurationField.getOffsetToAdd(ZonedChronology.java:123)
	at org.joda.time.chrono.ZonedChronology$ZonedDurationField.getDifference(ZonedChronology.java:117)
	at org.joda.time.chrono.BaseChronology.get(BaseChronology.java:285)
	at org.joda.time.base.BasePeriod.<init>(BasePeriod.java:258)
	at org.joda.time.MutablePeriod.<init>(MutablePeriod.java:200)
	at org.joda.time.TestMutablePeriod_Updates.testAdd_RP2(TestMutablePeriod_Updates.java:1248)

testSetPeriod_long1(org.joda.time.TestMutablePeriod_Updates)  Time elapsed: 0 sec  <<< ERROR!
java.lang.ArithmeticException: Adding time zone offset caused overflow
	at org.joda.time.chrono.ZonedChronology$ZonedDurationField.getOffsetToAdd(ZonedChronology.java:123)
	at org.joda.time.chrono.ZonedChronology$ZonedDurationField.getDifference(ZonedChronology.java:117)
	at org.joda.time.chrono.BaseChronology.get(BaseChronology.java:285)
	at org.joda.time.MutablePeriod.setPeriod(MutablePeriod.java:611)
	at org.joda.time.MutablePeriod.setPeriod(MutablePeriod.java:595)
	at org.joda.time.TestMutablePeriod_Updates.testSetPeriod_long1(TestMutablePeriod_Updates.java:799)

testSetPeriod_long2(org.joda.time.TestMutablePeriod_Updates)  Time elapsed: 0.001 sec  <<< ERROR!
java.lang.ArithmeticException: Adding time zone offset caused overflow
	at org.joda.time.chrono.ZonedChronology$ZonedDurationField.getOffsetToAdd(ZonedChronology.java:123)
	at org.joda.time.chrono.ZonedChronology$ZonedDurationField.getDifference(ZonedChronology.java:117)
	at org.joda.time.chrono.BaseChronology.get(BaseChronology.java:285)
	at org.joda.time.MutablePeriod.setPeriod(MutablePeriod.java:611)
	at org.joda.time.MutablePeriod.setPeriod(MutablePeriod.java:595)
	at org.joda.time.TestMutablePeriod_Updates.testSetPeriod_long2(TestMutablePeriod_Updates.java:812)

testSetPeriod_RD1(org.joda.time.TestMutablePeriod_Updates)  Time elapsed: 0 sec  <<< ERROR!
java.lang.ArithmeticException: Adding time zone offset caused overflow
	at org.joda.time.chrono.ZonedChronology$ZonedDurationField.getOffsetToAdd(ZonedChronology.java:123)
	at org.joda.time.chrono.ZonedChronology$ZonedDurationField.getDifference(ZonedChronology.java:117)
	at org.joda.time.chrono.BaseChronology.get(BaseChronology.java:285)
	at org.joda.time.MutablePeriod.setPeriod(MutablePeriod.java:611)
	at org.joda.time.MutablePeriod.setPeriod(MutablePeriod.java:580)
	at org.joda.time.MutablePeriod.setPeriod(MutablePeriod.java:563)
	at org.joda.time.TestMutablePeriod_Updates.testSetPeriod_RD1(TestMutablePeriod_Updates.java:1017)

testSetPeriod_RD2(org.joda.time.TestMutablePeriod_Updates)  Time elapsed: 0 sec  <<< ERROR!
java.lang.ArithmeticException: Adding time zone offset caused overflow
	at org.joda.time.chrono.ZonedChronology$ZonedDurationField.getOffsetToAdd(ZonedChronology.java:123)
	at org.joda.time.chrono.ZonedChronology$ZonedDurationField.getDifference(ZonedChronology.java:117)
	at org.joda.time.chrono.BaseChronology.get(BaseChronology.java:285)
	at org.joda.time.MutablePeriod.setPeriod(MutablePeriod.java:611)
	at org.joda.time.MutablePeriod.setPeriod(MutablePeriod.java:580)
	at org.joda.time.MutablePeriod.setPeriod(MutablePeriod.java:563)
	at org.joda.time.TestMutablePeriod_Updates.testSetPeriod_RD2(TestMutablePeriod_Updates.java:1035)

testAdd_8ints2(org.joda.time.TestMutablePeriod_Updates)  Time elapsed: 0 sec  <<< ERROR!
java.lang.ArithmeticException: Adding time zone offset caused overflow
	at org.joda.time.chrono.ZonedChronology$ZonedDurationField.getOffsetToAdd(ZonedChronology.java:123)
	at org.joda.time.chrono.ZonedChronology$ZonedDurationField.getDifference(ZonedChronology.java:117)
	at org.joda.time.chrono.BaseChronology.get(BaseChronology.java:285)
	at org.joda.time.base.BasePeriod.<init>(BasePeriod.java:258)
	at org.joda.time.MutablePeriod.<init>(MutablePeriod.java:200)
	at org.joda.time.TestMutablePeriod_Updates.testAdd_8ints2(TestMutablePeriod_Updates.java:1075)

testAdd_long2(org.joda.time.TestMutablePeriod_Updates)  Time elapsed: 0.001 sec  <<< ERROR!
java.lang.ArithmeticException: Adding time zone offset caused overflow
	at org.joda.time.chrono.ZonedChronology$ZonedDurationField.getOffsetToAdd(ZonedChronology.java:123)
	at org.joda.time.chrono.ZonedChronology$ZonedDurationField.getDifference(ZonedChronology.java:117)
	at org.joda.time.chrono.BaseChronology.get(BaseChronology.java:285)
	at org.joda.time.base.BasePeriod.<init>(BasePeriod.java:258)
	at org.joda.time.MutablePeriod.<init>(MutablePeriod.java:200)
	at org.joda.time.TestMutablePeriod_Updates.testAdd_long2(TestMutablePeriod_Updates.java:1105)

testAdd_long3(org.joda.time.TestMutablePeriod_Updates)  Time elapsed: 0 sec  <<< ERROR!
java.lang.ArithmeticException: Adding time zone offset caused overflow
	at org.joda.time.chrono.ZonedChronology$ZonedDurationField.getOffsetToAdd(ZonedChronology.java:123)
	at org.joda.time.chrono.ZonedChronology$ZonedDurationField.getDifference(ZonedChronology.java:117)
	at org.joda.time.chrono.BaseChronology.get(BaseChronology.java:285)
	at org.joda.time.base.BasePeriod.<init>(BasePeriod.java:258)
	at org.joda.time.Period.<init>(Period.java:402)
	at org.joda.time.MutablePeriod.add(MutablePeriod.java:707)
	at org.joda.time.TestMutablePeriod_Updates.testAdd_long3(TestMutablePeriod_Updates.java:1125)

testSetPeriod_8ints2(org.joda.time.TestMutablePeriod_Updates)  Time elapsed: 0 sec  <<< ERROR!
java.lang.ArithmeticException: Adding time zone offset caused overflow
	at org.joda.time.chrono.ZonedChronology$ZonedDurationField.getOffsetToAdd(ZonedChronology.java:123)
	at org.joda.time.chrono.ZonedChronology$ZonedDurationField.getDifference(ZonedChronology.java:117)
	at org.joda.time.chrono.BaseChronology.get(BaseChronology.java:285)
	at org.joda.time.base.BasePeriod.<init>(BasePeriod.java:258)
	at org.joda.time.MutablePeriod.<init>(MutablePeriod.java:200)
	at org.joda.time.TestMutablePeriod_Updates.testSetPeriod_8ints2(TestMutablePeriod_Updates.java:447)

testSetPeriod_8ints3(org.joda.time.TestMutablePeriod_Updates)  Time elapsed: 0 sec  <<< ERROR!
java.lang.ArithmeticException: Adding time zone offset caused overflow
	at org.joda.time.chrono.ZonedChronology$ZonedDurationField.getOffsetToAdd(ZonedChronology.java:123)
	at org.joda.time.chrono.ZonedChronology$ZonedDurationField.getDifference(ZonedChronology.java:117)
	at org.joda.time.chrono.BaseChronology.get(BaseChronology.java:285)
	at org.joda.time.base.BasePeriod.<init>(BasePeriod.java:258)
	at org.joda.time.MutablePeriod.<init>(MutablePeriod.java:200)
	at org.joda.time.TestMutablePeriod_Updates.testSetPeriod_8ints3(TestMutablePeriod_Updates.java:463)

testSetPeriod_RP2(org.joda.time.TestMutablePeriod_Updates)  Time elapsed: 0.011 sec  <<< ERROR!
java.lang.ArithmeticException: Adding time zone offset caused overflow
	at org.joda.time.chrono.ZonedChronology$ZonedDurationField.getOffsetToAdd(ZonedChronology.java:123)
	at org.joda.time.chrono.ZonedChronology$ZonedDurationField.getDifference(ZonedChronology.java:117)
	at org.joda.time.chrono.BaseChronology.get(BaseChronology.java:285)
	at org.joda.time.base.BasePeriod.<init>(BasePeriod.java:258)
	at org.joda.time.MutablePeriod.<init>(MutablePeriod.java:200)
	at org.joda.time.TestMutablePeriod_Updates.testSetPeriod_RP2(TestMutablePeriod_Updates.java:503)

testSetPeriod_RP3(org.joda.time.TestMutablePeriod_Updates)  Time elapsed: 0 sec  <<< ERROR!
java.lang.ArithmeticException: Adding time zone offset caused overflow
	at org.joda.time.chrono.ZonedChronology$ZonedDurationField.getOffsetToAdd(ZonedChronology.java:123)
	at org.joda.time.chrono.ZonedChronology$ZonedDurationField.getDifference(ZonedChronology.java:117)
	at org.joda.time.chrono.BaseChronology.get(BaseChronology.java:285)
	at org.joda.time.base.BasePeriod.<init>(BasePeriod.java:258)
	at org.joda.time.MutablePeriod.<init>(MutablePeriod.java:200)
	at org.joda.time.TestMutablePeriod_Updates.testSetPeriod_RP3(TestMutablePeriod_Updates.java:519)

testAdd_long_Chronology1(org.joda.time.TestMutablePeriod_Updates)  Time elapsed: 0 sec  <<< ERROR!
java.lang.ArithmeticException: Adding time zone offset caused overflow
	at org.joda.time.chrono.ZonedChronology$ZonedDurationField.getOffsetToAdd(ZonedChronology.java:123)
	at org.joda.time.chrono.ZonedChronology$ZonedDurationField.getDifference(ZonedChronology.java:117)
	at org.joda.time.chrono.BaseChronology.get(BaseChronology.java:285)
	at org.joda.time.base.BasePeriod.<init>(BasePeriod.java:258)
	at org.joda.time.Period.<init>(Period.java:444)
	at org.joda.time.MutablePeriod.add(MutablePeriod.java:723)
	at org.joda.time.TestMutablePeriod_Updates.testAdd_long_Chronology1(TestMutablePeriod_Updates.java:1139)

testAdd_long_Chronology2(org.joda.time.TestMutablePeriod_Updates)  Time elapsed: 0.001 sec  <<< ERROR!
java.lang.ArithmeticException: Adding time zone offset caused overflow
	at org.joda.time.chrono.ZonedChronology$ZonedDurationField.getOffsetToAdd(ZonedChronology.java:123)
	at org.joda.time.chrono.ZonedChronology$ZonedDurationField.getDifference(ZonedChronology.java:117)
	at org.joda.time.chrono.BaseChronology.get(BaseChronology.java:285)
	at org.joda.time.base.BasePeriod.<init>(BasePeriod.java:258)
	at org.joda.time.MutablePeriod.<init>(MutablePeriod.java:200)
	at org.joda.time.TestMutablePeriod_Updates.testAdd_long_Chronology2(TestMutablePeriod_Updates.java:1151)

testAdd_long_Chronology3(org.joda.time.TestMutablePeriod_Updates)  Time elapsed: 0 sec  <<< ERROR!
java.lang.ArithmeticException: Adding time zone offset caused overflow
	at org.joda.time.chrono.ZonedChronology$ZonedDurationField.getOffsetToAdd(ZonedChronology.java:123)
	at org.joda.time.chrono.ZonedChronology$ZonedDurationField.getDifference(ZonedChronology.java:117)
	at org.joda.time.chrono.BaseChronology.get(BaseChronology.java:285)
	at org.joda.time.base.BasePeriod.<init>(BasePeriod.java:258)
	at org.joda.time.MutablePeriod.<init>(MutablePeriod.java:200)
	at org.joda.time.TestMutablePeriod_Updates.testAdd_long_Chronology3(TestMutablePeriod_Updates.java:1170)

testAdd_RP3(org.joda.time.TestMutablePeriod_Updates)  Time elapsed: 0.001 sec  <<< ERROR!
java.lang.ArithmeticException: Adding time zone offset caused overflow
	at org.joda.time.chrono.ZonedChronology$ZonedDurationField.getOffsetToAdd(ZonedChronology.java:123)
	at org.joda.time.chrono.ZonedChronology$ZonedDurationField.getDifference(ZonedChronology.java:117)
	at org.joda.time.chrono.BaseChronology.get(BaseChronology.java:285)
	at org.joda.time.base.BasePeriod.<init>(BasePeriod.java:258)
	at org.joda.time.MutablePeriod.<init>(MutablePeriod.java:200)
	at org.joda.time.TestMutablePeriod_Updates.testAdd_RP3(TestMutablePeriod_Updates.java:1262)

testAdd_RInterval1(org.joda.time.TestMutablePeriod_Updates)  Time elapsed: 0 sec  <<< ERROR!
java.lang.ArithmeticException: Adding time zone offset caused overflow
	at org.joda.time.chrono.ZonedChronology$ZonedDurationField.getOffsetToAdd(ZonedChronology.java:123)
	at org.joda.time.chrono.ZonedChronology$ZonedDurationField.getDifference(ZonedChronology.java:117)
	at org.joda.time.chrono.BaseChronology.get(BaseChronology.java:260)
	at org.joda.time.base.BasePeriod.<init>(BasePeriod.java:110)
	at org.joda.time.Period.<init>(Period.java:490)
	at org.joda.time.base.AbstractInterval.toPeriod(AbstractInterval.java:447)
	at org.joda.time.MutablePeriod.add(MutablePeriod.java:678)
	at org.joda.time.TestMutablePeriod_Updates.testAdd_RInterval1(TestMutablePeriod_Updates.java:1319)

testAdd_RInterval3(org.joda.time.TestMutablePeriod_Updates)  Time elapsed: 0 sec  <<< ERROR!
java.lang.ArithmeticException: Adding time zone offset caused overflow
	at org.joda.time.chrono.ZonedChronology$ZonedDurationField.getOffsetToAdd(ZonedChronology.java:123)
	at org.joda.time.chrono.ZonedChronology$ZonedDurationField.getDifference(ZonedChronology.java:117)
	at org.joda.time.chrono.BaseChronology.get(BaseChronology.java:285)
	at org.joda.time.base.BasePeriod.<init>(BasePeriod.java:258)
	at org.joda.time.MutablePeriod.<init>(MutablePeriod.java:200)
	at org.joda.time.TestMutablePeriod_Updates.testAdd_RInterval3(TestMutablePeriod_Updates.java:1346)

testAdd_RInterval4(org.joda.time.TestMutablePeriod_Updates)  Time elapsed: 0.001 sec  <<< ERROR!
java.lang.ArithmeticException: Adding time zone offset caused overflow
	at org.joda.time.chrono.ZonedChronology$ZonedDurationField.getOffsetToAdd(ZonedChronology.java:123)
	at org.joda.time.chrono.ZonedChronology$ZonedDurationField.getDifference(ZonedChronology.java:117)
	at org.joda.time.chrono.BaseChronology.get(BaseChronology.java:285)
	at org.joda.time.base.BasePeriod.<init>(BasePeriod.java:258)
	at org.joda.time.MutablePeriod.<init>(MutablePeriod.java:200)
	at org.joda.time.TestMutablePeriod_Updates.testAdd_RInterval4(TestMutablePeriod_Updates.java:1361)

testMergePeriod_RP2(org.joda.time.TestMutablePeriod_Updates)  Time elapsed: 0 sec  <<< ERROR!
java.lang.ArithmeticException: Adding time zone offset caused overflow
	at org.joda.time.chrono.ZonedChronology$ZonedDurationField.getOffsetToAdd(ZonedChronology.java:123)
	at org.joda.time.chrono.ZonedChronology$ZonedDurationField.getDifference(ZonedChronology.java:117)
	at org.joda.time.chrono.BaseChronology.get(BaseChronology.java:285)
	at org.joda.time.base.BasePeriod.<init>(BasePeriod.java:258)
	at org.joda.time.MutablePeriod.<init>(MutablePeriod.java:200)
	at org.joda.time.TestMutablePeriod_Updates.testMergePeriod_RP2(TestMutablePeriod_Updates.java:1401)

testMergePeriod_RP3(org.joda.time.TestMutablePeriod_Updates)  Time elapsed: 0.001 sec  <<< ERROR!
java.lang.ArithmeticException: Adding time zone offset caused overflow
	at org.joda.time.chrono.ZonedChronology$ZonedDurationField.getOffsetToAdd(ZonedChronology.java:123)
	at org.joda.time.chrono.ZonedChronology$ZonedDurationField.getDifference(ZonedChronology.java:117)
	at org.joda.time.chrono.BaseChronology.get(BaseChronology.java:285)
	at org.joda.time.base.BasePeriod.<init>(BasePeriod.java:258)
	at org.joda.time.MutablePeriod.<init>(MutablePeriod.java:200)
	at org.joda.time.TestMutablePeriod_Updates.testMergePeriod_RP3(TestMutablePeriod_Updates.java:1417)

testSetInto_Object(org.joda.time.convert.TestReadableDurationConverter)  Time elapsed: 0.001 sec  <<< ERROR!
java.lang.ArithmeticException: Adding time zone offset caused overflow
	at org.joda.time.chrono.ZonedChronology$ZonedDurationField.getOffsetToAdd(ZonedChronology.java:123)
	at org.joda.time.chrono.ZonedChronology$ZonedDurationField.getDifference(ZonedChronology.java:117)
	at org.joda.time.chrono.BaseChronology.get(BaseChronology.java:285)
	at org.joda.time.convert.ReadableDurationConverter.setInto(ReadableDurationConverter.java:75)
	at org.joda.time.convert.TestReadableDurationConverter.testSetInto_Object(TestReadableDurationConverter.java:112)

testSetIntoPeriod_Object2(org.joda.time.convert.TestReadableIntervalConverter)  Time elapsed: 0 sec  <<< ERROR!
java.lang.ArithmeticException: Adding time zone offset caused overflow
	at org.joda.time.chrono.ZonedChronology$ZonedDurationField.getOffsetToAdd(ZonedChronology.java:123)
	at org.joda.time.chrono.ZonedChronology$ZonedDurationField.getDifference(ZonedChronology.java:117)
	at org.joda.time.chrono.BaseChronology.get(BaseChronology.java:260)
	at org.joda.time.convert.ReadableIntervalConverter.setInto(ReadableIntervalConverter.java:68)
	at org.joda.time.convert.TestReadableIntervalConverter.testSetIntoPeriod_Object2(TestReadableIntervalConverter.java:122)

testSetIntoPeriod_Object1(org.joda.time.convert.TestReadableIntervalConverter)  Time elapsed: 0 sec  <<< ERROR!
java.lang.ArithmeticException: Adding time zone offset caused overflow
	at org.joda.time.chrono.ZonedChronology$ZonedDurationField.getOffsetToAdd(ZonedChronology.java:123)
	at org.joda.time.chrono.ZonedChronology$ZonedDurationField.getDifference(ZonedChronology.java:117)
	at org.joda.time.chrono.BaseChronology.get(BaseChronology.java:260)
	at org.joda.time.convert.ReadableIntervalConverter.setInto(ReadableIntervalConverter.java:68)
	at org.joda.time.convert.TestReadableIntervalConverter.testSetIntoPeriod_Object1(TestReadableIntervalConverter.java:108)

testGetPeriodType_Object(org.joda.time.convert.TestReadablePeriodConverter)  Time elapsed: 0 sec  <<< ERROR!
java.lang.ArithmeticException: Adding time zone offset caused overflow
	at org.joda.time.chrono.ZonedChronology$ZonedDurationField.getOffsetToAdd(ZonedChronology.java:123)
	at org.joda.time.chrono.ZonedChronology$ZonedDurationField.getDifference(ZonedChronology.java:117)
	at org.joda.time.chrono.BaseChronology.get(BaseChronology.java:285)
	at org.joda.time.base.BasePeriod.<init>(BasePeriod.java:258)
	at org.joda.time.Period.<init>(Period.java:402)
	at org.joda.time.convert.TestReadablePeriodConverter.testGetPeriodType_Object(TestReadablePeriodConverter.java:90)

test_add_long_int(org.joda.time.field.TestOffsetDateTimeField)  Time elapsed: 0.001 sec  <<< ERROR!
java.lang.ArithmeticException: Adding time zone offset caused overflow
	at org.joda.time.chrono.ZonedChronology$ZonedDurationField.getOffsetToAdd(ZonedChronology.java:123)
	at org.joda.time.chrono.ZonedChronology$ZonedDurationField.add(ZonedChronology.java:111)
	at org.joda.time.field.BaseDateTimeField.add(BaseDateTimeField.java:253)
	at org.joda.time.field.OffsetDateTimeField.add(OffsetDateTimeField.java:113)
	at org.joda.time.field.TestOffsetDateTimeField.test_add_long_int(TestOffsetDateTimeField.java:210)

test_add_long_long(org.joda.time.field.TestOffsetDateTimeField)  Time elapsed: 0 sec  <<< ERROR!
java.lang.ArithmeticException: Adding time zone offset caused overflow
	at org.joda.time.chrono.ZonedChronology$ZonedDurationField.getOffsetToAdd(ZonedChronology.java:123)
	at org.joda.time.chrono.ZonedChronology$ZonedDurationField.add(ZonedChronology.java:114)
	at org.joda.time.field.BaseDateTimeField.add(BaseDateTimeField.java:267)
	at org.joda.time.field.OffsetDateTimeField.add(OffsetDateTimeField.java:127)
	at org.joda.time.field.TestOffsetDateTimeField.test_add_long_long(TestOffsetDateTimeField.java:215)

test_getDifference_long_long(org.joda.time.field.TestOffsetDateTimeField)  Time elapsed: 0 sec  <<< ERROR!
java.lang.ArithmeticException: Adding time zone offset caused overflow
	at org.joda.time.chrono.ZonedChronology$ZonedDurationField.getOffsetToAdd(ZonedChronology.java:123)
	at org.joda.time.chrono.ZonedChronology$ZonedDurationField.getDifference(ZonedChronology.java:117)
	at org.joda.time.field.BaseDateTimeField.getDifference(BaseDateTimeField.java:522)
	at org.joda.time.field.TestOffsetDateTimeField.test_getDifference_long_long(TestOffsetDateTimeField.java:292)

test_getDifferenceAsLong_long_long(org.joda.time.field.TestOffsetDateTimeField)  Time elapsed: 0.003 sec  <<< ERROR!
java.lang.ArithmeticException: Adding time zone offset caused overflow
	at org.joda.time.chrono.ZonedChronology$ZonedDurationField.getOffsetToAdd(ZonedChronology.java:123)
	at org.joda.time.chrono.ZonedChronology$ZonedDurationField.getDifferenceAsLong(ZonedChronology.java:119)
	at org.joda.time.field.BaseDateTimeField.getDifferenceAsLong(BaseDateTimeField.java:545)
	at org.joda.time.field.TestOffsetDateTimeField.test_getDifferenceAsLong_long_long(TestOffsetDateTimeField.java:297)


Results :

Tests in error: 
  org.joda.time.TestDuration_Basics#testToPeriod_PeriodType ArithmeticException ...
  org.joda.time.TestMutablePeriod_Basics#testEqualsHashCode ArithmeticException ...
  org.joda.time.TestMutablePeriod_Constructors#testConstructor_Object_Chronology1 ArithmeticException
  org.joda.time.TestMutablePeriod_Constructors#testConstructor_long_Chronology1 ArithmeticException
  org.joda.time.TestMutablePeriod_Constructors#testConstructor_long_Chronology3 ArithmeticException
  org.joda.time.TestMutablePeriod_Constructors#testConstructor_long_PeriodType1 ArithmeticException
  org.joda.time.TestMutablePeriod_Constructors#testConstructor_long_PeriodType2 ArithmeticException
  org.joda.time.TestMutablePeriod_Constructors#testConstructor_long_PeriodType3 ArithmeticException
  org.joda.time.TestMutablePeriod_Constructors#testConstructor_long_PeriodType4 ArithmeticException
  org.joda.time.TestMutablePeriod_Constructors#testConstructor_long_PeriodType_Chronology1 ArithmeticException
  org.joda.time.TestMutablePeriod_Constructors#testConstructor_long_PeriodType_Chronology3 ArithmeticException
  org.joda.time.TestMutablePeriod_Constructors#testConstructor_long_PeriodType_Chronology4 ArithmeticException
  org.joda.time.TestMutablePeriod_Updates#testAdd_8ints2 ArithmeticException Add...
  org.joda.time.TestMutablePeriod_Updates#testAdd_RD1 ArithmeticException Adding...
  org.joda.time.TestMutablePeriod_Updates#testAdd_RD2 ArithmeticException Adding...
  org.joda.time.TestMutablePeriod_Updates#testAdd_RInterval1 ArithmeticException
  org.joda.time.TestMutablePeriod_Updates#testAdd_RInterval3 ArithmeticException
  org.joda.time.TestMutablePeriod_Updates#testAdd_RInterval4 ArithmeticException
  org.joda.time.TestMutablePeriod_Updates#testAdd_RP2 ArithmeticException Adding...
  org.joda.time.TestMutablePeriod_Updates#testAdd_RP3 ArithmeticException Adding...
  org.joda.time.TestMutablePeriod_Updates#testAdd_long1 ArithmeticException Addi...
  org.joda.time.TestMutablePeriod_Updates#testAdd_long2 ArithmeticException Addi...
  org.joda.time.TestMutablePeriod_Updates#testAdd_long3 ArithmeticException Addi...
  org.joda.time.TestMutablePeriod_Updates#testAdd_long_Chronology1 ArithmeticException
  org.joda.time.TestMutablePeriod_Updates#testAdd_long_Chronology2 ArithmeticException
  org.joda.time.TestMutablePeriod_Updates#testAdd_long_Chronology3 ArithmeticException
  org.joda.time.TestMutablePeriod_Updates#testMergePeriod_RP2 ArithmeticException
  org.joda.time.TestMutablePeriod_Updates#testMergePeriod_RP3 ArithmeticException
  org.joda.time.TestMutablePeriod_Updates#testSetPeriod_8ints2 ArithmeticException
  org.joda.time.TestMutablePeriod_Updates#testSetPeriod_8ints3 ArithmeticException
  org.joda.time.TestMutablePeriod_Updates#testSetPeriod_RD1 ArithmeticException ...
  org.joda.time.TestMutablePeriod_Updates#testSetPeriod_RD2 ArithmeticException ...
  org.joda.time.TestMutablePeriod_Updates#testSetPeriod_RP2 ArithmeticException ...
  org.joda.time.TestMutablePeriod_Updates#testSetPeriod_RP3 ArithmeticException ...
  org.joda.time.TestMutablePeriod_Updates#testSetPeriod_long1 ArithmeticException
  org.joda.time.TestMutablePeriod_Updates#testSetPeriod_long2 ArithmeticException
  org.joda.time.TestPeriod_Basics#testEqualsHashCode ArithmeticException Adding ...
  org.joda.time.TestPeriod_Constructors#testConstructor_long_Chronology1 ArithmeticException
  org.joda.time.TestPeriod_Constructors#testConstructor_long_Chronology3 ArithmeticException
  org.joda.time.TestPeriod_Constructors#testConstructor_long_PeriodType1 ArithmeticException
  org.joda.time.TestPeriod_Constructors#testConstructor_long_PeriodType2 ArithmeticException
  org.joda.time.TestPeriod_Constructors#testConstructor_long_PeriodType3 ArithmeticException
  org.joda.time.TestPeriod_Constructors#testConstructor_long_PeriodType4 ArithmeticException
  org.joda.time.TestPeriod_Constructors#testConstructor_long_PeriodType_Chronology1 ArithmeticException
  org.joda.time.TestPeriod_Constructors#testConstructor_long_PeriodType_Chronology3 ArithmeticException
  org.joda.time.TestPeriod_Constructors#testConstructor_long_PeriodType_Chronology4 ArithmeticException
  org.joda.time.convert.TestReadableDurationConverter#testSetInto_Object ArithmeticException
  org.joda.time.convert.TestReadableIntervalConverter#testSetIntoPeriod_Object1 ArithmeticException
  org.joda.time.convert.TestReadableIntervalConverter#testSetIntoPeriod_Object2 ArithmeticException
  org.joda.time.convert.TestReadablePeriodConverter#testGetPeriodType_Object ArithmeticException
  org.joda.time.field.TestOffsetDateTimeField#test_add_long_int ArithmeticException
  org.joda.time.field.TestOffsetDateTimeField#test_add_long_long ArithmeticException
  org.joda.time.field.TestOffsetDateTimeField#test_getDifferenceAsLong_long_long ArithmeticException
  org.joda.time.field.TestOffsetDateTimeField#test_getDifference_long_long ArithmeticException

Tests run: 4157, Failures: 0, Errors: 54, Skipped: 0

[INFO] ------------------------------------------------------------------------
[INFO] BUILD FAILURE
[INFO] ------------------------------------------------------------------------
[INFO] Total time: 15.357s
[INFO] Finished at: Thu Aug 06 02:27:23 BST 2015
[INFO] Final Memory: 10M/338M
[INFO] ------------------------------------------------------------------------
[ERROR] Failed to execute goal org.apache.maven.plugins:maven-surefire-plugin:2.18.1:test (default-test) on project joda-time: There are test failures.
[ERROR] 
[ERROR] Please refer to /home/perham/Study/LittleDarwin/Cases/joda-time-2.8.1/target/surefire-reports for the individual test results.
[ERROR] -> [Help 1]
[ERROR] 
[ERROR] To see the full stack trace of the errors, re-run Maven with the -e switch.
[ERROR] Re-run Maven using the -X switch to enable full debug logging.
[ERROR] 
[ERROR] For more information about the errors and possible solutions, please read the following articles:
[ERROR] [Help 1] http://cwiki.apache.org/confluence/display/MAVEN/MojoFailureException
