[INFO] Scanning for projects...
[INFO]                                                                         
[INFO] ------------------------------------------------------------------------
[INFO] Building Joda-Time 2.8.1
[INFO] ------------------------------------------------------------------------
[INFO] 
[INFO] --- maven-resources-plugin:2.7:resources (default-resources) @ joda-time ---
[INFO] Using 'UTF-8' encoding to copy filtered resources.
[INFO] Copying 2 resources to META-INF
[INFO] Copying 10 resources
[INFO] 
[INFO] --- maven-compiler-plugin:3.3:compile (default-compile) @ joda-time ---
[INFO] Changes detected - recompiling the module!
[INFO] Compiling 166 source files to /home/perham/Study/LittleDarwin/Cases/joda-time-2.8.1/target/classes
[INFO] 
[INFO] --- exec-maven-plugin:1.4.0:java (compile-tzdb) @ joda-time ---
Writing zoneinfo files
Writing ZoneInfoMap
[INFO] 
[INFO] --- maven-resources-plugin:2.7:testResources (default-testResources) @ joda-time ---
[INFO] Using 'UTF-8' encoding to copy filtered resources.
[INFO] Copying 34 resources
[INFO] 
[INFO] --- maven-compiler-plugin:3.3:testCompile (default-testCompile) @ joda-time ---
[INFO] Nothing to compile - all classes are up to date
[INFO] 
[INFO] --- maven-surefire-plugin:2.18.1:test (default-test) @ joda-time ---
[INFO] Surefire report directory: /home/perham/Study/LittleDarwin/Cases/joda-time-2.8.1/target/surefire-reports

-------------------------------------------------------
 T E S T S
-------------------------------------------------------
Running org.joda.time.TestAllPackages

TestBuddhistChronology.testCalendar

TestCopticChronology.testCalendar

TestEthiopicChronology.testCalendar

TestIslamicChronology.testCalendar

Testing Gregorian chronology over 1000 iterations
100% complete (i=1000)

Testing Julian chronology over 1000 iterations
100% complete (i=1000)
Writing zoneinfo files
Writing ZoneInfoMap
Tests run: 4157, Failures: 1, Errors: 4, Skipped: 0, Time elapsed: 4.579 sec <<< FAILURE! - in org.joda.time.TestAllPackages
testSampleDate3(org.joda.time.chrono.TestIslamicChronology)  Time elapsed: 0.006 sec  <<< FAILURE!
junit.framework.AssertionFailedError: expected:<1426> but was:<1426063376>
	at junit.framework.Assert.fail(Assert.java:47)
	at junit.framework.Assert.failNotEquals(Assert.java:280)
	at junit.framework.Assert.assertEquals(Assert.java:64)
	at junit.framework.Assert.assertEquals(Assert.java:198)
	at junit.framework.Assert.assertEquals(Assert.java:204)
	at org.joda.time.chrono.TestIslamicChronology.testSampleDate3(TestIslamicChronology.java:543)

testSampleDateWithZone(org.joda.time.chrono.TestIslamicChronology)  Time elapsed: 0 sec  <<< ERROR!
org.joda.time.IllegalFieldValueException: Value -454819824 for year must be in the range [1,292271022]
	at org.joda.time.field.FieldUtils.verifyValueBounds(FieldUtils.java:234)
	at org.joda.time.chrono.BasicYearDateTimeField.set(BasicYearDateTimeField.java:83)
	at org.joda.time.chrono.LimitChronology$LimitDateTimeField.set(LimitChronology.java:511)
	at org.joda.time.base.BaseDateTime.<init>(BaseDateTime.java:129)
	at org.joda.time.DateTime.<init>(DateTime.java:236)
	at org.joda.time.DateTime.withChronology(DateTime.java:612)
	at org.joda.time.chrono.TestIslamicChronology.testSampleDateWithZone(TestIslamicChronology.java:596)

testCalendar(org.joda.time.chrono.TestIslamicChronology)  Time elapsed: 0.001 sec  <<< ERROR!
java.lang.ArithmeticException: Year is too small: -1893728255 < -292269337
	at org.joda.time.chrono.IslamicChronology.calculateFirstDayOfYearMillis(IslamicChronology.java:117)
	at org.joda.time.chrono.BasicChronology.getYearInfo(BasicChronology.java:758)
	at org.joda.time.chrono.BasicChronology.getYearMillis(BasicChronology.java:368)
	at org.joda.time.chrono.BasicChronology.getDayOfYear(BasicChronology.java:493)
	at org.joda.time.chrono.BasicChronology.getDayOfYear(BasicChronology.java:485)
	at org.joda.time.chrono.BasicDayOfYearDateTimeField.get(BasicDayOfYearDateTimeField.java:53)
	at org.joda.time.chrono.LimitChronology$LimitDateTimeField.get(LimitChronology.java:463)
	at org.joda.time.chrono.TestIslamicChronology.testCalendar(TestIslamicChronology.java:343)

testSampleDate1(org.joda.time.chrono.TestIslamicChronology)  Time elapsed: 0.001 sec  <<< ERROR!
org.joda.time.IllegalFieldValueException: Value 1015021582 for year must be in the range [1,292271022]
	at org.joda.time.field.FieldUtils.verifyValueBounds(FieldUtils.java:234)
	at org.joda.time.chrono.BasicYearDateTimeField.set(BasicYearDateTimeField.java:83)
	at org.joda.time.chrono.LimitChronology$LimitDateTimeField.set(LimitChronology.java:511)
	at org.joda.time.base.BaseDateTime.<init>(BaseDateTime.java:129)
	at org.joda.time.DateTime.<init>(DateTime.java:236)
	at org.joda.time.DateTime.withChronology(DateTime.java:612)
	at org.joda.time.chrono.TestIslamicChronology.testSampleDate1(TestIslamicChronology.java:415)

testSampleDate2(org.joda.time.chrono.TestIslamicChronology)  Time elapsed: 0.001 sec  <<< ERROR!
org.joda.time.IllegalFieldValueException: Value 1486880784 for year must be in the range [1,292271022]
	at org.joda.time.field.FieldUtils.verifyValueBounds(FieldUtils.java:234)
	at org.joda.time.chrono.BasicYearDateTimeField.set(BasicYearDateTimeField.java:83)
	at org.joda.time.chrono.LimitChronology$LimitDateTimeField.set(LimitChronology.java:511)
	at org.joda.time.base.BaseDateTime.<init>(BaseDateTime.java:129)
	at org.joda.time.DateTime.<init>(DateTime.java:236)
	at org.joda.time.DateTime.withChronology(DateTime.java:612)
	at org.joda.time.chrono.TestIslamicChronology.testSampleDate2(TestIslamicChronology.java:481)


Results :

Failed tests: 
  org.joda.time.chrono.TestIslamicChronology#testSampleDate3 AssertionFailedError
Tests in error: 
  org.joda.time.chrono.TestIslamicChronology#testCalendar ArithmeticException Ye...
  org.joda.time.chrono.TestIslamicChronology#testSampleDate1 IllegalFieldValueException
  org.joda.time.chrono.TestIslamicChronology#testSampleDate2 IllegalFieldValueException
  org.joda.time.chrono.TestIslamicChronology#testSampleDateWithZone IllegalFieldValueException

Tests run: 4157, Failures: 1, Errors: 4, Skipped: 0

[INFO] ------------------------------------------------------------------------
[INFO] BUILD FAILURE
[INFO] ------------------------------------------------------------------------
[INFO] Total time: 14.505s
[INFO] Finished at: Thu Aug 06 01:37:03 BST 2015
[INFO] Final Memory: 10M/338M
[INFO] ------------------------------------------------------------------------
[ERROR] Failed to execute goal org.apache.maven.plugins:maven-surefire-plugin:2.18.1:test (default-test) on project joda-time: There are test failures.
[ERROR] 
[ERROR] Please refer to /home/perham/Study/LittleDarwin/Cases/joda-time-2.8.1/target/surefire-reports for the individual test results.
[ERROR] -> [Help 1]
[ERROR] 
[ERROR] To see the full stack trace of the errors, re-run Maven with the -e switch.
[ERROR] Re-run Maven using the -X switch to enable full debug logging.
[ERROR] 
[ERROR] For more information about the errors and possible solutions, please read the following articles:
[ERROR] [Help 1] http://cwiki.apache.org/confluence/display/MAVEN/MojoFailureException
