[INFO] Scanning for projects...
[INFO]                                                                         
[INFO] ------------------------------------------------------------------------
[INFO] Building Joda-Time 2.8.1
[INFO] ------------------------------------------------------------------------
[INFO] 
[INFO] --- maven-resources-plugin:2.7:resources (default-resources) @ joda-time ---
[INFO] Using 'UTF-8' encoding to copy filtered resources.
[INFO] Copying 2 resources to META-INF
[INFO] Copying 10 resources
[INFO] 
[INFO] --- maven-compiler-plugin:3.3:compile (default-compile) @ joda-time ---
[INFO] Changes detected - recompiling the module!
[INFO] Compiling 166 source files to /home/perham/Study/LittleDarwin/Cases/joda-time-2.8.1/target/classes
[INFO] 
[INFO] --- exec-maven-plugin:1.4.0:java (compile-tzdb) @ joda-time ---
Writing zoneinfo files
Writing ZoneInfoMap
[INFO] 
[INFO] --- maven-resources-plugin:2.7:testResources (default-testResources) @ joda-time ---
[INFO] Using 'UTF-8' encoding to copy filtered resources.
[INFO] Copying 34 resources
[INFO] 
[INFO] --- maven-compiler-plugin:3.3:testCompile (default-testCompile) @ joda-time ---
[INFO] Nothing to compile - all classes are up to date
[INFO] 
[INFO] --- maven-surefire-plugin:2.18.1:test (default-test) @ joda-time ---
[INFO] Surefire report directory: /home/perham/Study/LittleDarwin/Cases/joda-time-2.8.1/target/surefire-reports

-------------------------------------------------------
 T E S T S
-------------------------------------------------------
Running org.joda.time.TestAllPackages

TestBuddhistChronology.testCalendar

TestCopticChronology.testCalendar

TestEthiopicChronology.testCalendar

TestIslamicChronology.testCalendar

Testing Gregorian chronology over 1000 iterations
100% complete (i=1000)

Testing Julian chronology over 1000 iterations
100% complete (i=1000)
Writing zoneinfo files
Writing ZoneInfoMap
Tests run: 4157, Failures: 330, Errors: 40, Skipped: 0, Time elapsed: 5.523 sec <<< FAILURE! - in org.joda.time.TestAllPackages
testToString(org.joda.time.TestChronology)  Time elapsed: 0.005 sec  <<< FAILURE!
junit.framework.ComparisonFailure: expected:<...SOChronology[Europe/[Paris]]> but was:<...SOChronology[Europe/[London]]>
	at junit.framework.Assert.assertEquals(Assert.java:81)
	at junit.framework.Assert.assertEquals(Assert.java:87)
	at org.joda.time.TestChronology.testToString(TestChronology.java:234)

testConstructor_int_int_int_int_int_nullDateTimeZone(org.joda.time.TestDateTime_Constructors)  Time elapsed: 0.002 sec  <<< ERROR!
java.lang.NullPointerException
	at java.util.concurrent.ConcurrentHashMap.hash(ConcurrentHashMap.java:333)
	at java.util.concurrent.ConcurrentHashMap.get(ConcurrentHashMap.java:988)
	at org.joda.time.chrono.ISOChronology.getInstance(ISOChronology.java:27)
	at org.joda.time.base.BaseDateTime.<init>(BaseDateTime.java:227)
	at org.joda.time.DateTime.<init>(DateTime.java:347)
	at org.joda.time.TestDateTime_Constructors.testConstructor_int_int_int_int_int_nullDateTimeZone(TestDateTime_Constructors.java:625)

testConstructor_int_int_int_int_int_int_DateTimeZone(org.joda.time.TestDateTime_Constructors)  Time elapsed: 0.001 sec  <<< FAILURE!
junit.framework.AssertionFailedError: expected:<1023580800000> but was:<1023584400000>
	at junit.framework.Assert.fail(Assert.java:47)
	at junit.framework.Assert.failNotEquals(Assert.java:280)
	at junit.framework.Assert.assertEquals(Assert.java:64)
	at junit.framework.Assert.assertEquals(Assert.java:133)
	at junit.framework.Assert.assertEquals(Assert.java:139)
	at org.joda.time.TestDateTime_Constructors.testConstructor_int_int_int_int_int_int_DateTimeZone(TestDateTime_Constructors.java:665)

testConstructor_int_int_int_int_int_int_nullDateTimeZone(org.joda.time.TestDateTime_Constructors)  Time elapsed: 0.001 sec  <<< ERROR!
java.lang.NullPointerException
	at java.util.concurrent.ConcurrentHashMap.hash(ConcurrentHashMap.java:333)
	at java.util.concurrent.ConcurrentHashMap.get(ConcurrentHashMap.java:988)
	at org.joda.time.chrono.ISOChronology.getInstance(ISOChronology.java:27)
	at org.joda.time.base.BaseDateTime.<init>(BaseDateTime.java:227)
	at org.joda.time.DateTime.<init>(DateTime.java:423)
	at org.joda.time.TestDateTime_Constructors.testConstructor_int_int_int_int_int_int_nullDateTimeZone(TestDateTime_Constructors.java:672)

testConstructor_int_int_int_int_int_int_int_DateTimeZone(org.joda.time.TestDateTime_Constructors)  Time elapsed: 0.001 sec  <<< FAILURE!
junit.framework.AssertionFailedError: expected:<1023580800000> but was:<1023584400000>
	at junit.framework.Assert.fail(Assert.java:47)
	at junit.framework.Assert.failNotEquals(Assert.java:280)
	at junit.framework.Assert.assertEquals(Assert.java:64)
	at junit.framework.Assert.assertEquals(Assert.java:133)
	at junit.framework.Assert.assertEquals(Assert.java:139)
	at org.joda.time.TestDateTime_Constructors.testConstructor_int_int_int_int_int_int_int_DateTimeZone(TestDateTime_Constructors.java:741)

testConstructor_int_int_int_int_int_int_int_nullDateTimeZone(org.joda.time.TestDateTime_Constructors)  Time elapsed: 0.001 sec  <<< ERROR!
java.lang.NullPointerException
	at java.util.concurrent.ConcurrentHashMap.hash(ConcurrentHashMap.java:333)
	at java.util.concurrent.ConcurrentHashMap.get(ConcurrentHashMap.java:988)
	at org.joda.time.chrono.ISOChronology.getInstance(ISOChronology.java:27)
	at org.joda.time.base.BaseDateTime.<init>(BaseDateTime.java:227)
	at org.joda.time.DateTime.<init>(DateTime.java:503)
	at org.joda.time.TestDateTime_Constructors.testConstructor_int_int_int_int_int_int_int_nullDateTimeZone(TestDateTime_Constructors.java:777)

testParse_noFormatter(org.joda.time.TestDateTime_Constructors)  Time elapsed: 0.001 sec  <<< FAILURE!
junit.framework.AssertionFailedError: expected:<2010-06-30T01:20:00.000+01:00> but was:<2010-06-30T00:20:00.000+01:00>
	at junit.framework.Assert.fail(Assert.java:47)
	at junit.framework.Assert.failNotEquals(Assert.java:280)
	at junit.framework.Assert.assertEquals(Assert.java:64)
	at junit.framework.Assert.assertEquals(Assert.java:71)
	at org.joda.time.TestDateTime_Constructors.testParse_noFormatter(TestDateTime_Constructors.java:157)

testConstructor_Object_nullDateTimeZone(org.joda.time.TestDateTime_Constructors)  Time elapsed: 0 sec  <<< ERROR!
java.lang.NullPointerException
	at java.util.concurrent.ConcurrentHashMap.hash(ConcurrentHashMap.java:333)
	at java.util.concurrent.ConcurrentHashMap.get(ConcurrentHashMap.java:988)
	at org.joda.time.chrono.ISOChronology.getInstance(ISOChronology.java:27)
	at org.joda.time.convert.AbstractConverter.getChronology(AbstractConverter.java:67)
	at org.joda.time.base.BaseDateTime.<init>(BaseDateTime.java:152)
	at org.joda.time.DateTime.<init>(DateTime.java:281)
	at org.joda.time.TestDateTime_Constructors.testConstructor_Object_nullDateTimeZone(TestDateTime_Constructors.java:511)

testConstructor_nullObject_nullDateTimeZone(org.joda.time.TestDateTime_Constructors)  Time elapsed: 0.001 sec  <<< ERROR!
java.lang.NullPointerException
	at java.util.concurrent.ConcurrentHashMap.hash(ConcurrentHashMap.java:333)
	at java.util.concurrent.ConcurrentHashMap.get(ConcurrentHashMap.java:988)
	at org.joda.time.chrono.ISOChronology.getInstance(ISOChronology.java:27)
	at org.joda.time.convert.AbstractConverter.getChronology(AbstractConverter.java:67)
	at org.joda.time.base.BaseDateTime.<init>(BaseDateTime.java:152)
	at org.joda.time.DateTime.<init>(DateTime.java:281)
	at org.joda.time.TestDateTime_Constructors.testConstructor_nullObject_nullDateTimeZone(TestDateTime_Constructors.java:520)

testConstructor_int_int_int_int_int_DateTimeZone(org.joda.time.TestDateTime_Constructors)  Time elapsed: 0.001 sec  <<< FAILURE!
junit.framework.AssertionFailedError: expected:<1023580800000> but was:<1023584400000>
	at junit.framework.Assert.fail(Assert.java:47)
	at junit.framework.Assert.failNotEquals(Assert.java:280)
	at junit.framework.Assert.assertEquals(Assert.java:64)
	at junit.framework.Assert.assertEquals(Assert.java:133)
	at junit.framework.Assert.assertEquals(Assert.java:139)
	at org.joda.time.TestDateTime_Constructors.testConstructor_int_int_int_int_int_DateTimeZone(TestDateTime_Constructors.java:618)

testParse_noFormatter_vs_constructor_correctOffset(org.joda.time.TestDateTime_Constructors)  Time elapsed: 0.001 sec  <<< FAILURE!
junit.framework.AssertionFailedError: expected:<+01:00> but was:<Europe/London>
	at junit.framework.Assert.fail(Assert.java:47)
	at junit.framework.Assert.failNotEquals(Assert.java:280)
	at junit.framework.Assert.assertEquals(Assert.java:64)
	at junit.framework.Assert.assertEquals(Assert.java:71)
	at org.joda.time.TestDateTime_Constructors.testParse_noFormatter_vs_constructor_correctOffset(TestDateTime_Constructors.java:173)

testConstructor_nullDateTimeZone(org.joda.time.TestDateTime_Constructors)  Time elapsed: 0.001 sec  <<< ERROR!
java.lang.NullPointerException
	at java.util.concurrent.ConcurrentHashMap.hash(ConcurrentHashMap.java:333)
	at java.util.concurrent.ConcurrentHashMap.get(ConcurrentHashMap.java:988)
	at org.joda.time.chrono.ISOChronology.getInstance(ISOChronology.java:27)
	at org.joda.time.base.BaseDateTime.<init>(BaseDateTime.java:73)
	at org.joda.time.DateTime.<init>(DateTime.java:184)
	at org.joda.time.TestDateTime_Constructors.testConstructor_nullDateTimeZone(TestDateTime_Constructors.java:204)

testConstructor_long_nullDateTimeZone(org.joda.time.TestDateTime_Constructors)  Time elapsed: 0.001 sec  <<< ERROR!
java.lang.NullPointerException
	at java.util.concurrent.ConcurrentHashMap.hash(ConcurrentHashMap.java:333)
	at java.util.concurrent.ConcurrentHashMap.get(ConcurrentHashMap.java:988)
	at org.joda.time.chrono.ISOChronology.getInstance(ISOChronology.java:27)
	at org.joda.time.base.BaseDateTime.<init>(BaseDateTime.java:110)
	at org.joda.time.DateTime.<init>(DateTime.java:222)
	at org.joda.time.TestDateTime_Constructors.testConstructor_long_nullDateTimeZone(TestDateTime_Constructors.java:298)

testToString(org.joda.time.TestDateTime_Basics)  Time elapsed: 0 sec  <<< FAILURE!
junit.framework.ComparisonFailure: expected:<2002-06-09T0[2:00:00.000+02]:00> but was:<2002-06-09T0[1:00:00.000+01]:00>
	at junit.framework.Assert.assertEquals(Assert.java:81)
	at junit.framework.Assert.assertEquals(Assert.java:87)
	at org.joda.time.TestDateTime_Basics.testToString(TestDateTime_Basics.java:507)

testWithDate_int_int_int_toDST1(org.joda.time.TestDateTime_Basics)  Time elapsed: 0.001 sec  <<< FAILURE!
junit.framework.AssertionFailedError: expected:<2010-03-28T03:55:00.000+01:00> but was:<2010-03-28T02:55:00.000+01:00>
	at junit.framework.Assert.fail(Assert.java:47)
	at junit.framework.Assert.failNotEquals(Assert.java:280)
	at junit.framework.Assert.assertEquals(Assert.java:64)
	at junit.framework.Assert.assertEquals(Assert.java:71)
	at org.joda.time.TestDateTime_Basics.testWithDate_int_int_int_toDST1(TestDateTime_Basics.java:847)

testWithDate_int_int_int_toDST2(org.joda.time.TestDateTime_Basics)  Time elapsed: 0.001 sec  <<< FAILURE!
junit.framework.AssertionFailedError: expected:<2010-03-28T03:55:00.000+01:00> but was:<2010-03-28T02:55:00.000+01:00>
	at junit.framework.Assert.fail(Assert.java:47)
	at junit.framework.Assert.failNotEquals(Assert.java:280)
	at junit.framework.Assert.assertEquals(Assert.java:64)
	at junit.framework.Assert.assertEquals(Assert.java:71)
	at org.joda.time.TestDateTime_Basics.testWithDate_int_int_int_toDST2(TestDateTime_Basics.java:855)

testWithTime_int_int_int_int_toDST(org.joda.time.TestDateTime_Basics)  Time elapsed: 0.001 sec  <<< FAILURE!
junit.framework.AssertionFailedError: expected:<2010-03-28T03:55:00.000+01:00> but was:<2010-03-28T02:55:00.000+01:00>
	at junit.framework.Assert.fail(Assert.java:47)
	at junit.framework.Assert.failNotEquals(Assert.java:280)
	at junit.framework.Assert.assertEquals(Assert.java:64)
	at junit.framework.Assert.assertEquals(Assert.java:71)
	at org.joda.time.TestDateTime_Basics.testWithTime_int_int_int_int_toDST(TestDateTime_Basics.java:898)

testToCalendar_Locale(org.joda.time.TestDateTime_Basics)  Time elapsed: 0.003 sec  <<< FAILURE!
junit.framework.AssertionFailedError: expected:<sun.util.calendar.ZoneInfo[id="Europe/Paris",offset=3600000,dstSavings=3600000,useDaylight=true,transitions=184,lastRule=java.util.SimpleTimeZone[id=Europe/Paris,offset=3600000,dstSavings=3600000,useDaylight=true,startYear=0,startMode=2,startMonth=2,startDay=-1,startDayOfWeek=1,startTime=3600000,startTimeMode=2,endMode=2,endMonth=9,endDay=-1,endDayOfWeek=1,endTime=3600000,endTimeMode=2]]> but was:<sun.util.calendar.ZoneInfo[id="Europe/London",offset=0,dstSavings=3600000,useDaylight=true,transitions=242,lastRule=java.util.SimpleTimeZone[id=Europe/London,offset=0,dstSavings=3600000,useDaylight=true,startYear=0,startMode=2,startMonth=2,startDay=-1,startDayOfWeek=1,startTime=3600000,startTimeMode=2,endMode=2,endMonth=9,endDay=-1,endDayOfWeek=1,endTime=3600000,endTimeMode=2]]>
	at junit.framework.Assert.fail(Assert.java:47)
	at junit.framework.Assert.failNotEquals(Assert.java:280)
	at junit.framework.Assert.assertEquals(Assert.java:64)
	at junit.framework.Assert.assertEquals(Assert.java:71)
	at org.joda.time.TestDateTime_Basics.testToCalendar_Locale(TestDateTime_Basics.java:690)

testToGregorianCalendar(org.joda.time.TestDateTime_Basics)  Time elapsed: 0.001 sec  <<< FAILURE!
junit.framework.AssertionFailedError: expected:<sun.util.calendar.ZoneInfo[id="Europe/Paris",offset=3600000,dstSavings=3600000,useDaylight=true,transitions=184,lastRule=java.util.SimpleTimeZone[id=Europe/Paris,offset=3600000,dstSavings=3600000,useDaylight=true,startYear=0,startMode=2,startMonth=2,startDay=-1,startDayOfWeek=1,startTime=3600000,startTimeMode=2,endMode=2,endMonth=9,endDay=-1,endDayOfWeek=1,endTime=3600000,endTimeMode=2]]> but was:<sun.util.calendar.ZoneInfo[id="Europe/London",offset=0,dstSavings=3600000,useDaylight=true,transitions=242,lastRule=java.util.SimpleTimeZone[id=Europe/London,offset=0,dstSavings=3600000,useDaylight=true,startYear=0,startMode=2,startMonth=2,startDay=-1,startDayOfWeek=1,startTime=3600000,startTimeMode=2,endMode=2,endMonth=9,endDay=-1,endDayOfWeek=1,endTime=3600000,endTimeMode=2]]>
	at junit.framework.Assert.fail(Assert.java:47)
	at junit.framework.Assert.failNotEquals(Assert.java:280)
	at junit.framework.Assert.assertEquals(Assert.java:64)
	at junit.framework.Assert.assertEquals(Assert.java:71)
	at org.joda.time.TestDateTime_Basics.testToGregorianCalendar(TestDateTime_Basics.java:707)

testToDateTimeISO(org.joda.time.TestDateTime_Basics)  Time elapsed: 0.001 sec  <<< FAILURE!
junit.framework.AssertionFailedError: expected not same
	at junit.framework.Assert.fail(Assert.java:47)
	at junit.framework.Assert.failSame(Assert.java:269)
	at junit.framework.Assert.assertNotSame(Assert.java:255)
	at junit.framework.Assert.assertNotSame(Assert.java:262)
	at org.joda.time.TestDateTime_Basics.testToDateTimeISO(TestDateTime_Basics.java:556)

testToDateTime_DateTimeZone(org.joda.time.TestDateTime_Basics)  Time elapsed: 0.001 sec  <<< FAILURE!
junit.framework.AssertionFailedError: expected:<Europe/Paris> but was:<Europe/London>
	at junit.framework.Assert.fail(Assert.java:47)
	at junit.framework.Assert.failNotEquals(Assert.java:280)
	at junit.framework.Assert.assertEquals(Assert.java:64)
	at junit.framework.Assert.assertEquals(Assert.java:71)
	at org.joda.time.TestDateTime_Basics.testToDateTime_DateTimeZone(TestDateTime_Basics.java:583)

testPropertyWithMaximumValueMillisOfDayDSTGap(org.joda.time.TestDateTime_Properties)  Time elapsed: 0.001 sec  <<< FAILURE!
junit.framework.ComparisonFailure: expected:<1926-04-17T2[2]:59:59.999Z> but was:<1926-04-17T2[3]:59:59.999Z>
	at junit.framework.Assert.assertEquals(Assert.java:81)
	at junit.framework.Assert.assertEquals(Assert.java:87)
	at org.joda.time.TestDateTime_Properties.testPropertyWithMaximumValueMillisOfDayDSTGap(TestDateTime_Properties.java:651)

testPropertyWithMinimumValueMillisOfDayDSTGap(org.joda.time.TestDateTime_Properties)  Time elapsed: 0.001 sec  <<< FAILURE!
junit.framework.ComparisonFailure: expected:<2001-04-20T0[1:00:00.000+03]:00> but was:<2001-04-20T0[0:00:00.000+01]:00>
	at junit.framework.Assert.assertEquals(Assert.java:81)
	at junit.framework.Assert.assertEquals(Assert.java:87)
	at org.joda.time.TestDateTime_Properties.testPropertyWithMinimumValueMillisOfDayDSTGap(TestDateTime_Properties.java:665)

testConstructor_int_int_int_int_int_int_int_DateTimeZone(org.joda.time.TestMutableDateTime_Constructors)  Time elapsed: 0.001 sec  <<< FAILURE!
junit.framework.AssertionFailedError: expected:<1023580800000> but was:<1023584400000>
	at junit.framework.Assert.fail(Assert.java:47)
	at junit.framework.Assert.failNotEquals(Assert.java:280)
	at junit.framework.Assert.assertEquals(Assert.java:64)
	at junit.framework.Assert.assertEquals(Assert.java:133)
	at junit.framework.Assert.assertEquals(Assert.java:139)
	at org.joda.time.TestMutableDateTime_Constructors.testConstructor_int_int_int_int_int_int_int_DateTimeZone(TestMutableDateTime_Constructors.java:499)

testConstructor_int_int_int_int_int_int_int_nullDateTimeZone(org.joda.time.TestMutableDateTime_Constructors)  Time elapsed: 0 sec  <<< ERROR!
java.lang.NullPointerException
	at java.util.concurrent.ConcurrentHashMap.hash(ConcurrentHashMap.java:333)
	at java.util.concurrent.ConcurrentHashMap.get(ConcurrentHashMap.java:988)
	at org.joda.time.chrono.ISOChronology.getInstance(ISOChronology.java:27)
	at org.joda.time.base.BaseDateTime.<init>(BaseDateTime.java:227)
	at org.joda.time.MutableDateTime.<init>(MutableDateTime.java:350)
	at org.joda.time.TestMutableDateTime_Constructors.testConstructor_int_int_int_int_int_int_int_nullDateTimeZone(TestMutableDateTime_Constructors.java:535)

testParse_noFormatter(org.joda.time.TestMutableDateTime_Constructors)  Time elapsed: 0.001 sec  <<< FAILURE!
junit.framework.AssertionFailedError: expected:<2010-06-30T01:20:00.000+01:00> but was:<2010-06-30T00:20:00.000+01:00>
	at junit.framework.Assert.fail(Assert.java:47)
	at junit.framework.Assert.failNotEquals(Assert.java:280)
	at junit.framework.Assert.assertEquals(Assert.java:64)
	at junit.framework.Assert.assertEquals(Assert.java:71)
	at org.joda.time.TestMutableDateTime_Constructors.testParse_noFormatter(TestMutableDateTime_Constructors.java:157)

testConstructor_Object_nullDateTimeZone(org.joda.time.TestMutableDateTime_Constructors)  Time elapsed: 0 sec  <<< ERROR!
java.lang.NullPointerException
	at java.util.concurrent.ConcurrentHashMap.hash(ConcurrentHashMap.java:333)
	at java.util.concurrent.ConcurrentHashMap.get(ConcurrentHashMap.java:988)
	at org.joda.time.chrono.ISOChronology.getInstance(ISOChronology.java:27)
	at org.joda.time.convert.AbstractConverter.getChronology(AbstractConverter.java:67)
	at org.joda.time.base.BaseDateTime.<init>(BaseDateTime.java:152)
	at org.joda.time.MutableDateTime.<init>(MutableDateTime.java:279)
	at org.joda.time.TestMutableDateTime_Constructors.testConstructor_Object_nullDateTimeZone(TestMutableDateTime_Constructors.java:363)

testConstructor_nullObject_nullDateTimeZone(org.joda.time.TestMutableDateTime_Constructors)  Time elapsed: 0.001 sec  <<< ERROR!
java.lang.NullPointerException
	at java.util.concurrent.ConcurrentHashMap.hash(ConcurrentHashMap.java:333)
	at java.util.concurrent.ConcurrentHashMap.get(ConcurrentHashMap.java:988)
	at org.joda.time.chrono.ISOChronology.getInstance(ISOChronology.java:27)
	at org.joda.time.convert.AbstractConverter.getChronology(AbstractConverter.java:67)
	at org.joda.time.base.BaseDateTime.<init>(BaseDateTime.java:152)
	at org.joda.time.MutableDateTime.<init>(MutableDateTime.java:279)
	at org.joda.time.TestMutableDateTime_Constructors.testConstructor_nullObject_nullDateTimeZone(TestMutableDateTime_Constructors.java:372)

testConstructor_nullDateTimeZone(org.joda.time.TestMutableDateTime_Constructors)  Time elapsed: 0 sec  <<< ERROR!
java.lang.NullPointerException
	at java.util.concurrent.ConcurrentHashMap.hash(ConcurrentHashMap.java:333)
	at java.util.concurrent.ConcurrentHashMap.get(ConcurrentHashMap.java:988)
	at org.joda.time.chrono.ISOChronology.getInstance(ISOChronology.java:27)
	at org.joda.time.base.BaseDateTime.<init>(BaseDateTime.java:73)
	at org.joda.time.MutableDateTime.<init>(MutableDateTime.java:184)
	at org.joda.time.TestMutableDateTime_Constructors.testConstructor_nullDateTimeZone(TestMutableDateTime_Constructors.java:189)

testConstructor_long_nullDateTimeZone(org.joda.time.TestMutableDateTime_Constructors)  Time elapsed: 0 sec  <<< ERROR!
java.lang.NullPointerException
	at java.util.concurrent.ConcurrentHashMap.hash(ConcurrentHashMap.java:333)
	at java.util.concurrent.ConcurrentHashMap.get(ConcurrentHashMap.java:988)
	at org.joda.time.chrono.ISOChronology.getInstance(ISOChronology.java:27)
	at org.joda.time.base.BaseDateTime.<init>(BaseDateTime.java:110)
	at org.joda.time.MutableDateTime.<init>(MutableDateTime.java:222)
	at org.joda.time.TestMutableDateTime_Constructors.testConstructor_long_nullDateTimeZone(TestMutableDateTime_Constructors.java:253)

testToString(org.joda.time.TestMutableDateTime_Basics)  Time elapsed: 0.001 sec  <<< FAILURE!
junit.framework.ComparisonFailure: expected:<2002-06-09T0[2:00:00.000+02]:00> but was:<2002-06-09T0[1:00:00.000+01]:00>
	at junit.framework.Assert.assertEquals(Assert.java:81)
	at junit.framework.Assert.assertEquals(Assert.java:87)
	at org.joda.time.TestMutableDateTime_Basics.testToString(TestMutableDateTime_Basics.java:411)

testToCalendar_Locale(org.joda.time.TestMutableDateTime_Basics)  Time elapsed: 0.001 sec  <<< FAILURE!
junit.framework.AssertionFailedError: expected:<sun.util.calendar.ZoneInfo[id="Europe/Paris",offset=3600000,dstSavings=3600000,useDaylight=true,transitions=184,lastRule=java.util.SimpleTimeZone[id=Europe/Paris,offset=3600000,dstSavings=3600000,useDaylight=true,startYear=0,startMode=2,startMonth=2,startDay=-1,startDayOfWeek=1,startTime=3600000,startTimeMode=2,endMode=2,endMonth=9,endDay=-1,endDayOfWeek=1,endTime=3600000,endTimeMode=2]]> but was:<sun.util.calendar.ZoneInfo[id="Europe/London",offset=0,dstSavings=3600000,useDaylight=true,transitions=242,lastRule=java.util.SimpleTimeZone[id=Europe/London,offset=0,dstSavings=3600000,useDaylight=true,startYear=0,startMode=2,startMonth=2,startDay=-1,startDayOfWeek=1,startTime=3600000,startTimeMode=2,endMode=2,endMonth=9,endDay=-1,endDayOfWeek=1,endTime=3600000,endTimeMode=2]]>
	at junit.framework.Assert.fail(Assert.java:47)
	at junit.framework.Assert.failNotEquals(Assert.java:280)
	at junit.framework.Assert.assertEquals(Assert.java:64)
	at junit.framework.Assert.assertEquals(Assert.java:71)
	at org.joda.time.TestMutableDateTime_Basics.testToCalendar_Locale(TestMutableDateTime_Basics.java:594)

testToGregorianCalendar(org.joda.time.TestMutableDateTime_Basics)  Time elapsed: 0.001 sec  <<< FAILURE!
junit.framework.AssertionFailedError: expected:<sun.util.calendar.ZoneInfo[id="Europe/Paris",offset=3600000,dstSavings=3600000,useDaylight=true,transitions=184,lastRule=java.util.SimpleTimeZone[id=Europe/Paris,offset=3600000,dstSavings=3600000,useDaylight=true,startYear=0,startMode=2,startMonth=2,startDay=-1,startDayOfWeek=1,startTime=3600000,startTimeMode=2,endMode=2,endMonth=9,endDay=-1,endDayOfWeek=1,endTime=3600000,endTimeMode=2]]> but was:<sun.util.calendar.ZoneInfo[id="Europe/London",offset=0,dstSavings=3600000,useDaylight=true,transitions=242,lastRule=java.util.SimpleTimeZone[id=Europe/London,offset=0,dstSavings=3600000,useDaylight=true,startYear=0,startMode=2,startMonth=2,startDay=-1,startDayOfWeek=1,startTime=3600000,startTimeMode=2,endMode=2,endMonth=9,endDay=-1,endDayOfWeek=1,endTime=3600000,endTimeMode=2]]>
	at junit.framework.Assert.fail(Assert.java:47)
	at junit.framework.Assert.failNotEquals(Assert.java:280)
	at junit.framework.Assert.assertEquals(Assert.java:64)
	at junit.framework.Assert.assertEquals(Assert.java:71)
	at org.joda.time.TestMutableDateTime_Basics.testToGregorianCalendar(TestMutableDateTime_Basics.java:611)

testToDateTime_DateTimeZone(org.joda.time.TestMutableDateTime_Basics)  Time elapsed: 0 sec  <<< FAILURE!
junit.framework.AssertionFailedError: expected:<Europe/Paris> but was:<Europe/London>
	at junit.framework.Assert.fail(Assert.java:47)
	at junit.framework.Assert.failNotEquals(Assert.java:280)
	at junit.framework.Assert.assertEquals(Assert.java:64)
	at junit.framework.Assert.assertEquals(Assert.java:71)
	at org.joda.time.TestMutableDateTime_Basics.testToDateTime_DateTimeZone(TestMutableDateTime_Basics.java:468)

testSetMonthOfYear_int_dstOverlapSummer_addZero(org.joda.time.TestMutableDateTime_Sets)  Time elapsed: 0.001 sec  <<< FAILURE!
junit.framework.ComparisonFailure: expected:<...1-10-30T02:30:00.000[+02:00]> but was:<...1-10-30T02:30:00.000[Z]>
	at junit.framework.Assert.assertEquals(Assert.java:81)
	at junit.framework.Assert.assertEquals(Assert.java:87)
	at org.joda.time.TestMutableDateTime_Sets.testSetMonthOfYear_int_dstOverlapSummer_addZero(TestMutableDateTime_Sets.java:432)

testSetMonthOfYear_int_dstOverlapWinter_addZero(org.joda.time.TestMutableDateTime_Sets)  Time elapsed: 0.001 sec  <<< FAILURE!
junit.framework.ComparisonFailure: expected:<2011-10-30T0[2:30:00.000+01:00]> but was:<2011-10-30T0[3:30:00.000Z]>
	at junit.framework.Assert.assertEquals(Assert.java:81)
	at junit.framework.Assert.assertEquals(Assert.java:87)
	at org.joda.time.TestMutableDateTime_Sets.testSetMonthOfYear_int_dstOverlapWinter_addZero(TestMutableDateTime_Sets.java:440)

testSetDayOfMonth_int_dstOverlapSummer_addZero(org.joda.time.TestMutableDateTime_Sets)  Time elapsed: 0 sec  <<< FAILURE!
junit.framework.ComparisonFailure: expected:<...1-10-30T02:30:00.000[+02:00]> but was:<...1-10-30T02:30:00.000[Z]>
	at junit.framework.Assert.assertEquals(Assert.java:81)
	at junit.framework.Assert.assertEquals(Assert.java:87)
	at org.joda.time.TestMutableDateTime_Sets.testSetDayOfMonth_int_dstOverlapSummer_addZero(TestMutableDateTime_Sets.java:472)

testSetDayOfMonth_int_dstOverlapWinter_addZero(org.joda.time.TestMutableDateTime_Sets)  Time elapsed: 0 sec  <<< FAILURE!
junit.framework.ComparisonFailure: expected:<2011-10-30T0[2:30:00.000+01:00]> but was:<2011-10-30T0[3:30:00.000Z]>
	at junit.framework.Assert.assertEquals(Assert.java:81)
	at junit.framework.Assert.assertEquals(Assert.java:87)
	at org.joda.time.TestMutableDateTime_Sets.testSetDayOfMonth_int_dstOverlapWinter_addZero(TestMutableDateTime_Sets.java:480)

testSetDayOfYear_int_dstOverlapSummer_addZero(org.joda.time.TestMutableDateTime_Sets)  Time elapsed: 0 sec  <<< FAILURE!
junit.framework.ComparisonFailure: expected:<...1-10-30T02:30:00.000[+02:00]> but was:<...1-10-30T02:30:00.000[Z]>
	at junit.framework.Assert.assertEquals(Assert.java:81)
	at junit.framework.Assert.assertEquals(Assert.java:87)
	at org.joda.time.TestMutableDateTime_Sets.testSetDayOfYear_int_dstOverlapSummer_addZero(TestMutableDateTime_Sets.java:494)

testSetDayOfYear_int_dstOverlapWinter_addZero(org.joda.time.TestMutableDateTime_Sets)  Time elapsed: 0 sec  <<< FAILURE!
junit.framework.ComparisonFailure: expected:<2011-10-30T0[2:30:00.000+01:00]> but was:<2011-10-30T0[3:30:00.000Z]>
	at junit.framework.Assert.assertEquals(Assert.java:81)
	at junit.framework.Assert.assertEquals(Assert.java:87)
	at org.joda.time.TestMutableDateTime_Sets.testSetDayOfYear_int_dstOverlapWinter_addZero(TestMutableDateTime_Sets.java:502)

testAddSeconds_int_dstOverlapWinter_addZero(org.joda.time.TestMutableDateTime_Adds)  Time elapsed: 0 sec  <<< FAILURE!
junit.framework.ComparisonFailure: expected:<2011-10-30T0[2:30:00.000+01:00]> but was:<2011-10-30T0[3:30:00.000Z]>
	at junit.framework.Assert.assertEquals(Assert.java:81)
	at junit.framework.Assert.assertEquals(Assert.java:87)
	at org.joda.time.TestMutableDateTime_Adds.testAddSeconds_int_dstOverlapWinter_addZero(TestMutableDateTime_Adds.java:364)

testAddMillis_int_dstOverlapSummer_addZero(org.joda.time.TestMutableDateTime_Adds)  Time elapsed: 0 sec  <<< FAILURE!
junit.framework.ComparisonFailure: expected:<...1-10-30T02:30:00.000[+02:00]> but was:<...1-10-30T02:30:00.000[Z]>
	at junit.framework.Assert.assertEquals(Assert.java:81)
	at junit.framework.Assert.assertEquals(Assert.java:87)
	at org.joda.time.TestMutableDateTime_Adds.testAddMillis_int_dstOverlapSummer_addZero(TestMutableDateTime_Adds.java:378)

testAddMillis_int_dstOverlapWinter_addZero(org.joda.time.TestMutableDateTime_Adds)  Time elapsed: 0 sec  <<< FAILURE!
junit.framework.ComparisonFailure: expected:<2011-10-30T0[2:30:00.000+01:00]> but was:<2011-10-30T0[3:30:00.000Z]>
	at junit.framework.Assert.assertEquals(Assert.java:81)
	at junit.framework.Assert.assertEquals(Assert.java:87)
	at org.joda.time.TestMutableDateTime_Adds.testAddMillis_int_dstOverlapWinter_addZero(TestMutableDateTime_Adds.java:386)

testAddYears_int_dstOverlapSummer_addZero(org.joda.time.TestMutableDateTime_Adds)  Time elapsed: 0.004 sec  <<< FAILURE!
junit.framework.ComparisonFailure: expected:<...1-10-30T02:30:00.000[+02:00]> but was:<...1-10-30T02:30:00.000[Z]>
	at junit.framework.Assert.assertEquals(Assert.java:81)
	at junit.framework.Assert.assertEquals(Assert.java:87)
	at org.joda.time.TestMutableDateTime_Adds.testAddYears_int_dstOverlapSummer_addZero(TestMutableDateTime_Adds.java:217)

testAddYears_int_dstOverlapWinter_addZero(org.joda.time.TestMutableDateTime_Adds)  Time elapsed: 0 sec  <<< FAILURE!
junit.framework.ComparisonFailure: expected:<2011-10-30T0[2:30:00.000+01:00]> but was:<2011-10-30T0[3:30:00.000Z]>
	at junit.framework.Assert.assertEquals(Assert.java:81)
	at junit.framework.Assert.assertEquals(Assert.java:87)
	at org.joda.time.TestMutableDateTime_Adds.testAddYears_int_dstOverlapWinter_addZero(TestMutableDateTime_Adds.java:225)

testAddMonths_int_dstOverlapSummer_addZero(org.joda.time.TestMutableDateTime_Adds)  Time elapsed: 0 sec  <<< FAILURE!
junit.framework.ComparisonFailure: expected:<...1-10-30T02:30:00.000[+02:00]> but was:<...1-10-30T02:30:00.000[Z]>
	at junit.framework.Assert.assertEquals(Assert.java:81)
	at junit.framework.Assert.assertEquals(Assert.java:87)
	at org.joda.time.TestMutableDateTime_Adds.testAddMonths_int_dstOverlapSummer_addZero(TestMutableDateTime_Adds.java:239)

testAddMonths_int_dstOverlapWinter_addZero(org.joda.time.TestMutableDateTime_Adds)  Time elapsed: 0 sec  <<< FAILURE!
junit.framework.ComparisonFailure: expected:<2011-10-30T0[2:30:00.000+01:00]> but was:<2011-10-30T0[3:30:00.000Z]>
	at junit.framework.Assert.assertEquals(Assert.java:81)
	at junit.framework.Assert.assertEquals(Assert.java:87)
	at org.joda.time.TestMutableDateTime_Adds.testAddMonths_int_dstOverlapWinter_addZero(TestMutableDateTime_Adds.java:247)

testAddDays_int_dstOverlapSummer_addZero(org.joda.time.TestMutableDateTime_Adds)  Time elapsed: 0.001 sec  <<< FAILURE!
junit.framework.ComparisonFailure: expected:<...1-10-30T02:30:00.000[+02:00]> but was:<...1-10-30T02:30:00.000[Z]>
	at junit.framework.Assert.assertEquals(Assert.java:81)
	at junit.framework.Assert.assertEquals(Assert.java:87)
	at org.joda.time.TestMutableDateTime_Adds.testAddDays_int_dstOverlapSummer_addZero(TestMutableDateTime_Adds.java:261)

testAddDays_int_dstOverlapWinter_addZero(org.joda.time.TestMutableDateTime_Adds)  Time elapsed: 0.001 sec  <<< FAILURE!
junit.framework.ComparisonFailure: expected:<2011-10-30T0[2:30:00.000+01:00]> but was:<2011-10-30T0[3:30:00.000Z]>
	at junit.framework.Assert.assertEquals(Assert.java:81)
	at junit.framework.Assert.assertEquals(Assert.java:87)
	at org.joda.time.TestMutableDateTime_Adds.testAddDays_int_dstOverlapWinter_addZero(TestMutableDateTime_Adds.java:269)

testAddWeeks_int_dstOverlapSummer_addZero(org.joda.time.TestMutableDateTime_Adds)  Time elapsed: 0.001 sec  <<< FAILURE!
junit.framework.ComparisonFailure: expected:<...1-10-30T02:30:00.000[+02:00]> but was:<...1-10-30T02:30:00.000[Z]>
	at junit.framework.Assert.assertEquals(Assert.java:81)
	at junit.framework.Assert.assertEquals(Assert.java:87)
	at org.joda.time.TestMutableDateTime_Adds.testAddWeeks_int_dstOverlapSummer_addZero(TestMutableDateTime_Adds.java:290)

testAddWeeks_int_dstOverlapWinter_addZero(org.joda.time.TestMutableDateTime_Adds)  Time elapsed: 0.001 sec  <<< FAILURE!
junit.framework.ComparisonFailure: expected:<2011-10-30T0[2:30:00.000+01:00]> but was:<2011-10-30T0[3:30:00.000Z]>
	at junit.framework.Assert.assertEquals(Assert.java:81)
	at junit.framework.Assert.assertEquals(Assert.java:87)
	at org.joda.time.TestMutableDateTime_Adds.testAddWeeks_int_dstOverlapWinter_addZero(TestMutableDateTime_Adds.java:298)

testAddHours_int_dstOverlapSummer_addZero(org.joda.time.TestMutableDateTime_Adds)  Time elapsed: 0.001 sec  <<< FAILURE!
junit.framework.ComparisonFailure: expected:<...1-10-30T02:30:00.000[+02:00]> but was:<...1-10-30T02:30:00.000[Z]>
	at junit.framework.Assert.assertEquals(Assert.java:81)
	at junit.framework.Assert.assertEquals(Assert.java:87)
	at org.joda.time.TestMutableDateTime_Adds.testAddHours_int_dstOverlapSummer_addZero(TestMutableDateTime_Adds.java:312)

testAddHours_int_dstOverlapWinter_addZero(org.joda.time.TestMutableDateTime_Adds)  Time elapsed: 0 sec  <<< FAILURE!
junit.framework.ComparisonFailure: expected:<2011-10-30T0[2:30:00.000+01:00]> but was:<2011-10-30T0[3:30:00.000Z]>
	at junit.framework.Assert.assertEquals(Assert.java:81)
	at junit.framework.Assert.assertEquals(Assert.java:87)
	at org.joda.time.TestMutableDateTime_Adds.testAddHours_int_dstOverlapWinter_addZero(TestMutableDateTime_Adds.java:320)

testAddMinutes_int_dstOverlapSummer_addZero(org.joda.time.TestMutableDateTime_Adds)  Time elapsed: 0 sec  <<< FAILURE!
junit.framework.ComparisonFailure: expected:<...1-10-30T02:30:00.000[+02:00]> but was:<...1-10-30T02:30:00.000[Z]>
	at junit.framework.Assert.assertEquals(Assert.java:81)
	at junit.framework.Assert.assertEquals(Assert.java:87)
	at org.joda.time.TestMutableDateTime_Adds.testAddMinutes_int_dstOverlapSummer_addZero(TestMutableDateTime_Adds.java:334)

testAddMinutes_int_dstOverlapWinter_addZero(org.joda.time.TestMutableDateTime_Adds)  Time elapsed: 0 sec  <<< FAILURE!
junit.framework.ComparisonFailure: expected:<2011-10-30T0[2:30:00.000+01:00]> but was:<2011-10-30T0[3:30:00.000Z]>
	at junit.framework.Assert.assertEquals(Assert.java:81)
	at junit.framework.Assert.assertEquals(Assert.java:87)
	at org.joda.time.TestMutableDateTime_Adds.testAddMinutes_int_dstOverlapWinter_addZero(TestMutableDateTime_Adds.java:342)

testAddSeconds_int_dstOverlapSummer_addZero(org.joda.time.TestMutableDateTime_Adds)  Time elapsed: 0.001 sec  <<< FAILURE!
junit.framework.ComparisonFailure: expected:<...1-10-30T02:30:00.000[+02:00]> but was:<...1-10-30T02:30:00.000[Z]>
	at junit.framework.Assert.assertEquals(Assert.java:81)
	at junit.framework.Assert.assertEquals(Assert.java:87)
	at org.joda.time.TestMutableDateTime_Adds.testAddSeconds_int_dstOverlapSummer_addZero(TestMutableDateTime_Adds.java:356)

testAdd_DurationFieldType_int_dstOverlapSummer_addZero(org.joda.time.TestMutableDateTime_Adds)  Time elapsed: 0.001 sec  <<< FAILURE!
junit.framework.ComparisonFailure: expected:<...1-10-30T02:30:00.000[+02:00]> but was:<...1-10-30T02:30:00.000[Z]>
	at junit.framework.Assert.assertEquals(Assert.java:81)
	at junit.framework.Assert.assertEquals(Assert.java:87)
	at org.joda.time.TestMutableDateTime_Adds.testAdd_DurationFieldType_int_dstOverlapSummer_addZero(TestMutableDateTime_Adds.java:177)

testAdd_DurationFieldType_int_dstOverlapWinter_addZero(org.joda.time.TestMutableDateTime_Adds)  Time elapsed: 0 sec  <<< FAILURE!
junit.framework.ComparisonFailure: expected:<2011-10-30T0[2:30:00.000+01:00]> but was:<2011-10-30T0[3:30:00.000Z]>
	at junit.framework.Assert.assertEquals(Assert.java:81)
	at junit.framework.Assert.assertEquals(Assert.java:87)
	at org.joda.time.TestMutableDateTime_Adds.testAdd_DurationFieldType_int_dstOverlapWinter_addZero(TestMutableDateTime_Adds.java:185)

testConstructor_Object_DateTimeZone(org.joda.time.TestDateMidnight_Constructors)  Time elapsed: 0 sec  <<< FAILURE!
junit.framework.AssertionFailedError: expected:<1017957600000> but was:<1017961200000>
	at junit.framework.Assert.fail(Assert.java:47)
	at junit.framework.Assert.failNotEquals(Assert.java:280)
	at junit.framework.Assert.assertEquals(Assert.java:64)
	at junit.framework.Assert.assertEquals(Assert.java:133)
	at junit.framework.Assert.assertEquals(Assert.java:139)
	at org.joda.time.TestDateMidnight_Constructors.testConstructor_Object_DateTimeZone(TestDateMidnight_Constructors.java:355)

testConstructor_nullObject_DateTimeZone(org.joda.time.TestDateMidnight_Constructors)  Time elapsed: 0 sec  <<< FAILURE!
junit.framework.AssertionFailedError: expected:<1023573600000> but was:<1023577200000>
	at junit.framework.Assert.fail(Assert.java:47)
	at junit.framework.Assert.failNotEquals(Assert.java:280)
	at junit.framework.Assert.assertEquals(Assert.java:64)
	at junit.framework.Assert.assertEquals(Assert.java:133)
	at junit.framework.Assert.assertEquals(Assert.java:139)
	at org.joda.time.TestDateMidnight_Constructors.testConstructor_nullObject_DateTimeZone(TestDateMidnight_Constructors.java:374)

testConstructor_Object_nullDateTimeZone(org.joda.time.TestDateMidnight_Constructors)  Time elapsed: 0 sec  <<< ERROR!
java.lang.NullPointerException
	at java.util.concurrent.ConcurrentHashMap.hash(ConcurrentHashMap.java:333)
	at java.util.concurrent.ConcurrentHashMap.get(ConcurrentHashMap.java:988)
	at org.joda.time.chrono.ISOChronology.getInstance(ISOChronology.java:27)
	at org.joda.time.convert.AbstractConverter.getChronology(AbstractConverter.java:67)
	at org.joda.time.base.BaseDateTime.<init>(BaseDateTime.java:152)
	at org.joda.time.DateMidnight.<init>(DateMidnight.java:281)
	at org.joda.time.TestDateMidnight_Constructors.testConstructor_Object_nullDateTimeZone(TestDateMidnight_Constructors.java:382)

testConstructor_nullObject_nullDateTimeZone(org.joda.time.TestDateMidnight_Constructors)  Time elapsed: 0.001 sec  <<< ERROR!
java.lang.NullPointerException
	at java.util.concurrent.ConcurrentHashMap.hash(ConcurrentHashMap.java:333)
	at java.util.concurrent.ConcurrentHashMap.get(ConcurrentHashMap.java:988)
	at org.joda.time.chrono.ISOChronology.getInstance(ISOChronology.java:27)
	at org.joda.time.convert.AbstractConverter.getChronology(AbstractConverter.java:67)
	at org.joda.time.base.BaseDateTime.<init>(BaseDateTime.java:152)
	at org.joda.time.DateMidnight.<init>(DateMidnight.java:281)
	at org.joda.time.TestDateMidnight_Constructors.testConstructor_nullObject_nullDateTimeZone(TestDateMidnight_Constructors.java:391)

test_now_DateTimeZone(org.joda.time.TestDateMidnight_Constructors)  Time elapsed: 0 sec  <<< FAILURE!
junit.framework.AssertionFailedError: expected:<1023573600000> but was:<1023577200000>
	at junit.framework.Assert.fail(Assert.java:47)
	at junit.framework.Assert.failNotEquals(Assert.java:280)
	at junit.framework.Assert.assertEquals(Assert.java:64)
	at junit.framework.Assert.assertEquals(Assert.java:133)
	at junit.framework.Assert.assertEquals(Assert.java:139)
	at org.joda.time.TestDateMidnight_Constructors.test_now_DateTimeZone(TestDateMidnight_Constructors.java:140)

testConstructor_DateTimeZone(org.joda.time.TestDateMidnight_Constructors)  Time elapsed: 0.001 sec  <<< FAILURE!
junit.framework.AssertionFailedError: expected:<1023573600000> but was:<1023577200000>
	at junit.framework.Assert.fail(Assert.java:47)
	at junit.framework.Assert.failNotEquals(Assert.java:280)
	at junit.framework.Assert.assertEquals(Assert.java:64)
	at junit.framework.Assert.assertEquals(Assert.java:133)
	at junit.framework.Assert.assertEquals(Assert.java:139)
	at org.joda.time.TestDateMidnight_Constructors.testConstructor_DateTimeZone(TestDateMidnight_Constructors.java:201)

testConstructor_nullDateTimeZone(org.joda.time.TestDateMidnight_Constructors)  Time elapsed: 0 sec  <<< ERROR!
java.lang.NullPointerException
	at java.util.concurrent.ConcurrentHashMap.hash(ConcurrentHashMap.java:333)
	at java.util.concurrent.ConcurrentHashMap.get(ConcurrentHashMap.java:988)
	at org.joda.time.chrono.ISOChronology.getInstance(ISOChronology.java:27)
	at org.joda.time.base.BaseDateTime.<init>(BaseDateTime.java:73)
	at org.joda.time.DateMidnight.<init>(DateMidnight.java:178)
	at org.joda.time.TestDateMidnight_Constructors.testConstructor_nullDateTimeZone(TestDateMidnight_Constructors.java:208)

testConstructor_long1_DateTimeZone(org.joda.time.TestDateMidnight_Constructors)  Time elapsed: 0.001 sec  <<< FAILURE!
junit.framework.AssertionFailedError: expected:<1017957600000> but was:<1017961200000>
	at junit.framework.Assert.fail(Assert.java:47)
	at junit.framework.Assert.failNotEquals(Assert.java:280)
	at junit.framework.Assert.assertEquals(Assert.java:64)
	at junit.framework.Assert.assertEquals(Assert.java:133)
	at junit.framework.Assert.assertEquals(Assert.java:139)
	at org.joda.time.TestDateMidnight_Constructors.testConstructor_long1_DateTimeZone(TestDateMidnight_Constructors.java:256)

testConstructor_long2_DateTimeZone(org.joda.time.TestDateMidnight_Constructors)  Time elapsed: 0.004 sec  <<< FAILURE!
junit.framework.AssertionFailedError: expected:<1052172000000> but was:<1052175600000>
	at junit.framework.Assert.fail(Assert.java:47)
	at junit.framework.Assert.failNotEquals(Assert.java:280)
	at junit.framework.Assert.assertEquals(Assert.java:64)
	at junit.framework.Assert.assertEquals(Assert.java:133)
	at junit.framework.Assert.assertEquals(Assert.java:139)
	at org.joda.time.TestDateMidnight_Constructors.testConstructor_long2_DateTimeZone(TestDateMidnight_Constructors.java:265)

testConstructor_long_nullDateTimeZone(org.joda.time.TestDateMidnight_Constructors)  Time elapsed: 0 sec  <<< ERROR!
java.lang.NullPointerException
	at java.util.concurrent.ConcurrentHashMap.hash(ConcurrentHashMap.java:333)
	at java.util.concurrent.ConcurrentHashMap.get(ConcurrentHashMap.java:988)
	at org.joda.time.chrono.ISOChronology.getInstance(ISOChronology.java:27)
	at org.joda.time.base.BaseDateTime.<init>(BaseDateTime.java:110)
	at org.joda.time.DateMidnight.<init>(DateMidnight.java:219)
	at org.joda.time.TestDateMidnight_Constructors.testConstructor_long_nullDateTimeZone(TestDateMidnight_Constructors.java:272)

testConstructor_int_int_int_DateTimeZone(org.joda.time.TestDateMidnight_Constructors)  Time elapsed: 0 sec  <<< FAILURE!
junit.framework.AssertionFailedError: expected:<1023573600000> but was:<1023577200000>
	at junit.framework.Assert.fail(Assert.java:47)
	at junit.framework.Assert.failNotEquals(Assert.java:280)
	at junit.framework.Assert.assertEquals(Assert.java:64)
	at junit.framework.Assert.assertEquals(Assert.java:133)
	at junit.framework.Assert.assertEquals(Assert.java:139)
	at org.joda.time.TestDateMidnight_Constructors.testConstructor_int_int_int_DateTimeZone(TestDateMidnight_Constructors.java:521)

testConstructor_int_int_int_nullDateTimeZone(org.joda.time.TestDateMidnight_Constructors)  Time elapsed: 0 sec  <<< ERROR!
java.lang.NullPointerException
	at java.util.concurrent.ConcurrentHashMap.hash(ConcurrentHashMap.java:333)
	at java.util.concurrent.ConcurrentHashMap.get(ConcurrentHashMap.java:988)
	at org.joda.time.chrono.ISOChronology.getInstance(ISOChronology.java:27)
	at org.joda.time.base.BaseDateTime.<init>(BaseDateTime.java:227)
	at org.joda.time.DateMidnight.<init>(DateMidnight.java:333)
	at org.joda.time.TestDateMidnight_Constructors.testConstructor_int_int_int_nullDateTimeZone(TestDateMidnight_Constructors.java:560)

testToString(org.joda.time.TestDateMidnight_Basics)  Time elapsed: 0.001 sec  <<< FAILURE!
junit.framework.ComparisonFailure: expected:<...06-09T00:00:00.000+0[2]:00> but was:<...06-09T00:00:00.000+0[1]:00>
	at junit.framework.Assert.assertEquals(Assert.java:81)
	at junit.framework.Assert.assertEquals(Assert.java:87)
	at org.joda.time.TestDateMidnight_Basics.testToString(TestDateMidnight_Basics.java:442)

testWithZoneRetainFields_DateTimeZone(org.joda.time.TestDateMidnight_Basics)  Time elapsed: 0.001 sec  <<< FAILURE!
junit.framework.AssertionFailedError: expected:<1017957600000> but was:<1017874800000>
	at junit.framework.Assert.fail(Assert.java:47)
	at junit.framework.Assert.failNotEquals(Assert.java:280)
	at junit.framework.Assert.assertEquals(Assert.java:64)
	at junit.framework.Assert.assertEquals(Assert.java:133)
	at junit.framework.Assert.assertEquals(Assert.java:139)
	at org.joda.time.TestDateMidnight_Basics.testWithZoneRetainFields_DateTimeZone(TestDateMidnight_Basics.java:705)

testToCalendar_Locale(org.joda.time.TestDateMidnight_Basics)  Time elapsed: 0.001 sec  <<< FAILURE!
junit.framework.AssertionFailedError: expected:<sun.util.calendar.ZoneInfo[id="Europe/Paris",offset=3600000,dstSavings=3600000,useDaylight=true,transitions=184,lastRule=java.util.SimpleTimeZone[id=Europe/Paris,offset=3600000,dstSavings=3600000,useDaylight=true,startYear=0,startMode=2,startMonth=2,startDay=-1,startDayOfWeek=1,startTime=3600000,startTimeMode=2,endMode=2,endMonth=9,endDay=-1,endDayOfWeek=1,endTime=3600000,endTimeMode=2]]> but was:<sun.util.calendar.ZoneInfo[id="Europe/London",offset=0,dstSavings=3600000,useDaylight=true,transitions=242,lastRule=java.util.SimpleTimeZone[id=Europe/London,offset=0,dstSavings=3600000,useDaylight=true,startYear=0,startMode=2,startMonth=2,startDay=-1,startDayOfWeek=1,startTime=3600000,startTimeMode=2,endMode=2,endMonth=9,endDay=-1,endDayOfWeek=1,endTime=3600000,endTimeMode=2]]>
	at junit.framework.Assert.fail(Assert.java:47)
	at junit.framework.Assert.failNotEquals(Assert.java:280)
	at junit.framework.Assert.assertEquals(Assert.java:64)
	at junit.framework.Assert.assertEquals(Assert.java:71)
	at org.joda.time.TestDateMidnight_Basics.testToCalendar_Locale(TestDateMidnight_Basics.java:620)

testToGregorianCalendar(org.joda.time.TestDateMidnight_Basics)  Time elapsed: 0 sec  <<< FAILURE!
junit.framework.AssertionFailedError: expected:<sun.util.calendar.ZoneInfo[id="Europe/Paris",offset=3600000,dstSavings=3600000,useDaylight=true,transitions=184,lastRule=java.util.SimpleTimeZone[id=Europe/Paris,offset=3600000,dstSavings=3600000,useDaylight=true,startYear=0,startMode=2,startMonth=2,startDay=-1,startDayOfWeek=1,startTime=3600000,startTimeMode=2,endMode=2,endMonth=9,endDay=-1,endDayOfWeek=1,endTime=3600000,endTimeMode=2]]> but was:<sun.util.calendar.ZoneInfo[id="Europe/London",offset=0,dstSavings=3600000,useDaylight=true,transitions=242,lastRule=java.util.SimpleTimeZone[id=Europe/London,offset=0,dstSavings=3600000,useDaylight=true,startYear=0,startMode=2,startMonth=2,startDay=-1,startDayOfWeek=1,startTime=3600000,startTimeMode=2,endMode=2,endMonth=9,endDay=-1,endDayOfWeek=1,endTime=3600000,endTimeMode=2]]>
	at junit.framework.Assert.fail(Assert.java:47)
	at junit.framework.Assert.failNotEquals(Assert.java:280)
	at junit.framework.Assert.assertEquals(Assert.java:64)
	at junit.framework.Assert.assertEquals(Assert.java:71)
	at org.joda.time.TestDateMidnight_Basics.testToGregorianCalendar(TestDateMidnight_Basics.java:637)

testToDateTime(org.joda.time.TestDateMidnight_Basics)  Time elapsed: 0.001 sec  <<< FAILURE!
junit.framework.AssertionFailedError: expected:<1017957600000> but was:<1017961200000>
	at junit.framework.Assert.fail(Assert.java:47)
	at junit.framework.Assert.failNotEquals(Assert.java:280)
	at junit.framework.Assert.assertEquals(Assert.java:64)
	at junit.framework.Assert.assertEquals(Assert.java:133)
	at junit.framework.Assert.assertEquals(Assert.java:139)
	at org.joda.time.TestDateMidnight_Basics.testToDateTime(TestDateMidnight_Basics.java:480)

testToDateTime_DateTimeZone(org.joda.time.TestDateMidnight_Basics)  Time elapsed: 0 sec  <<< FAILURE!
junit.framework.AssertionFailedError: expected:<Europe/Paris> but was:<Europe/London>
	at junit.framework.Assert.fail(Assert.java:47)
	at junit.framework.Assert.failNotEquals(Assert.java:280)
	at junit.framework.Assert.assertEquals(Assert.java:64)
	at junit.framework.Assert.assertEquals(Assert.java:71)
	at org.joda.time.TestDateMidnight_Basics.testToDateTime_DateTimeZone(TestDateMidnight_Basics.java:504)

testIsEqual(org.joda.time.TestDateMidnight_Basics)  Time elapsed: 0 sec  <<< FAILURE!
junit.framework.AssertionFailedError: expected:<true> but was:<false>
	at junit.framework.Assert.fail(Assert.java:47)
	at junit.framework.Assert.failNotEquals(Assert.java:280)
	at junit.framework.Assert.assertEquals(Assert.java:64)
	at junit.framework.Assert.assertEquals(Assert.java:146)
	at junit.framework.Assert.assertEquals(Assert.java:152)
	at org.joda.time.TestDateMidnight_Basics.testIsEqual(TestDateMidnight_Basics.java:352)

testIsBefore(org.joda.time.TestDateMidnight_Basics)  Time elapsed: 0.002 sec  <<< FAILURE!
junit.framework.AssertionFailedError: expected:<false> but was:<true>
	at junit.framework.Assert.fail(Assert.java:47)
	at junit.framework.Assert.failNotEquals(Assert.java:280)
	at junit.framework.Assert.assertEquals(Assert.java:64)
	at junit.framework.Assert.assertEquals(Assert.java:146)
	at junit.framework.Assert.assertEquals(Assert.java:152)
	at org.joda.time.TestDateMidnight_Basics.testIsBefore(TestDateMidnight_Basics.java:381)

testConstructor_long_long_nullZone(org.joda.time.TestInterval_Constructors)  Time elapsed: 0.001 sec  <<< ERROR!
java.lang.NullPointerException
	at java.util.concurrent.ConcurrentHashMap.hash(ConcurrentHashMap.java:333)
	at java.util.concurrent.ConcurrentHashMap.get(ConcurrentHashMap.java:988)
	at org.joda.time.chrono.ISOChronology.getInstance(ISOChronology.java:27)
	at org.joda.time.Interval.<init>(Interval.java:96)
	at org.joda.time.TestInterval_Constructors.testConstructor_long_long_nullZone(TestInterval_Constructors.java:153)

testToString(org.joda.time.TestInterval_Basics)  Time elapsed: 0 sec  <<< FAILURE!
junit.framework.ComparisonFailure: expected:<...4-06-09T07:08:09.010[Z/2005-08-13T12:14:16.018Z]> but was:<...4-06-09T07:08:09.010[+02:00/2005-08-13T12:14:16.018+02:00]>
	at junit.framework.Assert.assertEquals(Assert.java:81)
	at junit.framework.Assert.assertEquals(Assert.java:87)
	at org.joda.time.TestInterval_Basics.testToString(TestInterval_Basics.java:1046)

testConstructor_Object_DateTimeZone(org.joda.time.TestLocalDateTime_Constructors)  Time elapsed: 0 sec  <<< FAILURE!
junit.framework.AssertionFailedError: expected:<13> but was:<15>
	at junit.framework.Assert.fail(Assert.java:47)
	at junit.framework.Assert.failNotEquals(Assert.java:280)
	at junit.framework.Assert.assertEquals(Assert.java:64)
	at junit.framework.Assert.assertEquals(Assert.java:198)
	at junit.framework.Assert.assertEquals(Assert.java:204)
	at org.joda.time.TestLocalDateTime_Constructors.testConstructor_Object_DateTimeZone(TestLocalDateTime_Constructors.java:506)

testConstructor_nullObject_DateTimeZone(org.joda.time.TestLocalDateTime_Constructors)  Time elapsed: 0.001 sec  <<< FAILURE!
junit.framework.AssertionFailedError: expected:<11> but was:<13>
	at junit.framework.Assert.fail(Assert.java:47)
	at junit.framework.Assert.failNotEquals(Assert.java:280)
	at junit.framework.Assert.assertEquals(Assert.java:64)
	at junit.framework.Assert.assertEquals(Assert.java:198)
	at junit.framework.Assert.assertEquals(Assert.java:204)
	at org.joda.time.TestLocalDateTime_Constructors.testConstructor_nullObject_DateTimeZone(TestLocalDateTime_Constructors.java:546)

testConstructor_Object_nullDateTimeZone(org.joda.time.TestLocalDateTime_Constructors)  Time elapsed: 0 sec  <<< ERROR!
java.lang.NullPointerException
	at java.util.concurrent.ConcurrentHashMap.hash(ConcurrentHashMap.java:333)
	at java.util.concurrent.ConcurrentHashMap.get(ConcurrentHashMap.java:988)
	at org.joda.time.chrono.ISOChronology.getInstance(ISOChronology.java:27)
	at org.joda.time.convert.AbstractConverter.getChronology(AbstractConverter.java:67)
	at org.joda.time.LocalDateTime.<init>(LocalDateTime.java:381)
	at org.joda.time.TestLocalDateTime_Constructors.testConstructor_Object_nullDateTimeZone(TestLocalDateTime_Constructors.java:554)

testConstructor_nullObject_nullDateTimeZone(org.joda.time.TestLocalDateTime_Constructors)  Time elapsed: 0.001 sec  <<< ERROR!
java.lang.NullPointerException
	at java.util.concurrent.ConcurrentHashMap.hash(ConcurrentHashMap.java:333)
	at java.util.concurrent.ConcurrentHashMap.get(ConcurrentHashMap.java:988)
	at org.joda.time.chrono.ISOChronology.getInstance(ISOChronology.java:27)
	at org.joda.time.convert.AbstractConverter.getChronology(AbstractConverter.java:67)
	at org.joda.time.LocalDateTime.<init>(LocalDateTime.java:381)
	at org.joda.time.TestLocalDateTime_Constructors.testConstructor_nullObject_nullDateTimeZone(TestLocalDateTime_Constructors.java:566)

testConstructor_DateTimeZone(org.joda.time.TestLocalDateTime_Constructors)  Time elapsed: 0.001 sec  <<< FAILURE!
junit.framework.AssertionFailedError: expected:<9> but was:<8>
	at junit.framework.Assert.fail(Assert.java:47)
	at junit.framework.Assert.failNotEquals(Assert.java:280)
	at junit.framework.Assert.assertEquals(Assert.java:64)
	at junit.framework.Assert.assertEquals(Assert.java:198)
	at junit.framework.Assert.assertEquals(Assert.java:204)
	at org.joda.time.TestLocalDateTime_Constructors.testConstructor_DateTimeZone(TestLocalDateTime_Constructors.java:208)

testConstructor_nullDateTimeZone(org.joda.time.TestLocalDateTime_Constructors)  Time elapsed: 0 sec  <<< ERROR!
java.lang.NullPointerException
	at java.util.concurrent.ConcurrentHashMap.hash(ConcurrentHashMap.java:333)
	at java.util.concurrent.ConcurrentHashMap.get(ConcurrentHashMap.java:988)
	at org.joda.time.chrono.ISOChronology.getInstance(ISOChronology.java:27)
	at org.joda.time.LocalDateTime.<init>(LocalDateTime.java:278)
	at org.joda.time.TestLocalDateTime_Constructors.testConstructor_nullDateTimeZone(TestLocalDateTime_Constructors.java:217)

testConstructor_long1_DateTimeZone(org.joda.time.TestLocalDateTime_Constructors)  Time elapsed: 0 sec  <<< FAILURE!
junit.framework.AssertionFailedError: expected:<13> but was:<15>
	at junit.framework.Assert.fail(Assert.java:47)
	at junit.framework.Assert.failNotEquals(Assert.java:280)
	at junit.framework.Assert.assertEquals(Assert.java:64)
	at junit.framework.Assert.assertEquals(Assert.java:198)
	at junit.framework.Assert.assertEquals(Assert.java:204)
	at org.joda.time.TestLocalDateTime_Constructors.testConstructor_long1_DateTimeZone(TestLocalDateTime_Constructors.java:286)

testConstructor_long2_DateTimeZone(org.joda.time.TestLocalDateTime_Constructors)  Time elapsed: 0 sec  <<< FAILURE!
junit.framework.AssertionFailedError: expected:<15> but was:<17>
	at junit.framework.Assert.fail(Assert.java:47)
	at junit.framework.Assert.failNotEquals(Assert.java:280)
	at junit.framework.Assert.assertEquals(Assert.java:64)
	at junit.framework.Assert.assertEquals(Assert.java:198)
	at junit.framework.Assert.assertEquals(Assert.java:204)
	at org.joda.time.TestLocalDateTime_Constructors.testConstructor_long2_DateTimeZone(TestLocalDateTime_Constructors.java:298)

testConstructor_long_nullDateTimeZone(org.joda.time.TestLocalDateTime_Constructors)  Time elapsed: 0.001 sec  <<< ERROR!
java.lang.NullPointerException
	at java.util.concurrent.ConcurrentHashMap.hash(ConcurrentHashMap.java:333)
	at java.util.concurrent.ConcurrentHashMap.get(ConcurrentHashMap.java:988)
	at org.joda.time.chrono.ISOChronology.getInstance(ISOChronology.java:27)
	at org.joda.time.LocalDateTime.<init>(LocalDateTime.java:319)
	at org.joda.time.TestLocalDateTime_Constructors.testConstructor_long_nullDateTimeZone(TestLocalDateTime_Constructors.java:305)

testConstructor_Object_DateTimeZoneMoscowBadDateTime(org.joda.time.TestLocalDateTime_Constructors)  Time elapsed: 0.001 sec  <<< ERROR!
org.joda.time.IllegalInstantException: Cannot parse "1981-04-01T00:30:00": Illegal instant due to time zone offset transition (Europe/Moscow)
	at org.joda.time.format.DateTimeParserBucket.computeMillis(DateTimeParserBucket.java:471)
	at org.joda.time.format.DateTimeParserBucket.doParseMillis(DateTimeParserBucket.java:182)
	at org.joda.time.format.DateTimeFormatter.parseMillis(DateTimeFormatter.java:780)
	at org.joda.time.convert.StringConverter.getPartialValues(StringConverter.java:87)
	at org.joda.time.LocalDateTime.<init>(LocalDateTime.java:384)
	at org.joda.time.TestLocalDateTime_Constructors.testConstructor_Object_DateTimeZoneMoscowBadDateTime(TestLocalDateTime_Constructors.java:529)

testConstructor_Object_nullDateTimeZone(org.joda.time.TestLocalDate_Constructors)  Time elapsed: 0.001 sec  <<< ERROR!
java.lang.NullPointerException
	at java.util.concurrent.ConcurrentHashMap.hash(ConcurrentHashMap.java:333)
	at java.util.concurrent.ConcurrentHashMap.get(ConcurrentHashMap.java:988)
	at org.joda.time.chrono.ISOChronology.getInstance(ISOChronology.java:27)
	at org.joda.time.convert.AbstractConverter.getChronology(AbstractConverter.java:67)
	at org.joda.time.LocalDate.<init>(LocalDate.java:386)
	at org.joda.time.TestLocalDate_Constructors.testConstructor_Object_nullDateTimeZone(TestLocalDate_Constructors.java:461)

testConstructor_nullObject_nullDateTimeZone(org.joda.time.TestLocalDate_Constructors)  Time elapsed: 0 sec  <<< ERROR!
java.lang.NullPointerException
	at java.util.concurrent.ConcurrentHashMap.hash(ConcurrentHashMap.java:333)
	at java.util.concurrent.ConcurrentHashMap.get(ConcurrentHashMap.java:988)
	at org.joda.time.chrono.ISOChronology.getInstance(ISOChronology.java:27)
	at org.joda.time.convert.AbstractConverter.getChronology(AbstractConverter.java:67)
	at org.joda.time.LocalDate.<init>(LocalDate.java:386)
	at org.joda.time.TestLocalDate_Constructors.testConstructor_nullObject_nullDateTimeZone(TestLocalDate_Constructors.java:469)

testConstructor_DateTimeZone(org.joda.time.TestLocalDate_Constructors)  Time elapsed: 0 sec  <<< FAILURE!
junit.framework.AssertionFailedError: expected:<9> but was:<8>
	at junit.framework.Assert.fail(Assert.java:47)
	at junit.framework.Assert.failNotEquals(Assert.java:280)
	at junit.framework.Assert.assertEquals(Assert.java:64)
	at junit.framework.Assert.assertEquals(Assert.java:198)
	at junit.framework.Assert.assertEquals(Assert.java:204)
	at org.joda.time.TestLocalDate_Constructors.testConstructor_DateTimeZone(TestLocalDate_Constructors.java:191)

testConstructor_nullDateTimeZone(org.joda.time.TestLocalDate_Constructors)  Time elapsed: 0 sec  <<< ERROR!
java.lang.NullPointerException
	at java.util.concurrent.ConcurrentHashMap.hash(ConcurrentHashMap.java:333)
	at java.util.concurrent.ConcurrentHashMap.get(ConcurrentHashMap.java:988)
	at org.joda.time.chrono.ISOChronology.getInstance(ISOChronology.java:27)
	at org.joda.time.LocalDate.<init>(LocalDate.java:281)
	at org.joda.time.TestLocalDate_Constructors.testConstructor_nullDateTimeZone(TestLocalDate_Constructors.java:200)

testConstructor_long_nullDateTimeZone(org.joda.time.TestLocalDate_Constructors)  Time elapsed: 0 sec  <<< ERROR!
java.lang.NullPointerException
	at java.util.concurrent.ConcurrentHashMap.hash(ConcurrentHashMap.java:333)
	at java.util.concurrent.ConcurrentHashMap.get(ConcurrentHashMap.java:988)
	at org.joda.time.chrono.ISOChronology.getInstance(ISOChronology.java:27)
	at org.joda.time.LocalDate.<init>(LocalDate.java:322)
	at org.joda.time.TestLocalDate_Constructors.testConstructor_long_nullDateTimeZone(TestLocalDate_Constructors.java:283)

testConstructor_long3_DateTimeZone(org.joda.time.TestLocalDate_Constructors)  Time elapsed: 0 sec  <<< FAILURE!
junit.framework.AssertionFailedError: expected:<1149807600000> but was:<1149811200000>
	at junit.framework.Assert.fail(Assert.java:47)
	at junit.framework.Assert.failNotEquals(Assert.java:280)
	at junit.framework.Assert.assertEquals(Assert.java:64)
	at junit.framework.Assert.assertEquals(Assert.java:133)
	at junit.framework.Assert.assertEquals(Assert.java:139)
	at org.joda.time.TestLocalDate_Constructors.testConstructor_long3_DateTimeZone(TestLocalDate_Constructors.java:267)

testConstructor_long4_DateTimeZone(org.joda.time.TestLocalDate_Constructors)  Time elapsed: 0.001 sec  <<< FAILURE!
junit.framework.AssertionFailedError: expected:<1149807600000> but was:<1149811200000>
	at junit.framework.Assert.fail(Assert.java:47)
	at junit.framework.Assert.failNotEquals(Assert.java:280)
	at junit.framework.Assert.assertEquals(Assert.java:64)
	at junit.framework.Assert.assertEquals(Assert.java:133)
	at junit.framework.Assert.assertEquals(Assert.java:139)
	at org.joda.time.TestLocalDate_Constructors.testConstructor_long4_DateTimeZone(TestLocalDate_Constructors.java:279)

testToDateTimeAtStartOfDay_Zone_avoidDST(org.joda.time.TestLocalDate_Basics)  Time elapsed: 0.001 sec  <<< FAILURE!
junit.framework.AssertionFailedError: expected:<2007-04-01T01:00:00.000+01:00> but was:<2007-04-01T00:00:00.000+01:00>
	at junit.framework.Assert.fail(Assert.java:47)
	at junit.framework.Assert.failNotEquals(Assert.java:280)
	at junit.framework.Assert.assertEquals(Assert.java:64)
	at junit.framework.Assert.assertEquals(Assert.java:71)
	at org.joda.time.TestLocalDate_Basics.testToDateTimeAtStartOfDay_Zone_avoidDST(TestLocalDate_Basics.java:694)

testToInterval_Zone_noMidnight(org.joda.time.TestLocalDate_Basics)  Time elapsed: 0 sec  <<< FAILURE!
junit.framework.AssertionFailedError: expected:<2006-04-01T01:00:00.000+01:00/2006-04-02T00:00:00.000+01:00> but was:<2006-04-01T00:00:00.000+01:00/2006-04-02T00:00:00.000+01:00>
	at junit.framework.Assert.fail(Assert.java:47)
	at junit.framework.Assert.failNotEquals(Assert.java:280)
	at junit.framework.Assert.assertEquals(Assert.java:64)
	at junit.framework.Assert.assertEquals(Assert.java:71)
	at org.joda.time.TestLocalDate_Basics.testToInterval_Zone_noMidnight(TestLocalDate_Basics.java:988)

testConstructor_Object_nullDateTimeZone(org.joda.time.TestLocalTime_Constructors)  Time elapsed: 0 sec  <<< ERROR!
java.lang.NullPointerException
	at java.util.concurrent.ConcurrentHashMap.hash(ConcurrentHashMap.java:333)
	at java.util.concurrent.ConcurrentHashMap.get(ConcurrentHashMap.java:988)
	at org.joda.time.chrono.ISOChronology.getInstance(ISOChronology.java:27)
	at org.joda.time.convert.AbstractConverter.getChronology(AbstractConverter.java:67)
	at org.joda.time.LocalTime.<init>(LocalTime.java:406)
	at org.joda.time.TestLocalTime_Constructors.testConstructor_Object_nullDateTimeZone(TestLocalTime_Constructors.java:541)

testConstructor_nullObject_nullDateTimeZone(org.joda.time.TestLocalTime_Constructors)  Time elapsed: 0.001 sec  <<< ERROR!
java.lang.NullPointerException
	at java.util.concurrent.ConcurrentHashMap.hash(ConcurrentHashMap.java:333)
	at java.util.concurrent.ConcurrentHashMap.get(ConcurrentHashMap.java:988)
	at org.joda.time.chrono.ISOChronology.getInstance(ISOChronology.java:27)
	at org.joda.time.convert.AbstractConverter.getChronology(AbstractConverter.java:67)
	at org.joda.time.LocalTime.<init>(LocalTime.java:406)
	at org.joda.time.TestLocalTime_Constructors.testConstructor_nullObject_nullDateTimeZone(TestLocalTime_Constructors.java:550)

testConstructor_DateTimeZone(org.joda.time.TestLocalTime_Constructors)  Time elapsed: 0.001 sec  <<< FAILURE!
junit.framework.AssertionFailedError: expected:<0> but was:<23>
	at junit.framework.Assert.fail(Assert.java:47)
	at junit.framework.Assert.failNotEquals(Assert.java:280)
	at junit.framework.Assert.assertEquals(Assert.java:64)
	at junit.framework.Assert.assertEquals(Assert.java:198)
	at junit.framework.Assert.assertEquals(Assert.java:204)
	at org.joda.time.TestLocalTime_Constructors.testConstructor_DateTimeZone(TestLocalTime_Constructors.java:212)

testConstructor_nullDateTimeZone(org.joda.time.TestLocalTime_Constructors)  Time elapsed: 0 sec  <<< ERROR!
java.lang.NullPointerException
	at java.util.concurrent.ConcurrentHashMap.hash(ConcurrentHashMap.java:333)
	at java.util.concurrent.ConcurrentHashMap.get(ConcurrentHashMap.java:988)
	at org.joda.time.chrono.ISOChronology.getInstance(ISOChronology.java:27)
	at org.joda.time.LocalTime.<init>(LocalTime.java:302)
	at org.joda.time.TestLocalTime_Constructors.testConstructor_nullDateTimeZone(TestLocalTime_Constructors.java:224)

testConstructor_long_nullDateTimeZone(org.joda.time.TestLocalTime_Constructors)  Time elapsed: 0 sec  <<< ERROR!
java.lang.NullPointerException
	at java.util.concurrent.ConcurrentHashMap.hash(ConcurrentHashMap.java:333)
	at java.util.concurrent.ConcurrentHashMap.get(ConcurrentHashMap.java:988)
	at org.joda.time.chrono.ISOChronology.getInstance(ISOChronology.java:27)
	at org.joda.time.LocalTime.<init>(LocalTime.java:343)
	at org.joda.time.TestLocalTime_Constructors.testConstructor_long_nullDateTimeZone(TestLocalTime_Constructors.java:295)

testConstructor_long_DateTimeZone_2(org.joda.time.TestLocalTime_Constructors)  Time elapsed: 0 sec  <<< FAILURE!
junit.framework.AssertionFailedError: expected:<123004> but was:<3723004>
	at junit.framework.Assert.fail(Assert.java:47)
	at junit.framework.Assert.failNotEquals(Assert.java:280)
	at junit.framework.Assert.assertEquals(Assert.java:64)
	at junit.framework.Assert.assertEquals(Assert.java:133)
	at junit.framework.Assert.assertEquals(Assert.java:139)
	at org.joda.time.TestLocalTime_Constructors.testConstructor_long_DateTimeZone_2(TestLocalTime_Constructors.java:291)

testToString(org.joda.time.TestMutableInterval_Basics)  Time elapsed: 0.001 sec  <<< FAILURE!
junit.framework.ComparisonFailure: expected:<...4-06-09T07:08:09.010[Z/2005-08-13T12:14:16.018Z]> but was:<...4-06-09T07:08:09.010[+01:00/2005-08-13T12:14:16.018+01:00]>
	at junit.framework.Assert.assertEquals(Assert.java:81)
	at junit.framework.Assert.assertEquals(Assert.java:87)
	at org.joda.time.TestMutableInterval_Basics.testToString(TestMutableInterval_Basics.java:471)

testConstructor_RI_RI7(org.joda.time.TestPeriod_Constructors)  Time elapsed: 0.001 sec  <<< FAILURE!
junit.framework.AssertionFailedError: expected:<1> but was:<0>
	at junit.framework.Assert.fail(Assert.java:47)
	at junit.framework.Assert.failNotEquals(Assert.java:280)
	at junit.framework.Assert.assertEquals(Assert.java:64)
	at junit.framework.Assert.assertEquals(Assert.java:198)
	at junit.framework.Assert.assertEquals(Assert.java:204)
	at org.joda.time.TestPeriod_Constructors.testConstructor_RI_RI7(TestPeriod_Constructors.java:718)

testConstructor_DateTimeZone(org.joda.time.TestTimeOfDay_Constructors)  Time elapsed: 0 sec  <<< FAILURE!
junit.framework.AssertionFailedError: expected:<0> but was:<23>
	at junit.framework.Assert.fail(Assert.java:47)
	at junit.framework.Assert.failNotEquals(Assert.java:280)
	at junit.framework.Assert.assertEquals(Assert.java:64)
	at junit.framework.Assert.assertEquals(Assert.java:198)
	at junit.framework.Assert.assertEquals(Assert.java:204)
	at org.joda.time.TestTimeOfDay_Constructors.testConstructor_DateTimeZone(TestTimeOfDay_Constructors.java:204)

testConstructor_nullDateTimeZone(org.joda.time.TestTimeOfDay_Constructors)  Time elapsed: 0 sec  <<< ERROR!
java.lang.NullPointerException
	at java.util.concurrent.ConcurrentHashMap.hash(ConcurrentHashMap.java:333)
	at java.util.concurrent.ConcurrentHashMap.get(ConcurrentHashMap.java:988)
	at org.joda.time.chrono.ISOChronology.getInstance(ISOChronology.java:27)
	at org.joda.time.TimeOfDay.<init>(TimeOfDay.java:214)
	at org.joda.time.TestTimeOfDay_Constructors.testConstructor_nullDateTimeZone(TestTimeOfDay_Constructors.java:218)

testConstructor_DateTimeZone(org.joda.time.TestYearMonthDay_Constructors)  Time elapsed: 0.001 sec  <<< FAILURE!
junit.framework.AssertionFailedError: expected:<9> but was:<8>
	at junit.framework.Assert.fail(Assert.java:47)
	at junit.framework.Assert.failNotEquals(Assert.java:280)
	at junit.framework.Assert.assertEquals(Assert.java:64)
	at junit.framework.Assert.assertEquals(Assert.java:198)
	at junit.framework.Assert.assertEquals(Assert.java:204)
	at org.joda.time.TestYearMonthDay_Constructors.testConstructor_DateTimeZone(TestYearMonthDay_Constructors.java:135)

testConstructor_nullDateTimeZone(org.joda.time.TestYearMonthDay_Constructors)  Time elapsed: 0 sec  <<< ERROR!
java.lang.NullPointerException
	at java.util.concurrent.ConcurrentHashMap.hash(ConcurrentHashMap.java:333)
	at java.util.concurrent.ConcurrentHashMap.get(ConcurrentHashMap.java:988)
	at org.joda.time.chrono.ISOChronology.getInstance(ISOChronology.java:27)
	at org.joda.time.YearMonthDay.<init>(YearMonthDay.java:168)
	at org.joda.time.TestYearMonthDay_Constructors.testConstructor_nullDateTimeZone(TestYearMonthDay_Constructors.java:146)

testConstructor_DateTimeZone(org.joda.time.TestYearMonth_Constructors)  Time elapsed: 0 sec  <<< FAILURE!
junit.framework.AssertionFailedError: expected:<7> but was:<6>
	at junit.framework.Assert.fail(Assert.java:47)
	at junit.framework.Assert.failNotEquals(Assert.java:280)
	at junit.framework.Assert.assertEquals(Assert.java:64)
	at junit.framework.Assert.assertEquals(Assert.java:198)
	at junit.framework.Assert.assertEquals(Assert.java:204)
	at org.joda.time.TestYearMonth_Constructors.testConstructor_DateTimeZone(TestYearMonth_Constructors.java:146)

testConstructor_nullDateTimeZone(org.joda.time.TestYearMonth_Constructors)  Time elapsed: 0 sec  <<< ERROR!
java.lang.NullPointerException
	at java.util.concurrent.ConcurrentHashMap.hash(ConcurrentHashMap.java:333)
	at java.util.concurrent.ConcurrentHashMap.get(ConcurrentHashMap.java:988)
	at org.joda.time.chrono.ISOChronology.getInstance(ISOChronology.java:27)
	at org.joda.time.YearMonth.<init>(YearMonth.java:228)
	at org.joda.time.TestYearMonth_Constructors.testConstructor_nullDateTimeZone(TestYearMonth_Constructors.java:158)

testConstructor_DateTimeZone(org.joda.time.TestMonthDay_Constructors)  Time elapsed: 0 sec  <<< FAILURE!
junit.framework.AssertionFailedError: expected:<7> but was:<6>
	at junit.framework.Assert.fail(Assert.java:47)
	at junit.framework.Assert.failNotEquals(Assert.java:280)
	at junit.framework.Assert.assertEquals(Assert.java:64)
	at junit.framework.Assert.assertEquals(Assert.java:198)
	at junit.framework.Assert.assertEquals(Assert.java:204)
	at org.joda.time.TestMonthDay_Constructors.testConstructor_DateTimeZone(TestMonthDay_Constructors.java:145)

testConstructor_nullDateTimeZone(org.joda.time.TestMonthDay_Constructors)  Time elapsed: 0 sec  <<< ERROR!
java.lang.NullPointerException
	at java.util.concurrent.ConcurrentHashMap.hash(ConcurrentHashMap.java:333)
	at java.util.concurrent.ConcurrentHashMap.get(ConcurrentHashMap.java:988)
	at org.joda.time.chrono.ISOChronology.getInstance(ISOChronology.java:27)
	at org.joda.time.MonthDay.<init>(MonthDay.java:236)
	at org.joda.time.TestMonthDay_Constructors.testConstructor_nullDateTimeZone(TestMonthDay_Constructors.java:158)

test_julianDay(org.joda.time.TestDateTimeUtils)  Time elapsed: 0 sec  <<< FAILURE!
junit.framework.AssertionFailedError: expected:<2440587.5> but was:<2440587.4583333335>
	at junit.framework.Assert.fail(Assert.java:47)
	at junit.framework.Assert.failNotEquals(Assert.java:280)
	at junit.framework.Assert.assertEquals(Assert.java:98)
	at junit.framework.Assert.assertEquals(Assert.java:105)
	at org.joda.time.TestDateTimeUtils.test_julianDay(TestDateTimeUtils.java:479)

testIsLocalDateTimeGap_Berlin(org.joda.time.TestDateTimeZone)  Time elapsed: 0.001 sec  <<< FAILURE!
junit.framework.AssertionFailedError: expected:<false> but was:<true>
	at junit.framework.Assert.fail(Assert.java:47)
	at junit.framework.Assert.failNotEquals(Assert.java:280)
	at junit.framework.Assert.assertEquals(Assert.java:64)
	at junit.framework.Assert.assertEquals(Assert.java:146)
	at junit.framework.Assert.assertEquals(Assert.java:152)
	at org.joda.time.TestDateTimeZone.testIsLocalDateTimeGap_Berlin(TestDateTimeZone.java:932)

testIsLocalDateTimeGap_NewYork(org.joda.time.TestDateTimeZone)  Time elapsed: 0.002 sec  <<< FAILURE!
junit.framework.AssertionFailedError: expected:<true> but was:<false>
	at junit.framework.Assert.fail(Assert.java:47)
	at junit.framework.Assert.failNotEquals(Assert.java:280)
	at junit.framework.Assert.assertEquals(Assert.java:64)
	at junit.framework.Assert.assertEquals(Assert.java:146)
	at junit.framework.Assert.assertEquals(Assert.java:152)
	at org.joda.time.TestDateTimeZone.testIsLocalDateTimeGap_NewYork(TestDateTimeZone.java:951)

testCommentParse(org.joda.time.TestDateTimeZone)  Time elapsed: 0.001 sec  <<< FAILURE!
junit.framework.AssertionFailedError: expected:<1115313015000> but was:<1115320215000>
	at junit.framework.Assert.fail(Assert.java:47)
	at junit.framework.Assert.failNotEquals(Assert.java:280)
	at junit.framework.Assert.assertEquals(Assert.java:64)
	at junit.framework.Assert.assertEquals(Assert.java:133)
	at junit.framework.Assert.assertEquals(Assert.java:139)
	at org.joda.time.TestDateTimeZone.testCommentParse(TestDateTimeZone.java:1063)

test_DateTime_roundCeiling_day_NewYork_Spring_postCutover(org.joda.time.TestDateTimeZoneCutover)  Time elapsed: 0.001 sec  <<< FAILURE!
junit.framework.ComparisonFailure: expected:<...7-03-11T03:30:00.000[-04:00]> but was:<...7-03-11T03:30:00.000[Z]>
	at junit.framework.Assert.assertEquals(Assert.java:81)
	at junit.framework.Assert.assertEquals(Assert.java:87)
	at org.joda.time.TestDateTimeZoneCutover.test_DateTime_roundCeiling_day_NewYork_Spring_postCutover(TestDateTimeZoneCutover.java:598)

test_DateTime_roundCeiling_hour_NewYork_Spring_preCutover(org.joda.time.TestDateTimeZoneCutover)  Time elapsed: 0 sec  <<< FAILURE!
junit.framework.ComparisonFailure: expected:<...7-03-11T01:30:00.000[-05:00]> but was:<...7-03-11T01:30:00.000[Z]>
	at junit.framework.Assert.assertEquals(Assert.java:81)
	at junit.framework.Assert.assertEquals(Assert.java:87)
	at org.joda.time.TestDateTimeZoneCutover.test_DateTime_roundCeiling_hour_NewYork_Spring_preCutover(TestDateTimeZoneCutover.java:605)

test_DateTime_roundCeiling_hour_NewYork_Spring_postCutover(org.joda.time.TestDateTimeZoneCutover)  Time elapsed: 0.001 sec  <<< FAILURE!
junit.framework.ComparisonFailure: expected:<...7-03-11T03:30:00.000[-04:00]> but was:<...7-03-11T03:30:00.000[Z]>
	at junit.framework.Assert.assertEquals(Assert.java:81)
	at junit.framework.Assert.assertEquals(Assert.java:87)
	at org.joda.time.TestDateTimeZoneCutover.test_DateTime_roundCeiling_hour_NewYork_Spring_postCutover(TestDateTimeZoneCutover.java:612)

test_DateTime_roundCeiling_minute_NewYork_Spring_preCutover(org.joda.time.TestDateTimeZoneCutover)  Time elapsed: 0.001 sec  <<< FAILURE!
junit.framework.ComparisonFailure: expected:<...7-03-11T01:30:40.000[-05:00]> but was:<...7-03-11T01:30:40.000[Z]>
	at junit.framework.Assert.assertEquals(Assert.java:81)
	at junit.framework.Assert.assertEquals(Assert.java:87)
	at org.joda.time.TestDateTimeZoneCutover.test_DateTime_roundCeiling_minute_NewYork_Spring_preCutover(TestDateTimeZoneCutover.java:619)

test_DateTime_roundCeiling_minute_NewYork_Spring_postCutover(org.joda.time.TestDateTimeZoneCutover)  Time elapsed: 0.001 sec  <<< FAILURE!
junit.framework.ComparisonFailure: expected:<...7-03-11T03:30:40.000[-04:00]> but was:<...7-03-11T03:30:40.000[Z]>
	at junit.framework.Assert.assertEquals(Assert.java:81)
	at junit.framework.Assert.assertEquals(Assert.java:87)
	at org.joda.time.TestDateTimeZoneCutover.test_DateTime_roundCeiling_minute_NewYork_Spring_postCutover(TestDateTimeZoneCutover.java:626)

test_NewYorkIsCorrect_Autumn(org.joda.time.TestDateTimeZoneCutover)  Time elapsed: 0.001 sec  <<< FAILURE!
junit.framework.ComparisonFailure: expected:<2007-11-04T0[1:59:59.999-04:00]> but was:<2007-11-04T0[5:59:59.999Z]>
	at junit.framework.Assert.assertEquals(Assert.java:81)
	at junit.framework.Assert.assertEquals(Assert.java:87)
	at org.joda.time.TestDateTimeZoneCutover.test_NewYorkIsCorrect_Autumn(TestDateTimeZoneCutover.java:638)

test_DateTime_constructor_NewYork_Autumn(org.joda.time.TestDateTimeZoneCutover)  Time elapsed: 0 sec  <<< FAILURE!
junit.framework.ComparisonFailure: expected:<...7-11-04T01:30:00.000[-04:00]> but was:<...7-11-04T01:30:00.000[Z]>
	at junit.framework.Assert.assertEquals(Assert.java:81)
	at junit.framework.Assert.assertEquals(Assert.java:87)
	at org.joda.time.TestDateTimeZoneCutover.test_DateTime_constructor_NewYork_Autumn(TestDateTimeZoneCutover.java:665)

test_DateTime_plusHour_NewYork_Autumn(org.joda.time.TestDateTimeZoneCutover)  Time elapsed: 0.001 sec  <<< FAILURE!
junit.framework.ComparisonFailure: expected:<...7-11-03T18:00:00.000[-04:00]> but was:<...7-11-03T18:00:00.000[Z]>
	at junit.framework.Assert.assertEquals(Assert.java:81)
	at junit.framework.Assert.assertEquals(Assert.java:87)
	at org.joda.time.TestDateTimeZoneCutover.test_DateTime_plusHour_NewYork_Autumn(TestDateTimeZoneCutover.java:670)

test_DateTime_minusHour_NewYork_Autumn(org.joda.time.TestDateTimeZoneCutover)  Time elapsed: 0 sec  <<< FAILURE!
junit.framework.ComparisonFailure: expected:<...7-11-04T08:00:00.000[-05:00]> but was:<...7-11-04T08:00:00.000[Z]>
	at junit.framework.Assert.assertEquals(Assert.java:81)
	at junit.framework.Assert.assertEquals(Assert.java:87)
	at org.joda.time.TestDateTimeZoneCutover.test_DateTime_minusHour_NewYork_Autumn(TestDateTimeZoneCutover.java:684)

test_DateTime_roundFloor_day_NewYork_Autumn_preCutover(org.joda.time.TestDateTimeZoneCutover)  Time elapsed: 0.001 sec  <<< FAILURE!
junit.framework.ComparisonFailure: expected:<...7-11-04T01:30:00.000[-04:00]> but was:<...7-11-04T01:30:00.000[Z]>
	at junit.framework.Assert.assertEquals(Assert.java:81)
	at junit.framework.Assert.assertEquals(Assert.java:87)
	at org.joda.time.TestDateTimeZoneCutover.test_DateTime_roundFloor_day_NewYork_Autumn_preCutover(TestDateTimeZoneCutover.java:699)

test_DateTime_roundFloor_day_NewYork_Autumn_postCutover(org.joda.time.TestDateTimeZoneCutover)  Time elapsed: 0 sec  <<< FAILURE!
junit.framework.ComparisonFailure: expected:<2007-11-04T0[1:30:00.000-05:00]> but was:<2007-11-04T0[2:30:00.000Z]>
	at junit.framework.Assert.assertEquals(Assert.java:81)
	at junit.framework.Assert.assertEquals(Assert.java:87)
	at org.joda.time.TestDateTimeZoneCutover.test_DateTime_roundFloor_day_NewYork_Autumn_postCutover(TestDateTimeZoneCutover.java:706)

test_DateTime_roundFloor_hourOfDay_NewYork_Autumn_preCutover(org.joda.time.TestDateTimeZoneCutover)  Time elapsed: 0.001 sec  <<< FAILURE!
junit.framework.ComparisonFailure: expected:<...7-11-04T01:30:00.000[-04:00]> but was:<...7-11-04T01:30:00.000[Z]>
	at junit.framework.Assert.assertEquals(Assert.java:81)
	at junit.framework.Assert.assertEquals(Assert.java:87)
	at org.joda.time.TestDateTimeZoneCutover.test_DateTime_roundFloor_hourOfDay_NewYork_Autumn_preCutover(TestDateTimeZoneCutover.java:713)

test_DateTime_roundFloor_hourOfDay_NewYork_Autumn_postCutover(org.joda.time.TestDateTimeZoneCutover)  Time elapsed: 0 sec  <<< FAILURE!
junit.framework.ComparisonFailure: expected:<2007-11-04T0[1:30:00.000-05:00]> but was:<2007-11-04T0[2:30:00.000Z]>
	at junit.framework.Assert.assertEquals(Assert.java:81)
	at junit.framework.Assert.assertEquals(Assert.java:87)
	at org.joda.time.TestDateTimeZoneCutover.test_DateTime_roundFloor_hourOfDay_NewYork_Autumn_postCutover(TestDateTimeZoneCutover.java:720)

test_DateTime_roundFloor_minuteOfHour_NewYork_Autumn_preCutover(org.joda.time.TestDateTimeZoneCutover)  Time elapsed: 0.001 sec  <<< FAILURE!
junit.framework.ComparisonFailure: expected:<...7-11-04T01:30:40.000[-04:00]> but was:<...7-11-04T01:30:40.000[Z]>
	at junit.framework.Assert.assertEquals(Assert.java:81)
	at junit.framework.Assert.assertEquals(Assert.java:87)
	at org.joda.time.TestDateTimeZoneCutover.test_DateTime_roundFloor_minuteOfHour_NewYork_Autumn_preCutover(TestDateTimeZoneCutover.java:727)

test_DateTime_roundFloor_minuteOfHour_NewYork_Autumn_postCutover(org.joda.time.TestDateTimeZoneCutover)  Time elapsed: 0 sec  <<< FAILURE!
junit.framework.ComparisonFailure: expected:<2007-11-04T0[1:30:40.000-05:00]> but was:<2007-11-04T0[2:30:40.000Z]>
	at junit.framework.Assert.assertEquals(Assert.java:81)
	at junit.framework.Assert.assertEquals(Assert.java:87)
	at org.joda.time.TestDateTimeZoneCutover.test_DateTime_roundFloor_minuteOfHour_NewYork_Autumn_postCutover(TestDateTimeZoneCutover.java:734)

test_DateTime_roundFloor_secondOfMinute_NewYork_Autumn_preCutover(org.joda.time.TestDateTimeZoneCutover)  Time elapsed: 0 sec  <<< FAILURE!
junit.framework.ComparisonFailure: expected:<...7-11-04T01:30:40.500[-04:00]> but was:<...7-11-04T01:30:40.500[Z]>
	at junit.framework.Assert.assertEquals(Assert.java:81)
	at junit.framework.Assert.assertEquals(Assert.java:87)
	at org.joda.time.TestDateTimeZoneCutover.test_DateTime_roundFloor_secondOfMinute_NewYork_Autumn_preCutover(TestDateTimeZoneCutover.java:741)

test_DateTime_roundFloor_secondOfMinute_NewYork_Autumn_postCutover(org.joda.time.TestDateTimeZoneCutover)  Time elapsed: 0.001 sec  <<< FAILURE!
junit.framework.ComparisonFailure: expected:<2007-11-04T0[1:30:40.500-05:00]> but was:<2007-11-04T0[2:30:40.500Z]>
	at junit.framework.Assert.assertEquals(Assert.java:81)
	at junit.framework.Assert.assertEquals(Assert.java:87)
	at org.joda.time.TestDateTimeZoneCutover.test_DateTime_roundFloor_secondOfMinute_NewYork_Autumn_postCutover(TestDateTimeZoneCutover.java:748)

test_DateTime_roundCeiling_day_NewYork_Autumn_preCutover(org.joda.time.TestDateTimeZoneCutover)  Time elapsed: 0 sec  <<< FAILURE!
junit.framework.ComparisonFailure: expected:<...7-11-04T01:30:00.000[-04:00]> but was:<...7-11-04T01:30:00.000[Z]>
	at junit.framework.Assert.assertEquals(Assert.java:81)
	at junit.framework.Assert.assertEquals(Assert.java:87)
	at org.joda.time.TestDateTimeZoneCutover.test_DateTime_roundCeiling_day_NewYork_Autumn_preCutover(TestDateTimeZoneCutover.java:756)

test_DateTime_roundCeiling_day_NewYork_Autumn_postCutover(org.joda.time.TestDateTimeZoneCutover)  Time elapsed: 0.001 sec  <<< FAILURE!
junit.framework.ComparisonFailure: expected:<2007-11-04T0[1:30:00.000-05:00]> but was:<2007-11-04T0[2:30:00.000Z]>
	at junit.framework.Assert.assertEquals(Assert.java:81)
	at junit.framework.Assert.assertEquals(Assert.java:87)
	at org.joda.time.TestDateTimeZoneCutover.test_DateTime_roundCeiling_day_NewYork_Autumn_postCutover(TestDateTimeZoneCutover.java:763)

test_DateTime_roundCeiling_hourOfDay_NewYork_Autumn_preCutover(org.joda.time.TestDateTimeZoneCutover)  Time elapsed: 0 sec  <<< FAILURE!
junit.framework.ComparisonFailure: expected:<...7-11-04T01:30:00.000[-04:00]> but was:<...7-11-04T01:30:00.000[Z]>
	at junit.framework.Assert.assertEquals(Assert.java:81)
	at junit.framework.Assert.assertEquals(Assert.java:87)
	at org.joda.time.TestDateTimeZoneCutover.test_DateTime_roundCeiling_hourOfDay_NewYork_Autumn_preCutover(TestDateTimeZoneCutover.java:770)

test_DateTime_roundCeiling_hourOfDay_NewYork_Autumn_postCutover(org.joda.time.TestDateTimeZoneCutover)  Time elapsed: 0.001 sec  <<< FAILURE!
junit.framework.ComparisonFailure: expected:<2007-11-04T0[1:30:00.000-05:00]> but was:<2007-11-04T0[2:30:00.000Z]>
	at junit.framework.Assert.assertEquals(Assert.java:81)
	at junit.framework.Assert.assertEquals(Assert.java:87)
	at org.joda.time.TestDateTimeZoneCutover.test_DateTime_roundCeiling_hourOfDay_NewYork_Autumn_postCutover(TestDateTimeZoneCutover.java:777)

test_DateTime_roundCeiling_minuteOfHour_NewYork_Autumn_preCutover(org.joda.time.TestDateTimeZoneCutover)  Time elapsed: 0 sec  <<< FAILURE!
junit.framework.ComparisonFailure: expected:<...7-11-04T01:30:40.000[-04:00]> but was:<...7-11-04T01:30:40.000[Z]>
	at junit.framework.Assert.assertEquals(Assert.java:81)
	at junit.framework.Assert.assertEquals(Assert.java:87)
	at org.joda.time.TestDateTimeZoneCutover.test_DateTime_roundCeiling_minuteOfHour_NewYork_Autumn_preCutover(TestDateTimeZoneCutover.java:784)

test_DateTime_roundCeiling_minuteOfHour_NewYork_Autumn_postCutover(org.joda.time.TestDateTimeZoneCutover)  Time elapsed: 0.001 sec  <<< FAILURE!
junit.framework.ComparisonFailure: expected:<2007-11-04T0[1:30:40.000-05:00]> but was:<2007-11-04T0[2:30:40.000Z]>
	at junit.framework.Assert.assertEquals(Assert.java:81)
	at junit.framework.Assert.assertEquals(Assert.java:87)
	at org.joda.time.TestDateTimeZoneCutover.test_DateTime_roundCeiling_minuteOfHour_NewYork_Autumn_postCutover(TestDateTimeZoneCutover.java:791)

test_DateTime_roundCeiling_secondOfMinute_NewYork_Autumn_preCutover(org.joda.time.TestDateTimeZoneCutover)  Time elapsed: 0 sec  <<< FAILURE!
junit.framework.ComparisonFailure: expected:<...7-11-04T01:30:40.500[-04:00]> but was:<...7-11-04T01:30:40.500[Z]>
	at junit.framework.Assert.assertEquals(Assert.java:81)
	at junit.framework.Assert.assertEquals(Assert.java:87)
	at org.joda.time.TestDateTimeZoneCutover.test_DateTime_roundCeiling_secondOfMinute_NewYork_Autumn_preCutover(TestDateTimeZoneCutover.java:798)

test_DateTime_roundCeiling_secondOfMinute_NewYork_Autumn_postCutover(org.joda.time.TestDateTimeZoneCutover)  Time elapsed: 0.001 sec  <<< FAILURE!
junit.framework.ComparisonFailure: expected:<2007-11-04T0[1:30:40.500-05:00]> but was:<2007-11-04T0[2:30:40.500Z]>
	at junit.framework.Assert.assertEquals(Assert.java:81)
	at junit.framework.Assert.assertEquals(Assert.java:87)
	at org.joda.time.TestDateTimeZoneCutover.test_DateTime_roundCeiling_secondOfMinute_NewYork_Autumn_postCutover(TestDateTimeZoneCutover.java:805)

test_MoscowIsCorrect_Spring(org.joda.time.TestDateTimeZoneCutover)  Time elapsed: 0 sec  <<< FAILURE!
junit.framework.ComparisonFailure: expected:<2007-03-2[5T01:59:59.999+03:00]> but was:<2007-03-2[4T22:59:59.999Z]>
	at junit.framework.Assert.assertEquals(Assert.java:81)
	at junit.framework.Assert.assertEquals(Assert.java:87)
	at org.joda.time.TestDateTimeZoneCutover.test_MoscowIsCorrect_Spring(TestDateTimeZoneCutover.java:822)

test_getOffsetFromLocal_Moscow_Spring(org.joda.time.TestDateTimeZoneCutover)  Time elapsed: 0 sec  <<< ERROR!
org.joda.time.IllegalInstantException: Illegal instant due to time zone offset transition (daylight savings time 'gap'): 2007-03-25T01:00:00.000 (Europe/London)
	at org.joda.time.chrono.ZonedChronology.localToUTC(ZonedChronology.java:143)
	at org.joda.time.chrono.ZonedChronology.getDateTimeMillis(ZonedChronology.java:118)
	at org.joda.time.chrono.AssembledChronology.getDateTimeMillis(AssembledChronology.java:133)
	at org.joda.time.base.BaseDateTime.<init>(BaseDateTime.java:258)
	at org.joda.time.base.BaseDateTime.<init>(BaseDateTime.java:227)
	at org.joda.time.DateTime.<init>(DateTime.java:503)
	at org.joda.time.TestDateTimeZoneCutover.doTest_getOffsetFromLocal(TestDateTimeZoneCutover.java:1367)
	at org.joda.time.TestDateTimeZoneCutover.doTest_getOffsetFromLocal(TestDateTimeZoneCutover.java:1355)
	at org.joda.time.TestDateTimeZoneCutover.test_getOffsetFromLocal_Moscow_Spring(TestDateTimeZoneCutover.java:830)

test_DateTime_setHourAcross_Moscow_Spring(org.joda.time.TestDateTimeZoneCutover)  Time elapsed: 0 sec  <<< FAILURE!
junit.framework.ComparisonFailure: expected:<...7-03-25T00:00:00.000[+03:00]> but was:<...7-03-25T00:00:00.000[Z]>
	at junit.framework.Assert.assertEquals(Assert.java:81)
	at junit.framework.Assert.assertEquals(Assert.java:87)
	at org.joda.time.TestDateTimeZoneCutover.test_DateTime_setHourAcross_Moscow_Spring(TestDateTimeZoneCutover.java:847)

test_DateTime_setHourForward_Moscow_Spring(org.joda.time.TestDateTimeZoneCutover)  Time elapsed: 0 sec  <<< FAILURE!
junit.framework.ComparisonFailure: expected:<...7-03-25T00:00:00.000[+03:00]> but was:<...7-03-25T00:00:00.000[Z]>
	at junit.framework.Assert.assertEquals(Assert.java:81)
	at junit.framework.Assert.assertEquals(Assert.java:87)
	at org.joda.time.TestDateTimeZoneCutover.test_DateTime_setHourForward_Moscow_Spring(TestDateTimeZoneCutover.java:854)

test_DateTime_setHourBack_Moscow_Spring(org.joda.time.TestDateTimeZoneCutover)  Time elapsed: 0.001 sec  <<< FAILURE!
junit.framework.ComparisonFailure: expected:<...03-25T08:00:00.000+0[4]:00> but was:<...03-25T08:00:00.000+0[1]:00>
	at junit.framework.Assert.assertEquals(Assert.java:81)
	at junit.framework.Assert.assertEquals(Assert.java:87)
	at org.joda.time.TestDateTimeZoneCutover.test_DateTime_setHourBack_Moscow_Spring(TestDateTimeZoneCutover.java:866)

test_MoscowIsCorrect_Autumn(org.joda.time.TestDateTimeZoneCutover)  Time elapsed: 0 sec  <<< FAILURE!
junit.framework.ComparisonFailure: expected:<2007-10-2[8T02:59:59.999+04]:00> but was:<2007-10-2[7T23:59:59.999+01]:00>
	at junit.framework.Assert.assertEquals(Assert.java:81)
	at junit.framework.Assert.assertEquals(Assert.java:87)
	at org.joda.time.TestDateTimeZoneCutover.test_MoscowIsCorrect_Autumn(TestDateTimeZoneCutover.java:883)

test_getOffsetFromLocal_Moscow_Autumn(org.joda.time.TestDateTimeZoneCutover)  Time elapsed: 0.001 sec  <<< FAILURE!
junit.framework.ComparisonFailure: 2007-10-27T20:00:00.000+01:00 expected:<2007-10-2[8T00:00:00.000+04]:00> but was:<2007-10-2[7T20:00:00.000+01]:00>
	at junit.framework.Assert.assertEquals(Assert.java:81)
	at org.joda.time.TestDateTimeZoneCutover.doTest_getOffsetFromLocal(TestDateTimeZoneCutover.java:1371)
	at org.joda.time.TestDateTimeZoneCutover.doTest_getOffsetFromLocal(TestDateTimeZoneCutover.java:1355)
	at org.joda.time.TestDateTimeZoneCutover.test_getOffsetFromLocal_Moscow_Autumn(TestDateTimeZoneCutover.java:891)

test_getOffsetFromLocal_Moscow_Autumn_overlap_mins(org.joda.time.TestDateTimeZoneCutover)  Time elapsed: 0 sec  <<< FAILURE!
junit.framework.ComparisonFailure: 2007-10-27T23:00:00.000+01:00 expected:<2007-10-2[8T02:00:00.000+04]:00> but was:<2007-10-2[7T23:00:00.000+01]:00>
	at junit.framework.Assert.assertEquals(Assert.java:81)
	at org.joda.time.TestDateTimeZoneCutover.doTest_getOffsetFromLocal(TestDateTimeZoneCutover.java:1371)
	at org.joda.time.TestDateTimeZoneCutover.doTest_getOffsetFromLocal(TestDateTimeZoneCutover.java:1355)
	at org.joda.time.TestDateTimeZoneCutover.test_getOffsetFromLocal_Moscow_Autumn_overlap_mins(TestDateTimeZoneCutover.java:914)

test_DateTime_constructor_Moscow_Autumn(org.joda.time.TestDateTimeZoneCutover)  Time elapsed: 0.001 sec  <<< FAILURE!
junit.framework.ComparisonFailure: expected:<...7-10-28T02:30:00.000[+04:00]> but was:<...7-10-28T02:30:00.000[Z]>
	at junit.framework.Assert.assertEquals(Assert.java:81)
	at junit.framework.Assert.assertEquals(Assert.java:87)
	at org.joda.time.TestDateTimeZoneCutover.test_DateTime_constructor_Moscow_Autumn(TestDateTimeZoneCutover.java:923)

test_DateTime_plusHour_Moscow_Autumn(org.joda.time.TestDateTimeZoneCutover)  Time elapsed: 0 sec  <<< FAILURE!
junit.framework.ComparisonFailure: expected:<...10-27T19:00:00.000+0[4]:00> but was:<...10-27T19:00:00.000+0[1]:00>
	at junit.framework.Assert.assertEquals(Assert.java:81)
	at junit.framework.Assert.assertEquals(Assert.java:87)
	at org.joda.time.TestDateTimeZoneCutover.test_DateTime_plusHour_Moscow_Autumn(TestDateTimeZoneCutover.java:928)

test_DateTime_minusHour_Moscow_Autumn(org.joda.time.TestDateTimeZoneCutover)  Time elapsed: 0.001 sec  <<< FAILURE!
junit.framework.ComparisonFailure: expected:<...7-10-28T09:00:00.000[+03:00]> but was:<...7-10-28T09:00:00.000[Z]>
	at junit.framework.Assert.assertEquals(Assert.java:81)
	at junit.framework.Assert.assertEquals(Assert.java:87)
	at org.joda.time.TestDateTimeZoneCutover.test_DateTime_minusHour_Moscow_Autumn(TestDateTimeZoneCutover.java:942)

test_GuatemataIsCorrect_Autumn(org.joda.time.TestDateTimeZoneCutover)  Time elapsed: 0 sec  <<< FAILURE!
junit.framework.ComparisonFailure: expected:<2006-[09-30T23:59:59.999-05]:00> but was:<2006-[10-01T05:59:59.999+01]:00>
	at junit.framework.Assert.assertEquals(Assert.java:81)
	at junit.framework.Assert.assertEquals(Assert.java:87)
	at org.joda.time.TestDateTimeZoneCutover.test_GuatemataIsCorrect_Autumn(TestDateTimeZoneCutover.java:964)

test_getOffsetFromLocal_Guatemata_Autumn(org.joda.time.TestDateTimeZoneCutover)  Time elapsed: 0 sec  <<< FAILURE!
junit.framework.ComparisonFailure: 2006-10-01T04:00:00.000+01:00 expected:<2006-[09-30T23:00:00.000-05]:00> but was:<2006-[10-01T04:00:00.000+01]:00>
	at junit.framework.Assert.assertEquals(Assert.java:81)
	at org.joda.time.TestDateTimeZoneCutover.doTest_getOffsetFromLocal(TestDateTimeZoneCutover.java:1371)
	at org.joda.time.TestDateTimeZoneCutover.doTest_getOffsetFromLocal(TestDateTimeZoneCutover.java:1363)
	at org.joda.time.TestDateTimeZoneCutover.test_getOffsetFromLocal_Guatemata_Autumn(TestDateTimeZoneCutover.java:972)

test_DateTime_plusHour_Guatemata_Autumn(org.joda.time.TestDateTimeZoneCutover)  Time elapsed: 0 sec  <<< FAILURE!
junit.framework.ComparisonFailure: expected:<...6-09-30T20:00:00.000[-05]:00> but was:<...6-09-30T20:00:00.000[+01]:00>
	at junit.framework.Assert.assertEquals(Assert.java:81)
	at junit.framework.Assert.assertEquals(Assert.java:87)
	at org.joda.time.TestDateTimeZoneCutover.test_DateTime_plusHour_Guatemata_Autumn(TestDateTimeZoneCutover.java:1014)

test_DateTime_minusHour_Guatemata_Autumn(org.joda.time.TestDateTimeZoneCutover)  Time elapsed: 0 sec  <<< FAILURE!
junit.framework.ComparisonFailure: expected:<...6-10-01T02:00:00.000[-06]:00> but was:<...6-10-01T02:00:00.000[+01]:00>
	at junit.framework.Assert.assertEquals(Assert.java:81)
	at junit.framework.Assert.assertEquals(Assert.java:87)
	at org.joda.time.TestDateTimeZoneCutover.test_DateTime_minusHour_Guatemata_Autumn(TestDateTimeZoneCutover.java:1034)

test_RioBrancoIsCorrect_Spring(org.joda.time.TestDateTimeZoneCutover)  Time elapsed: 0 sec  <<< FAILURE!
junit.framework.ComparisonFailure: expected:<2008-06-2[3T23:59:59.999-05]:00> but was:<2008-06-2[4T05:59:59.999+01]:00>
	at junit.framework.Assert.assertEquals(Assert.java:81)
	at junit.framework.Assert.assertEquals(Assert.java:87)
	at org.joda.time.TestDateTimeZoneCutover.test_RioBrancoIsCorrect_Spring(TestDateTimeZoneCutover.java:1062)

test_getOffsetFromLocal_RioBranco_Spring(org.joda.time.TestDateTimeZoneCutover)  Time elapsed: 0.001 sec  <<< FAILURE!
junit.framework.ComparisonFailure: 2008-06-24T04:00:00.000+01:00 expected:<2008-06-2[3T23:00:00.000-05]:00> but was:<2008-06-2[4T04:00:00.000+01]:00>
	at junit.framework.Assert.assertEquals(Assert.java:81)
	at org.joda.time.TestDateTimeZoneCutover.doTest_getOffsetFromLocal(TestDateTimeZoneCutover.java:1371)
	at org.joda.time.TestDateTimeZoneCutover.doTest_getOffsetFromLocal(TestDateTimeZoneCutover.java:1363)
	at org.joda.time.TestDateTimeZoneCutover.test_getOffsetFromLocal_RioBranco_Spring(TestDateTimeZoneCutover.java:1070)

test_DateTime_JustAfterLastEverOverlap(org.joda.time.TestDateTimeZoneCutover)  Time elapsed: 0.003 sec  <<< FAILURE!
junit.framework.ComparisonFailure: expected:<...8-08-10T00:00:00.000[-03]:00> but was:<...8-08-10T00:00:00.000[+01]:00>
	at junit.framework.Assert.assertEquals(Assert.java:81)
	at junit.framework.Assert.assertEquals(Assert.java:87)
	at org.joda.time.TestDateTimeZoneCutover.test_DateTime_JustAfterLastEverOverlap(TestDateTimeZoneCutover.java:1102)

testWithMinuteOfHourInDstChange_mockZone(org.joda.time.TestDateTimeZoneCutover)  Time elapsed: 0 sec  <<< FAILURE!
junit.framework.ComparisonFailure: expected:<...10-31T01:15:00.000+0[0:3]0> but was:<...10-31T01:15:00.000+0[1:0]0>
	at junit.framework.Assert.assertEquals(Assert.java:81)
	at junit.framework.Assert.assertEquals(Assert.java:87)
	at org.joda.time.TestDateTimeZoneCutover.testWithMinuteOfHourInDstChange_mockZone(TestDateTimeZoneCutover.java:1120)

testWithHourOfDayInDstChange(org.joda.time.TestDateTimeZoneCutover)  Time elapsed: 0.001 sec  <<< FAILURE!
junit.framework.ComparisonFailure: expected:<2010-10-31T0[2:30:10.123+02]:00> but was:<2010-10-31T0[1:30:10.123+01]:00>
	at junit.framework.Assert.assertEquals(Assert.java:81)
	at junit.framework.Assert.assertEquals(Assert.java:87)
	at org.joda.time.TestDateTimeZoneCutover.testWithHourOfDayInDstChange(TestDateTimeZoneCutover.java:1140)

testWithMinuteOfHourInDstChange(org.joda.time.TestDateTimeZoneCutover)  Time elapsed: 0.001 sec  <<< FAILURE!
junit.framework.ComparisonFailure: expected:<2010-10-31T0[2:30:10.123+02]:00> but was:<2010-10-31T0[1:30:10.123+01]:00>
	at junit.framework.Assert.assertEquals(Assert.java:81)
	at junit.framework.Assert.assertEquals(Assert.java:87)
	at org.joda.time.TestDateTimeZoneCutover.testWithMinuteOfHourInDstChange(TestDateTimeZoneCutover.java:1147)

testWithSecondOfMinuteInDstChange(org.joda.time.TestDateTimeZoneCutover)  Time elapsed: 0.001 sec  <<< FAILURE!
junit.framework.ComparisonFailure: expected:<2010-10-31T0[2:30:10.123+02]:00> but was:<2010-10-31T0[1:30:10.123+01]:00>
	at junit.framework.Assert.assertEquals(Assert.java:81)
	at junit.framework.Assert.assertEquals(Assert.java:87)
	at org.joda.time.TestDateTimeZoneCutover.testWithSecondOfMinuteInDstChange(TestDateTimeZoneCutover.java:1154)

testWithMillisOfSecondInDstChange_Paris_summer(org.joda.time.TestDateTimeZoneCutover)  Time elapsed: 0.001 sec  <<< FAILURE!
junit.framework.ComparisonFailure: expected:<2010-10-31T0[2:30:10.123+02]:00> but was:<2010-10-31T0[1:30:10.123+01]:00>
	at junit.framework.Assert.assertEquals(Assert.java:81)
	at junit.framework.Assert.assertEquals(Assert.java:87)
	at org.joda.time.TestDateTimeZoneCutover.testWithMillisOfSecondInDstChange_Paris_summer(TestDateTimeZoneCutover.java:1161)

testWithMillisOfSecondInDstChange_Paris_winter(org.joda.time.TestDateTimeZoneCutover)  Time elapsed: 0.001 sec  <<< FAILURE!
junit.framework.ComparisonFailure: expected:<2010-10-31T0[2:30:10.123+01:00]> but was:<2010-10-31T0[1:30:10.123Z]>
	at junit.framework.Assert.assertEquals(Assert.java:81)
	at junit.framework.Assert.assertEquals(Assert.java:87)
	at org.joda.time.TestDateTimeZoneCutover.testWithMillisOfSecondInDstChange_Paris_winter(TestDateTimeZoneCutover.java:1168)

testWithMillisOfSecondInDstChange_NewYork_summer(org.joda.time.TestDateTimeZoneCutover)  Time elapsed: 0.001 sec  <<< FAILURE!
junit.framework.ComparisonFailure: expected:<2007-11-04T0[1:30:00.123-04:00]> but was:<2007-11-04T0[5:30:00.123Z]>
	at junit.framework.Assert.assertEquals(Assert.java:81)
	at junit.framework.Assert.assertEquals(Assert.java:87)
	at org.joda.time.TestDateTimeZoneCutover.testWithMillisOfSecondInDstChange_NewYork_summer(TestDateTimeZoneCutover.java:1175)

testWithMillisOfSecondInDstChange_NewYork_winter(org.joda.time.TestDateTimeZoneCutover)  Time elapsed: 0.001 sec  <<< FAILURE!
junit.framework.ComparisonFailure: expected:<2007-11-04T0[1:30:00.123-05:00]> but was:<2007-11-04T0[6:30:00.123Z]>
	at junit.framework.Assert.assertEquals(Assert.java:81)
	at junit.framework.Assert.assertEquals(Assert.java:87)
	at org.joda.time.TestDateTimeZoneCutover.testWithMillisOfSecondInDstChange_NewYork_winter(TestDateTimeZoneCutover.java:1182)

testPlusMinutesInDstChange(org.joda.time.TestDateTimeZoneCutover)  Time elapsed: 0.001 sec  <<< FAILURE!
junit.framework.ComparisonFailure: expected:<2010-10-31T0[2:30:10.123+02]:00> but was:<2010-10-31T0[1:30:10.123+01]:00>
	at junit.framework.Assert.assertEquals(Assert.java:81)
	at junit.framework.Assert.assertEquals(Assert.java:87)
	at org.joda.time.TestDateTimeZoneCutover.testPlusMinutesInDstChange(TestDateTimeZoneCutover.java:1189)

testPlusSecondsInDstChange(org.joda.time.TestDateTimeZoneCutover)  Time elapsed: 0.001 sec  <<< FAILURE!
junit.framework.ComparisonFailure: expected:<2010-10-31T0[2:30:10.123+02]:00> but was:<2010-10-31T0[1:30:10.123+01]:00>
	at junit.framework.Assert.assertEquals(Assert.java:81)
	at junit.framework.Assert.assertEquals(Assert.java:87)
	at org.joda.time.TestDateTimeZoneCutover.testPlusSecondsInDstChange(TestDateTimeZoneCutover.java:1196)

testPlusMillisInDstChange(org.joda.time.TestDateTimeZoneCutover)  Time elapsed: 0.001 sec  <<< FAILURE!
junit.framework.ComparisonFailure: expected:<2010-10-31T0[2:30:10.123+02]:00> but was:<2010-10-31T0[1:30:10.123+01]:00>
	at junit.framework.Assert.assertEquals(Assert.java:81)
	at junit.framework.Assert.assertEquals(Assert.java:87)
	at org.joda.time.TestDateTimeZoneCutover.testPlusMillisInDstChange(TestDateTimeZoneCutover.java:1203)

testBug3192457_adjustOffset(org.joda.time.TestDateTimeZoneCutover)  Time elapsed: 0.001 sec  <<< FAILURE!
junit.framework.AssertionFailedError: expected same:<2007-10-28T01:15:00.000Z> was not:<2007-10-28T01:15:00.000+01:00>
	at junit.framework.Assert.fail(Assert.java:47)
	at junit.framework.Assert.failNotSame(Assert.java:276)
	at junit.framework.Assert.assertSame(Assert.java:239)
	at junit.framework.Assert.assertSame(Assert.java:246)
	at org.joda.time.TestDateTimeZoneCutover.testBug3192457_adjustOffset(TestDateTimeZoneCutover.java:1275)

testBug3476684_adjustOffset(org.joda.time.TestDateTimeZoneCutover)  Time elapsed: 0.001 sec  <<< FAILURE!
junit.framework.AssertionFailedError: expected:<2012-02-26T00:15:00.000Z> but was:<2012-02-25T23:15:00.000Z>
	at junit.framework.Assert.fail(Assert.java:47)
	at junit.framework.Assert.failNotEquals(Assert.java:280)
	at junit.framework.Assert.assertEquals(Assert.java:64)
	at junit.framework.Assert.assertEquals(Assert.java:71)
	at org.joda.time.TestDateTimeZoneCutover.testBug3476684_adjustOffset(TestDateTimeZoneCutover.java:1292)

testDateTimeCreation_athens(org.joda.time.TestDateTimeZoneCutover)  Time elapsed: 0.001 sec  <<< FAILURE!
junit.framework.ComparisonFailure: expected:<...1-10-30T03:15:00.000[+03:00]> but was:<...1-10-30T03:15:00.000[Z]>
	at junit.framework.Assert.assertEquals(Assert.java:81)
	at junit.framework.Assert.assertEquals(Assert.java:87)
	at org.joda.time.TestDateTimeZoneCutover.testDateTimeCreation_athens(TestDateTimeZoneCutover.java:1319)

testDateTimeCreation_paris(org.joda.time.TestDateTimeZoneCutover)  Time elapsed: 0 sec  <<< FAILURE!
junit.framework.ComparisonFailure: expected:<...1-10-30T02:15:00.000[+02:00]> but was:<...1-10-30T02:15:00.000[Z]>
	at junit.framework.Assert.assertEquals(Assert.java:81)
	at junit.framework.Assert.assertEquals(Assert.java:87)
	at org.joda.time.TestDateTimeZoneCutover.testDateTimeCreation_paris(TestDateTimeZoneCutover.java:1326)

testDateTimeCreation_newYork(org.joda.time.TestDateTimeZoneCutover)  Time elapsed: 0.001 sec  <<< FAILURE!
junit.framework.ComparisonFailure: expected:<...0-11-07T01:15:00.000[-04:00]> but was:<...0-11-07T01:15:00.000[Z]>
	at junit.framework.Assert.assertEquals(Assert.java:81)
	at junit.framework.Assert.assertEquals(Assert.java:87)
	at org.joda.time.TestDateTimeZoneCutover.testDateTimeCreation_newYork(TestDateTimeZoneCutover.java:1340)

testDateTimeCreation_losAngeles(org.joda.time.TestDateTimeZoneCutover)  Time elapsed: 0.001 sec  <<< FAILURE!
junit.framework.ComparisonFailure: expected:<...0-11-07T01:15:00.000[-07:00]> but was:<...0-11-07T01:15:00.000[Z]>
	at junit.framework.Assert.assertEquals(Assert.java:81)
	at junit.framework.Assert.assertEquals(Assert.java:87)
	at org.joda.time.TestDateTimeZoneCutover.testDateTimeCreation_losAngeles(TestDateTimeZoneCutover.java:1347)

test_getOffsetFromLocal_Gaza(org.joda.time.TestDateTimeZoneCutover)  Time elapsed: 0 sec  <<< FAILURE!
junit.framework.ComparisonFailure: 2007-03-31T21:00:00.000+01:00 expected:<2007-03-31T2[3:00:00.000+02]:00> but was:<2007-03-31T2[1:00:00.000+01]:00>
	at junit.framework.Assert.assertEquals(Assert.java:81)
	at org.joda.time.TestDateTimeZoneCutover.doTest_getOffsetFromLocal_Gaza(TestDateTimeZoneCutover.java:88)
	at org.joda.time.TestDateTimeZoneCutover.test_getOffsetFromLocal_Gaza(TestDateTimeZoneCutover.java:71)

test_DateTime_roundFloor_Gaza(org.joda.time.TestDateTimeZoneCutover)  Time elapsed: 0.001 sec  <<< FAILURE!
junit.framework.ComparisonFailure: expected:<...04-01T08:00:00.000+0[3]:00> but was:<...04-01T08:00:00.000+0[1]:00>
	at junit.framework.Assert.assertEquals(Assert.java:81)
	at junit.framework.Assert.assertEquals(Assert.java:87)
	at org.joda.time.TestDateTimeZoneCutover.test_DateTime_roundFloor_Gaza(TestDateTimeZoneCutover.java:93)

test_DateTime_roundCeiling_Gaza(org.joda.time.TestDateTimeZoneCutover)  Time elapsed: 0 sec  <<< FAILURE!
junit.framework.ComparisonFailure: expected:<...03-31T20:00:00.000+0[2]:00> but was:<...03-31T20:00:00.000+0[1]:00>
	at junit.framework.Assert.assertEquals(Assert.java:81)
	at junit.framework.Assert.assertEquals(Assert.java:87)
	at org.joda.time.TestDateTimeZoneCutover.test_DateTime_roundCeiling_Gaza(TestDateTimeZoneCutover.java:100)

test_DateTime_setHourZero_Gaza(org.joda.time.TestDateTimeZoneCutover)  Time elapsed: 0 sec  <<< FAILURE!
junit.framework.ComparisonFailure: expected:<...04-01T08:00:00.000+0[3]:00> but was:<...04-01T08:00:00.000+0[1]:00>
	at junit.framework.Assert.assertEquals(Assert.java:81)
	at junit.framework.Assert.assertEquals(Assert.java:87)
	at org.joda.time.TestDateTimeZoneCutover.test_DateTime_setHourZero_Gaza(TestDateTimeZoneCutover.java:107)

test_DateTime_withHourZero_Gaza(org.joda.time.TestDateTimeZoneCutover)  Time elapsed: 0.001 sec  <<< FAILURE!
junit.framework.ComparisonFailure: expected:<...04-01T08:00:00.000+0[3]:00> but was:<...04-01T08:00:00.000+0[1]:00>
	at junit.framework.Assert.assertEquals(Assert.java:81)
	at junit.framework.Assert.assertEquals(Assert.java:87)
	at org.joda.time.TestDateTimeZoneCutover.test_DateTime_withHourZero_Gaza(TestDateTimeZoneCutover.java:118)

test_DateTime_withDay_Gaza(org.joda.time.TestDateTimeZoneCutover)  Time elapsed: 0 sec  <<< FAILURE!
junit.framework.ComparisonFailure: expected:<...04-02T00:00:00.000+0[3]:00> but was:<...04-02T00:00:00.000+0[1]:00>
	at junit.framework.Assert.assertEquals(Assert.java:81)
	at junit.framework.Assert.assertEquals(Assert.java:87)
	at org.joda.time.TestDateTimeZoneCutover.test_DateTime_withDay_Gaza(TestDateTimeZoneCutover.java:129)

test_DateTime_withDay_Turk(org.joda.time.TestDateTimeZoneCutover)  Time elapsed: 0 sec  <<< FAILURE!
junit.framework.ComparisonFailure: expected:<...7-04-02T00:00:00.000[-04]:00> but was:<...7-04-02T00:00:00.000[+01]:00>
	at junit.framework.Assert.assertEquals(Assert.java:81)
	at junit.framework.Assert.assertEquals(Assert.java:87)
	at org.joda.time.TestDateTimeZoneCutover.test_DateTime_withDay_Turk(TestDateTimeZoneCutover.java:346)

test_DateTime_minusHour_Turk(org.joda.time.TestDateTimeZoneCutover)  Time elapsed: 0.001 sec  <<< FAILURE!
junit.framework.ComparisonFailure: expected:<...7-04-01T08:00:00.000[-04]:00> but was:<...7-04-01T08:00:00.000[+01]:00>
	at junit.framework.Assert.assertEquals(Assert.java:81)
	at junit.framework.Assert.assertEquals(Assert.java:87)
	at org.joda.time.TestDateTimeZoneCutover.test_DateTime_minusHour_Turk(TestDateTimeZoneCutover.java:353)

test_DateTime_plusHour_Turk(org.joda.time.TestDateTimeZoneCutover)  Time elapsed: 0 sec  <<< FAILURE!
junit.framework.ComparisonFailure: expected:<...7-03-31T16:00:00.000[-05]:00> but was:<...7-03-31T16:00:00.000[+01]:00>
	at junit.framework.Assert.assertEquals(Assert.java:81)
	at junit.framework.Assert.assertEquals(Assert.java:87)
	at org.joda.time.TestDateTimeZoneCutover.test_DateTime_plusHour_Turk(TestDateTimeZoneCutover.java:365)

test_DateTime_minusDay_Turk(org.joda.time.TestDateTimeZoneCutover)  Time elapsed: 0.001 sec  <<< FAILURE!
junit.framework.ComparisonFailure: expected:<...7-04-02T00:00:00.000[-04]:00> but was:<...7-04-02T00:00:00.000[+01]:00>
	at junit.framework.Assert.assertEquals(Assert.java:81)
	at junit.framework.Assert.assertEquals(Assert.java:87)
	at org.joda.time.TestDateTimeZoneCutover.test_DateTime_minusDay_Turk(TestDateTimeZoneCutover.java:377)

test_DateTime_plusDay_Turk(org.joda.time.TestDateTimeZoneCutover)  Time elapsed: 0 sec  <<< FAILURE!
junit.framework.ComparisonFailure: expected:<...7-03-31T00:00:00.000[-05]:00> but was:<...7-03-31T00:00:00.000[+01]:00>
	at junit.framework.Assert.assertEquals(Assert.java:81)
	at junit.framework.Assert.assertEquals(Assert.java:87)
	at org.joda.time.TestDateTimeZoneCutover.test_DateTime_plusDay_Turk(TestDateTimeZoneCutover.java:387)

test_DateTime_plusDayMidGap_Turk(org.joda.time.TestDateTimeZoneCutover)  Time elapsed: 0 sec  <<< FAILURE!
junit.framework.ComparisonFailure: expected:<...7-03-31T00:30:00.000[-05]:00> but was:<...7-03-31T00:30:00.000[+01]:00>
	at junit.framework.Assert.assertEquals(Assert.java:81)
	at junit.framework.Assert.assertEquals(Assert.java:87)
	at org.joda.time.TestDateTimeZoneCutover.test_DateTime_plusDayMidGap_Turk(TestDateTimeZoneCutover.java:397)

test_DateTime_addWrapFieldDay_Turk(org.joda.time.TestDateTimeZoneCutover)  Time elapsed: 0.001 sec  <<< FAILURE!
junit.framework.ComparisonFailure: expected:<...7-04-30T00:00:00.000[-04]:00> but was:<...7-04-30T00:00:00.000[+01]:00>
	at junit.framework.Assert.assertEquals(Assert.java:81)
	at junit.framework.Assert.assertEquals(Assert.java:87)
	at org.joda.time.TestDateTimeZoneCutover.test_DateTime_addWrapFieldDay_Turk(TestDateTimeZoneCutover.java:407)

test_DateTime_withZoneRetainFields_Turk(org.joda.time.TestDateTimeZoneCutover)  Time elapsed: 0 sec  <<< FAILURE!
junit.framework.ComparisonFailure: expected:<...7-04-01T00:00:00.000[Z]> but was:<...7-04-01T00:00:00.000[+01:00]>
	at junit.framework.Assert.assertEquals(Assert.java:81)
	at junit.framework.Assert.assertEquals(Assert.java:87)
	at org.joda.time.TestDateTimeZoneCutover.test_DateTime_withZoneRetainFields_Turk(TestDateTimeZoneCutover.java:417)

test_MutableDateTime_setZoneRetainFields_Turk(org.joda.time.TestDateTimeZoneCutover)  Time elapsed: 0.001 sec  <<< FAILURE!
junit.framework.ComparisonFailure: expected:<...7-04-01T00:00:00.000[Z]> but was:<...7-04-01T00:00:00.000[+01:00]>
	at junit.framework.Assert.assertEquals(Assert.java:81)
	at junit.framework.Assert.assertEquals(Assert.java:87)
	at org.joda.time.TestDateTimeZoneCutover.test_MutableDateTime_setZoneRetainFields_Turk(TestDateTimeZoneCutover.java:425)

test_LocalDate_new_Turk(org.joda.time.TestDateTimeZoneCutover)  Time elapsed: 0 sec  <<< FAILURE!
junit.framework.ComparisonFailure: expected:<2007-0[3-3]1> but was:<2007-0[4-0]1>
	at junit.framework.Assert.assertEquals(Assert.java:81)
	at junit.framework.Assert.assertEquals(Assert.java:87)
	at org.joda.time.TestDateTimeZoneCutover.test_LocalDate_new_Turk(TestDateTimeZoneCutover.java:436)

test_LocalDate_toDateMidnight_Turk(org.joda.time.TestDateTimeZoneCutover)  Time elapsed: 0.001 sec  <<< FAILURE!
junit.framework.AssertionFailedError
	at junit.framework.Assert.fail(Assert.java:47)
	at junit.framework.Assert.fail(Assert.java:53)
	at org.joda.time.TestDateTimeZoneCutover.test_LocalDate_toDateMidnight_Turk(TestDateTimeZoneCutover.java:443)

test_DateTime_new_Turk(org.joda.time.TestDateTimeZoneCutover)  Time elapsed: 0 sec  <<< FAILURE!
junit.framework.AssertionFailedError
	at junit.framework.Assert.fail(Assert.java:47)
	at junit.framework.Assert.fail(Assert.java:53)
	at org.joda.time.TestDateTimeZoneCutover.test_DateTime_new_Turk(TestDateTimeZoneCutover.java:452)

test_DateTime_parse_Turk(org.joda.time.TestDateTimeZoneCutover)  Time elapsed: 0.001 sec  <<< FAILURE!
junit.framework.AssertionFailedError
	at junit.framework.Assert.fail(Assert.java:47)
	at junit.framework.Assert.fail(Assert.java:53)
	at org.joda.time.TestDateTimeZoneCutover.test_DateTime_parse_Turk(TestDateTimeZoneCutover.java:471)

test_NewYorkIsCorrect_Spring(org.joda.time.TestDateTimeZoneCutover)  Time elapsed: 0 sec  <<< FAILURE!
junit.framework.ComparisonFailure: expected:<2007-03-11T0[1:59:59.999-05:00]> but was:<2007-03-11T0[6:59:59.999Z]>
	at junit.framework.Assert.assertEquals(Assert.java:81)
	at junit.framework.Assert.assertEquals(Assert.java:87)
	at org.joda.time.TestDateTimeZoneCutover.test_NewYorkIsCorrect_Spring(TestDateTimeZoneCutover.java:491)

test_getOffsetFromLocal_NewYork_Spring(org.joda.time.TestDateTimeZoneCutover)  Time elapsed: 0.001 sec  <<< FAILURE!
junit.framework.ComparisonFailure: 2007-03-11T06:00:00.000Z expected:<2007-03-11T0[1:00:00.000-05:00]> but was:<2007-03-11T0[6:00:00.000Z]>
	at junit.framework.Assert.assertEquals(Assert.java:81)
	at org.joda.time.TestDateTimeZoneCutover.doTest_getOffsetFromLocal(TestDateTimeZoneCutover.java:1371)
	at org.joda.time.TestDateTimeZoneCutover.doTest_getOffsetFromLocal(TestDateTimeZoneCutover.java:1355)
	at org.joda.time.TestDateTimeZoneCutover.test_getOffsetFromLocal_NewYork_Spring(TestDateTimeZoneCutover.java:499)

test_DateTime_setHourAcross_NewYork_Spring(org.joda.time.TestDateTimeZoneCutover)  Time elapsed: 0 sec  <<< FAILURE!
junit.framework.ComparisonFailure: expected:<...7-03-11T00:00:00.000[-05:00]> but was:<...7-03-11T00:00:00.000[Z]>
	at junit.framework.Assert.assertEquals(Assert.java:81)
	at junit.framework.Assert.assertEquals(Assert.java:87)
	at org.joda.time.TestDateTimeZoneCutover.test_DateTime_setHourAcross_NewYork_Spring(TestDateTimeZoneCutover.java:516)

test_DateTime_setHourForward_NewYork_Spring(org.joda.time.TestDateTimeZoneCutover)  Time elapsed: 0 sec  <<< FAILURE!
junit.framework.ComparisonFailure: expected:<...7-03-11T00:00:00.000[-05:00]> but was:<...7-03-11T00:00:00.000[Z]>
	at junit.framework.Assert.assertEquals(Assert.java:81)
	at junit.framework.Assert.assertEquals(Assert.java:87)
	at org.joda.time.TestDateTimeZoneCutover.test_DateTime_setHourForward_NewYork_Spring(TestDateTimeZoneCutover.java:523)

test_DateTime_setHourBack_NewYork_Spring(org.joda.time.TestDateTimeZoneCutover)  Time elapsed: 0.001 sec  <<< FAILURE!
junit.framework.ComparisonFailure: expected:<...7-03-11T08:00:00.000[-04:00]> but was:<...7-03-11T08:00:00.000[Z]>
	at junit.framework.Assert.assertEquals(Assert.java:81)
	at junit.framework.Assert.assertEquals(Assert.java:87)
	at org.joda.time.TestDateTimeZoneCutover.test_DateTime_setHourBack_NewYork_Spring(TestDateTimeZoneCutover.java:535)

test_DateTime_roundFloor_day_NewYork_Spring_preCutover(org.joda.time.TestDateTimeZoneCutover)  Time elapsed: 0 sec  <<< FAILURE!
junit.framework.ComparisonFailure: expected:<...7-03-11T01:30:00.000[-05:00]> but was:<...7-03-11T01:30:00.000[Z]>
	at junit.framework.Assert.assertEquals(Assert.java:81)
	at junit.framework.Assert.assertEquals(Assert.java:87)
	at org.joda.time.TestDateTimeZoneCutover.test_DateTime_roundFloor_day_NewYork_Spring_preCutover(TestDateTimeZoneCutover.java:548)

test_DateTime_roundFloor_day_NewYork_Spring_postCutover(org.joda.time.TestDateTimeZoneCutover)  Time elapsed: 0.001 sec  <<< FAILURE!
junit.framework.ComparisonFailure: expected:<...7-03-11T03:30:00.000[-04:00]> but was:<...7-03-11T03:30:00.000[Z]>
	at junit.framework.Assert.assertEquals(Assert.java:81)
	at junit.framework.Assert.assertEquals(Assert.java:87)
	at org.joda.time.TestDateTimeZoneCutover.test_DateTime_roundFloor_day_NewYork_Spring_postCutover(TestDateTimeZoneCutover.java:555)

test_DateTime_roundFloor_hour_NewYork_Spring_preCutover(org.joda.time.TestDateTimeZoneCutover)  Time elapsed: 0 sec  <<< FAILURE!
junit.framework.ComparisonFailure: expected:<...7-03-11T01:30:00.000[-05:00]> but was:<...7-03-11T01:30:00.000[Z]>
	at junit.framework.Assert.assertEquals(Assert.java:81)
	at junit.framework.Assert.assertEquals(Assert.java:87)
	at org.joda.time.TestDateTimeZoneCutover.test_DateTime_roundFloor_hour_NewYork_Spring_preCutover(TestDateTimeZoneCutover.java:562)

test_DateTime_roundFloor_hour_NewYork_Spring_postCutover(org.joda.time.TestDateTimeZoneCutover)  Time elapsed: 0.001 sec  <<< FAILURE!
junit.framework.ComparisonFailure: expected:<...7-03-11T03:30:00.000[-04:00]> but was:<...7-03-11T03:30:00.000[Z]>
	at junit.framework.Assert.assertEquals(Assert.java:81)
	at junit.framework.Assert.assertEquals(Assert.java:87)
	at org.joda.time.TestDateTimeZoneCutover.test_DateTime_roundFloor_hour_NewYork_Spring_postCutover(TestDateTimeZoneCutover.java:569)

test_DateTime_roundFloor_minute_NewYork_Spring_preCutover(org.joda.time.TestDateTimeZoneCutover)  Time elapsed: 0 sec  <<< FAILURE!
junit.framework.ComparisonFailure: expected:<...7-03-11T01:30:40.000[-05:00]> but was:<...7-03-11T01:30:40.000[Z]>
	at junit.framework.Assert.assertEquals(Assert.java:81)
	at junit.framework.Assert.assertEquals(Assert.java:87)
	at org.joda.time.TestDateTimeZoneCutover.test_DateTime_roundFloor_minute_NewYork_Spring_preCutover(TestDateTimeZoneCutover.java:576)

test_DateTime_roundFloor_minute_NewYork_Spring_postCutover(org.joda.time.TestDateTimeZoneCutover)  Time elapsed: 0 sec  <<< FAILURE!
junit.framework.ComparisonFailure: expected:<...7-03-11T03:30:40.000[-04:00]> but was:<...7-03-11T03:30:40.000[Z]>
	at junit.framework.Assert.assertEquals(Assert.java:81)
	at junit.framework.Assert.assertEquals(Assert.java:87)
	at org.joda.time.TestDateTimeZoneCutover.test_DateTime_roundFloor_minute_NewYork_Spring_postCutover(TestDateTimeZoneCutover.java:583)

test_DateTime_roundCeiling_day_NewYork_Spring_preCutover(org.joda.time.TestDateTimeZoneCutover)  Time elapsed: 0.001 sec  <<< FAILURE!
junit.framework.ComparisonFailure: expected:<...7-03-11T01:30:00.000[-05:00]> but was:<...7-03-11T01:30:00.000[Z]>
	at junit.framework.Assert.assertEquals(Assert.java:81)
	at junit.framework.Assert.assertEquals(Assert.java:87)
	at org.joda.time.TestDateTimeZoneCutover.test_DateTime_roundCeiling_day_NewYork_Spring_preCutover(TestDateTimeZoneCutover.java:591)

test_getOffsetFromLocal_NewYork_Autumn(org.joda.time.TestDateTimeZoneCutover)  Time elapsed: 0.001 sec  <<< FAILURE!
junit.framework.ComparisonFailure: 2007-11-04T04:00:00.000Z expected:<2007-11-04T0[0:00:00.000-04:00]> but was:<2007-11-04T0[4:00:00.000Z]>
	at junit.framework.Assert.assertEquals(Assert.java:81)
	at org.joda.time.TestDateTimeZoneCutover.doTest_getOffsetFromLocal(TestDateTimeZoneCutover.java:1371)
	at org.joda.time.TestDateTimeZoneCutover.doTest_getOffsetFromLocal(TestDateTimeZoneCutover.java:1355)
	at org.joda.time.TestDateTimeZoneCutover.test_getOffsetFromLocal_NewYork_Autumn(TestDateTimeZoneCutover.java:646)

test_MockGazaIsCorrect(org.joda.time.TestDateTimeZoneCutover)  Time elapsed: 0 sec  <<< FAILURE!
junit.framework.ComparisonFailure: expected:<2007-03-31T2[3:59:59.999+02]:00> but was:<2007-03-31T2[2:59:59.999+01]:00>
	at junit.framework.Assert.assertEquals(Assert.java:81)
	at junit.framework.Assert.assertEquals(Assert.java:87)
	at org.joda.time.TestDateTimeZoneCutover.test_MockGazaIsCorrect(TestDateTimeZoneCutover.java:63)

test_DateTime_minusHour_Gaza(org.joda.time.TestDateTimeZoneCutover)  Time elapsed: 0.001 sec  <<< FAILURE!
junit.framework.ComparisonFailure: expected:<...04-01T08:00:00.000+0[3]:00> but was:<...04-01T08:00:00.000+0[1]:00>
	at junit.framework.Assert.assertEquals(Assert.java:81)
	at junit.framework.Assert.assertEquals(Assert.java:87)
	at org.joda.time.TestDateTimeZoneCutover.test_DateTime_minusHour_Gaza(TestDateTimeZoneCutover.java:136)

test_DateTime_plusHour_Gaza(org.joda.time.TestDateTimeZoneCutover)  Time elapsed: 0.001 sec  <<< FAILURE!
junit.framework.ComparisonFailure: expected:<...03-31T16:00:00.000+0[2]:00> but was:<...03-31T16:00:00.000+0[1]:00>
	at junit.framework.Assert.assertEquals(Assert.java:81)
	at junit.framework.Assert.assertEquals(Assert.java:87)
	at org.joda.time.TestDateTimeZoneCutover.test_DateTime_plusHour_Gaza(TestDateTimeZoneCutover.java:148)

test_DateTime_minusDay_Gaza(org.joda.time.TestDateTimeZoneCutover)  Time elapsed: 0.001 sec  <<< FAILURE!
junit.framework.ComparisonFailure: expected:<...04-02T00:00:00.000+0[3]:00> but was:<...04-02T00:00:00.000+0[1]:00>
	at junit.framework.Assert.assertEquals(Assert.java:81)
	at junit.framework.Assert.assertEquals(Assert.java:87)
	at org.joda.time.TestDateTimeZoneCutover.test_DateTime_minusDay_Gaza(TestDateTimeZoneCutover.java:160)

test_DateTime_plusDay_Gaza(org.joda.time.TestDateTimeZoneCutover)  Time elapsed: 0 sec  <<< FAILURE!
junit.framework.ComparisonFailure: expected:<...03-31T00:00:00.000+0[2]:00> but was:<...03-31T00:00:00.000+0[1]:00>
	at junit.framework.Assert.assertEquals(Assert.java:81)
	at junit.framework.Assert.assertEquals(Assert.java:87)
	at org.joda.time.TestDateTimeZoneCutover.test_DateTime_plusDay_Gaza(TestDateTimeZoneCutover.java:170)

test_DateTime_plusDayMidGap_Gaza(org.joda.time.TestDateTimeZoneCutover)  Time elapsed: 0 sec  <<< FAILURE!
junit.framework.ComparisonFailure: expected:<...03-31T00:30:00.000+0[2]:00> but was:<...03-31T00:30:00.000+0[1]:00>
	at junit.framework.Assert.assertEquals(Assert.java:81)
	at junit.framework.Assert.assertEquals(Assert.java:87)
	at org.joda.time.TestDateTimeZoneCutover.test_DateTime_plusDayMidGap_Gaza(TestDateTimeZoneCutover.java:180)

test_DateTime_addWrapFieldDay_Gaza(org.joda.time.TestDateTimeZoneCutover)  Time elapsed: 0.001 sec  <<< FAILURE!
junit.framework.ComparisonFailure: expected:<...04-30T00:00:00.000+0[3]:00> but was:<...04-30T00:00:00.000+0[1]:00>
	at junit.framework.Assert.assertEquals(Assert.java:81)
	at junit.framework.Assert.assertEquals(Assert.java:87)
	at org.joda.time.TestDateTimeZoneCutover.test_DateTime_addWrapFieldDay_Gaza(TestDateTimeZoneCutover.java:190)

test_DateTime_withZoneRetainFields_Gaza(org.joda.time.TestDateTimeZoneCutover)  Time elapsed: 0.001 sec  <<< FAILURE!
junit.framework.ComparisonFailure: expected:<...7-04-01T00:00:00.000[Z]> but was:<...7-04-01T00:00:00.000[+01:00]>
	at junit.framework.Assert.assertEquals(Assert.java:81)
	at junit.framework.Assert.assertEquals(Assert.java:87)
	at org.joda.time.TestDateTimeZoneCutover.test_DateTime_withZoneRetainFields_Gaza(TestDateTimeZoneCutover.java:200)

test_MutableDateTime_withZoneRetainFields_Gaza(org.joda.time.TestDateTimeZoneCutover)  Time elapsed: 0 sec  <<< FAILURE!
junit.framework.ComparisonFailure: expected:<...7-04-01T00:00:00.000[Z]> but was:<...7-04-01T00:00:00.000[+01:00]>
	at junit.framework.Assert.assertEquals(Assert.java:81)
	at junit.framework.Assert.assertEquals(Assert.java:87)
	at org.joda.time.TestDateTimeZoneCutover.test_MutableDateTime_withZoneRetainFields_Gaza(TestDateTimeZoneCutover.java:208)

test_LocalDate_new_Gaza(org.joda.time.TestDateTimeZoneCutover)  Time elapsed: 0.001 sec  <<< FAILURE!
junit.framework.ComparisonFailure: expected:<2007-0[4-0]1> but was:<2007-0[3-3]1>
	at junit.framework.Assert.assertEquals(Assert.java:81)
	at junit.framework.Assert.assertEquals(Assert.java:87)
	at org.joda.time.TestDateTimeZoneCutover.test_LocalDate_new_Gaza(TestDateTimeZoneCutover.java:216)

test_LocalDate_toDateMidnight_Gaza(org.joda.time.TestDateTimeZoneCutover)  Time elapsed: 0.001 sec  <<< FAILURE!
junit.framework.AssertionFailedError
	at junit.framework.Assert.fail(Assert.java:47)
	at junit.framework.Assert.fail(Assert.java:53)
	at org.joda.time.TestDateTimeZoneCutover.test_LocalDate_toDateMidnight_Gaza(TestDateTimeZoneCutover.java:226)

test_DateTime_new_Gaza(org.joda.time.TestDateTimeZoneCutover)  Time elapsed: 0 sec  <<< FAILURE!
junit.framework.AssertionFailedError
	at junit.framework.Assert.fail(Assert.java:47)
	at junit.framework.Assert.fail(Assert.java:53)
	at org.joda.time.TestDateTimeZoneCutover.test_DateTime_new_Gaza(TestDateTimeZoneCutover.java:235)

test_DateTime_parse_Gaza(org.joda.time.TestDateTimeZoneCutover)  Time elapsed: 0 sec  <<< FAILURE!
junit.framework.AssertionFailedError
	at junit.framework.Assert.fail(Assert.java:47)
	at junit.framework.Assert.fail(Assert.java:53)
	at org.joda.time.TestDateTimeZoneCutover.test_DateTime_parse_Gaza(TestDateTimeZoneCutover.java:255)

test_MockTurkIsCorrect(org.joda.time.TestDateTimeZoneCutover)  Time elapsed: 0.001 sec  <<< FAILURE!
junit.framework.ComparisonFailure: expected:<2007-0[3-31T23:59:59.999-05]:00> but was:<2007-0[4-01T05:59:59.999+01]:00>
	at junit.framework.Assert.assertEquals(Assert.java:81)
	at junit.framework.Assert.assertEquals(Assert.java:87)
	at org.joda.time.TestDateTimeZoneCutover.test_MockTurkIsCorrect(TestDateTimeZoneCutover.java:272)

test_getOffsetFromLocal_Turk(org.joda.time.TestDateTimeZoneCutover)  Time elapsed: 0 sec  <<< FAILURE!
junit.framework.ComparisonFailure: 2007-04-01T04:00:00.000+01:00 expected:<2007-0[3-31T23:00:00.000-05]:00> but was:<2007-0[4-01T04:00:00.000+01]:00>
	at junit.framework.Assert.assertEquals(Assert.java:81)
	at org.joda.time.TestDateTimeZoneCutover.doTest_getOffsetFromLocal_Turk(TestDateTimeZoneCutover.java:298)
	at org.joda.time.TestDateTimeZoneCutover.test_getOffsetFromLocal_Turk(TestDateTimeZoneCutover.java:280)

test_DateTime_roundFloor_Turk(org.joda.time.TestDateTimeZoneCutover)  Time elapsed: 0.001 sec  <<< FAILURE!
junit.framework.ComparisonFailure: expected:<...7-04-01T08:00:00.000[-04]:00> but was:<...7-04-01T08:00:00.000[+01]:00>
	at junit.framework.Assert.assertEquals(Assert.java:81)
	at junit.framework.Assert.assertEquals(Assert.java:87)
	at org.joda.time.TestDateTimeZoneCutover.test_DateTime_roundFloor_Turk(TestDateTimeZoneCutover.java:303)

test_DateTime_roundFloorNotDST_Turk(org.joda.time.TestDateTimeZoneCutover)  Time elapsed: 0 sec  <<< FAILURE!
junit.framework.ComparisonFailure: expected:<...7-04-02T08:00:00.000[-04]:00> but was:<...7-04-02T08:00:00.000[+01]:00>
	at junit.framework.Assert.assertEquals(Assert.java:81)
	at junit.framework.Assert.assertEquals(Assert.java:87)
	at org.joda.time.TestDateTimeZoneCutover.test_DateTime_roundFloorNotDST_Turk(TestDateTimeZoneCutover.java:310)

test_DateTime_roundCeiling_Turk(org.joda.time.TestDateTimeZoneCutover)  Time elapsed: 0.001 sec  <<< FAILURE!
junit.framework.ComparisonFailure: expected:<...7-03-31T20:00:00.000[-05]:00> but was:<...7-03-31T20:00:00.000[+01]:00>
	at junit.framework.Assert.assertEquals(Assert.java:81)
	at junit.framework.Assert.assertEquals(Assert.java:87)
	at org.joda.time.TestDateTimeZoneCutover.test_DateTime_roundCeiling_Turk(TestDateTimeZoneCutover.java:317)

test_DateTime_setHourZero_Turk(org.joda.time.TestDateTimeZoneCutover)  Time elapsed: 0 sec  <<< FAILURE!
junit.framework.ComparisonFailure: expected:<...7-04-01T08:00:00.000[-04]:00> but was:<...7-04-01T08:00:00.000[+01]:00>
	at junit.framework.Assert.assertEquals(Assert.java:81)
	at junit.framework.Assert.assertEquals(Assert.java:87)
	at org.joda.time.TestDateTimeZoneCutover.test_DateTime_setHourZero_Turk(TestDateTimeZoneCutover.java:324)

test_DateTime_withHourZero_Turk(org.joda.time.TestDateTimeZoneCutover)  Time elapsed: 0.001 sec  <<< FAILURE!
junit.framework.ComparisonFailure: expected:<...7-04-01T08:00:00.000[-04]:00> but was:<...7-04-01T08:00:00.000[+01]:00>
	at junit.framework.Assert.assertEquals(Assert.java:81)
	at junit.framework.Assert.assertEquals(Assert.java:87)
	at org.joda.time.TestDateTimeZoneCutover.test_DateTime_withHourZero_Turk(TestDateTimeZoneCutover.java:335)

testDateMidnight(org.joda.time.TestStringConvert)  Time elapsed: 0.004 sec  <<< FAILURE!
junit.framework.ComparisonFailure: expected:<...06-30T00:00:00.000+0[2]:00> but was:<...06-30T00:00:00.000+0[1]:00>
	at junit.framework.Assert.assertEquals(Assert.java:81)
	at junit.framework.Assert.assertEquals(Assert.java:87)
	at org.joda.time.TestStringConvert.testDateMidnight(TestStringConvert.java:56)

testDateTime(org.joda.time.TestStringConvert)  Time elapsed: 0.002 sec  <<< FAILURE!
junit.framework.ComparisonFailure: expected:<...06-30T02:30:50.678+0[2]:00> but was:<...06-30T02:30:50.678+0[1]:00>
	at junit.framework.Assert.assertEquals(Assert.java:81)
	at junit.framework.Assert.assertEquals(Assert.java:87)
	at org.joda.time.TestStringConvert.testDateTime(TestStringConvert.java:63)

testMutableDateTime(org.joda.time.TestStringConvert)  Time elapsed: 0.001 sec  <<< FAILURE!
junit.framework.ComparisonFailure: expected:<...06-30T02:30:50.678+0[2]:00> but was:<...06-30T02:30:50.678+0[1]:00>
	at junit.framework.Assert.assertEquals(Assert.java:81)
	at junit.framework.Assert.assertEquals(Assert.java:87)
	at org.joda.time.TestStringConvert.testMutableDateTime(TestStringConvert.java:70)

testSerializedYearMonthDay(org.joda.time.TestSerialization)  Time elapsed: 0.001 sec  <<< FAILURE!
junit.framework.AssertionFailedError: expected:<2002-06-09> but was:<2002-06-09>
	at junit.framework.Assert.fail(Assert.java:47)
	at junit.framework.Assert.failNotEquals(Assert.java:280)
	at junit.framework.Assert.assertEquals(Assert.java:64)
	at junit.framework.Assert.assertEquals(Assert.java:71)
	at org.joda.time.TestSerialization.loadAndCompare(TestSerialization.java:300)
	at org.joda.time.TestSerialization.testSerializedYearMonthDay(TestSerialization.java:199)

testSerializedTimeOfDay(org.joda.time.TestSerialization)  Time elapsed: 0.001 sec  <<< FAILURE!
junit.framework.AssertionFailedError: expected:<T01:00:00.000> but was:<T01:00:00.000>
	at junit.framework.Assert.fail(Assert.java:47)
	at junit.framework.Assert.failNotEquals(Assert.java:280)
	at junit.framework.Assert.assertEquals(Assert.java:64)
	at junit.framework.Assert.assertEquals(Assert.java:71)
	at org.joda.time.TestSerialization.loadAndCompare(TestSerialization.java:300)
	at org.joda.time.TestSerialization.testSerializedTimeOfDay(TestSerialization.java:206)

testZoneTransition(org.joda.time.TestIllegalFieldValueException)  Time elapsed: 0.001 sec  <<< FAILURE!
junit.framework.AssertionFailedError
	at junit.framework.Assert.fail(Assert.java:47)
	at junit.framework.Assert.fail(Assert.java:53)
	at org.joda.time.TestIllegalFieldValueException.testZoneTransition(TestIllegalFieldValueException.java:198)

testSampleDateWithZone(org.joda.time.chrono.TestCopticChronology)  Time elapsed: 0 sec  <<< FAILURE!
junit.framework.AssertionFailedError: expected:<10> but was:<11>
	at junit.framework.Assert.fail(Assert.java:47)
	at junit.framework.Assert.failNotEquals(Assert.java:280)
	at junit.framework.Assert.assertEquals(Assert.java:64)
	at junit.framework.Assert.assertEquals(Assert.java:198)
	at junit.framework.Assert.assertEquals(Assert.java:204)
	at org.joda.time.chrono.TestCopticChronology.testSampleDateWithZone(TestCopticChronology.java:472)

testSampleDateWithZone(org.joda.time.chrono.TestEthiopicChronology)  Time elapsed: 0.001 sec  <<< FAILURE!
junit.framework.AssertionFailedError: expected:<10> but was:<11>
	at junit.framework.Assert.fail(Assert.java:47)
	at junit.framework.Assert.failNotEquals(Assert.java:280)
	at junit.framework.Assert.assertEquals(Assert.java:64)
	at junit.framework.Assert.assertEquals(Assert.java:198)
	at junit.framework.Assert.assertEquals(Assert.java:204)
	at org.joda.time.chrono.TestEthiopicChronology.testSampleDateWithZone(TestEthiopicChronology.java:472)

testFactory_Zone_RI(org.joda.time.chrono.TestGJChronology)  Time elapsed: 0.001 sec  <<< FAILURE!
junit.framework.AssertionFailedError: expected:<1582-10-15T00:01:15.000Z> but was:<1582-10-15T00:00:00.000Z>
	at junit.framework.Assert.fail(Assert.java:47)
	at junit.framework.Assert.failNotEquals(Assert.java:280)
	at junit.framework.Assert.assertEquals(Assert.java:64)
	at junit.framework.Assert.assertEquals(Assert.java:71)
	at org.joda.time.chrono.TestGJChronology.testFactory_Zone_RI(TestGJChronology.java:138)

testFactory_Zone_RI_int(org.joda.time.chrono.TestGJChronology)  Time elapsed: 0 sec  <<< FAILURE!
junit.framework.AssertionFailedError: expected:<1582-10-15T00:01:15.000Z> but was:<1582-10-15T00:00:00.000Z>
	at junit.framework.Assert.fail(Assert.java:47)
	at junit.framework.Assert.failNotEquals(Assert.java:280)
	at junit.framework.Assert.assertEquals(Assert.java:64)
	at junit.framework.Assert.assertEquals(Assert.java:71)
	at org.joda.time.chrono.TestGJChronology.testFactory_Zone_RI_int(TestGJChronology.java:151)

testSampleDateWithZone(org.joda.time.chrono.TestIslamicChronology)  Time elapsed: 0.001 sec  <<< FAILURE!
junit.framework.AssertionFailedError: expected:<11> but was:<12>
	at junit.framework.Assert.fail(Assert.java:47)
	at junit.framework.Assert.failNotEquals(Assert.java:280)
	at junit.framework.Assert.assertEquals(Assert.java:64)
	at junit.framework.Assert.assertEquals(Assert.java:198)
	at junit.framework.Assert.assertEquals(Assert.java:204)
	at org.joda.time.chrono.TestIslamicChronology.testSampleDateWithZone(TestIslamicChronology.java:601)

testToString(org.joda.time.chrono.TestISOChronology)  Time elapsed: 0.001 sec  <<< FAILURE!
junit.framework.ComparisonFailure: expected:<ISOChronology[[Asia/Tokyo]]> but was:<ISOChronology[[Europe/London]]>
	at junit.framework.Assert.assertEquals(Assert.java:81)
	at junit.framework.Assert.assertEquals(Assert.java:87)
	at org.joda.time.chrono.TestISOChronology.testToString(TestISOChronology.java:139)

testFactory_Zone(org.joda.time.chrono.TestISOChronology)  Time elapsed: 0 sec  <<< FAILURE!
junit.framework.AssertionFailedError: expected:<Asia/Tokyo> but was:<Europe/London>
	at junit.framework.Assert.fail(Assert.java:47)
	at junit.framework.Assert.failNotEquals(Assert.java:280)
	at junit.framework.Assert.assertEquals(Assert.java:64)
	at junit.framework.Assert.assertEquals(Assert.java:71)
	at org.joda.time.chrono.TestISOChronology.testFactory_Zone(TestISOChronology.java:106)

testDurationFields(org.joda.time.chrono.TestISOChronology)  Time elapsed: 0 sec  <<< FAILURE!
junit.framework.AssertionFailedError: expected:<true> but was:<false>
	at junit.framework.Assert.fail(Assert.java:47)
	at junit.framework.Assert.failNotEquals(Assert.java:280)
	at junit.framework.Assert.assertEquals(Assert.java:64)
	at junit.framework.Assert.assertEquals(Assert.java:146)
	at junit.framework.Assert.assertEquals(Assert.java:152)
	at org.joda.time.chrono.TestISOChronology.testDurationFields(TestISOChronology.java:204)

test_lenientChrononolgy_Chicago(org.joda.time.chrono.TestLenientChronology)  Time elapsed: 0 sec  <<< FAILURE!
junit.framework.ComparisonFailure: expected:<2007-03-11T0[3:30:00.000-05:00]> but was:<2007-03-11T0[2:30:00.000Z]>
	at junit.framework.Assert.assertEquals(Assert.java:81)
	at junit.framework.Assert.assertEquals(Assert.java:87)
	at org.joda.time.chrono.TestLenientChronology.test_lenientChrononolgy_Chicago(TestLenientChronology.java:139)

test_lenientChrononolgy_Turk(org.joda.time.chrono.TestLenientChronology)  Time elapsed: 0 sec  <<< FAILURE!
junit.framework.ComparisonFailure: expected:<2007-04-01T0[1:30:00.000-04]:00> but was:<2007-04-01T0[0:30:00.000+01]:00>
	at junit.framework.Assert.assertEquals(Assert.java:81)
	at junit.framework.Assert.assertEquals(Assert.java:87)
	at org.joda.time.chrono.TestLenientChronology.test_lenientChrononolgy_Turk(TestLenientChronology.java:145)

test_strictChrononolgy_Chicago(org.joda.time.chrono.TestLenientChronology)  Time elapsed: 0.001 sec  <<< FAILURE!
junit.framework.AssertionFailedError
	at junit.framework.Assert.fail(Assert.java:47)
	at junit.framework.Assert.fail(Assert.java:53)
	at org.joda.time.chrono.TestLenientChronology.test_strictChrononolgy_Chicago(TestLenientChronology.java:153)

test_isoChrononolgy_Chicago(org.joda.time.chrono.TestLenientChronology)  Time elapsed: 0.001 sec  <<< FAILURE!
junit.framework.AssertionFailedError
	at junit.framework.Assert.fail(Assert.java:47)
	at junit.framework.Assert.fail(Assert.java:53)
	at org.joda.time.chrono.TestLenientChronology.test_isoChrononolgy_Chicago(TestLenientChronology.java:164)

test_MockTurkIsCorrect(org.joda.time.chrono.TestLenientChronology)  Time elapsed: 0 sec  <<< FAILURE!
junit.framework.ComparisonFailure: expected:<2007-0[3-31T23:59:59.999-05]:00> but was:<2007-0[4-01T05:59:59.999+01]:00>
	at junit.framework.Assert.assertEquals(Assert.java:81)
	at junit.framework.Assert.assertEquals(Assert.java:87)
	at org.joda.time.chrono.TestLenientChronology.test_MockTurkIsCorrect(TestLenientChronology.java:128)

testGetChronology_Object_Zone(org.joda.time.convert.TestDateConverter)  Time elapsed: 0 sec  <<< ERROR!
java.lang.NullPointerException

testGetChronology_Object_Zone(org.joda.time.convert.TestLongConverter)  Time elapsed: 0 sec  <<< ERROR!
java.lang.NullPointerException

testGetChronology_Object_Zone(org.joda.time.convert.TestNullConverter)  Time elapsed: 0 sec  <<< ERROR!
java.lang.NullPointerException

testGetInstantMillis_Object(org.joda.time.convert.TestStringConverter)  Time elapsed: 0.001 sec  <<< FAILURE!
junit.framework.AssertionFailedError: expected:<1086780288501> but was:<1086755088501>
	at junit.framework.Assert.fail(Assert.java:47)
	at junit.framework.Assert.failNotEquals(Assert.java:280)
	at junit.framework.Assert.assertEquals(Assert.java:64)
	at junit.framework.Assert.assertEquals(Assert.java:133)
	at junit.framework.Assert.assertEquals(Assert.java:139)
	at org.joda.time.convert.TestStringConverter.testGetInstantMillis_Object(TestStringConverter.java:114)

testGetDateTime3(org.joda.time.convert.TestStringConverter)  Time elapsed: 0.001 sec  <<< FAILURE!
junit.framework.AssertionFailedError: expected:<12> but was:<11>
	at junit.framework.Assert.fail(Assert.java:47)
	at junit.framework.Assert.failNotEquals(Assert.java:280)
	at junit.framework.Assert.assertEquals(Assert.java:64)
	at junit.framework.Assert.assertEquals(Assert.java:198)
	at junit.framework.Assert.assertEquals(Assert.java:204)
	at org.joda.time.convert.TestStringConverter.testGetDateTime3(TestStringConverter.java:245)

testGetDateTime4(org.joda.time.convert.TestStringConverter)  Time elapsed: 0.001 sec  <<< FAILURE!
junit.framework.AssertionFailedError: expected:<Europe/Paris> but was:<Europe/London>
	at junit.framework.Assert.fail(Assert.java:47)
	at junit.framework.Assert.failNotEquals(Assert.java:280)
	at junit.framework.Assert.assertEquals(Assert.java:64)
	at junit.framework.Assert.assertEquals(Assert.java:71)
	at org.joda.time.convert.TestStringConverter.testGetDateTime4(TestStringConverter.java:261)

testGetInstantMillis_Object_Zone(org.joda.time.convert.TestStringConverter)  Time elapsed: 0.005 sec  <<< FAILURE!
junit.framework.AssertionFailedError: expected:<1086780288501> but was:<1086776688501>
	at junit.framework.Assert.fail(Assert.java:47)
	at junit.framework.Assert.failNotEquals(Assert.java:280)
	at junit.framework.Assert.assertEquals(Assert.java:64)
	at junit.framework.Assert.assertEquals(Assert.java:133)
	at junit.framework.Assert.assertEquals(Assert.java:139)
	at org.joda.time.convert.TestStringConverter.testGetInstantMillis_Object_Zone(TestStringConverter.java:158)

testGetChronology_Object_Zone(org.joda.time.convert.TestStringConverter)  Time elapsed: 0 sec  <<< ERROR!
java.lang.NullPointerException

testSetIntoInterval_Object_Chronology4(org.joda.time.convert.TestStringConverter)  Time elapsed: 0.001 sec  <<< FAILURE!
junit.framework.AssertionFailedError: expected:<2004-06-09T00:00:00.000+01:00> but was:<2004-06-08T19:00:00.000+01:00>
	at junit.framework.Assert.fail(Assert.java:47)
	at junit.framework.Assert.failNotEquals(Assert.java:280)
	at junit.framework.Assert.assertEquals(Assert.java:64)
	at junit.framework.Assert.assertEquals(Assert.java:71)
	at org.joda.time.convert.TestStringConverter.testSetIntoInterval_Object_Chronology4(TestStringConverter.java:501)

testSetIntoInterval_Object_Chronology5(org.joda.time.convert.TestStringConverter)  Time elapsed: 0 sec  <<< FAILURE!
junit.framework.AssertionFailedError: expected:<2003-04-09T00:00:00.000+01:00> but was:<2003-04-08T19:00:00.000+01:00>
	at junit.framework.Assert.fail(Assert.java:47)
	at junit.framework.Assert.failNotEquals(Assert.java:280)
	at junit.framework.Assert.assertEquals(Assert.java:64)
	at junit.framework.Assert.assertEquals(Assert.java:71)
	at org.joda.time.convert.TestStringConverter.testSetIntoInterval_Object_Chronology5(TestStringConverter.java:509)

testSetIntoInterval_Object_Chronology6(org.joda.time.convert.TestStringConverter)  Time elapsed: 0.001 sec  <<< FAILURE!
junit.framework.AssertionFailedError: expected:<2003-08-09T00:00:00.000+01:00> but was:<2003-08-08T19:00:00.000+01:00>
	at junit.framework.Assert.fail(Assert.java:47)
	at junit.framework.Assert.failNotEquals(Assert.java:280)
	at junit.framework.Assert.assertEquals(Assert.java:64)
	at junit.framework.Assert.assertEquals(Assert.java:71)
	at org.joda.time.convert.TestStringConverter.testSetIntoInterval_Object_Chronology6(TestStringConverter.java:517)

testParseMutableDateTime_offsetParsed(org.joda.time.format.TestDateTimeFormatter)  Time elapsed: 0.001 sec  <<< FAILURE!
junit.framework.AssertionFailedError: expected:<2004-06-09T10:20:30.000+01:00> but was:<2004-06-09T11:20:30.000+01:00>
	at junit.framework.Assert.fail(Assert.java:47)
	at junit.framework.Assert.failNotEquals(Assert.java:280)
	at junit.framework.Assert.assertEquals(Assert.java:64)
	at junit.framework.Assert.assertEquals(Assert.java:71)
	at org.joda.time.format.TestDateTimeFormatter.testParseMutableDateTime_offsetParsed(TestDateTimeFormatter.java:704)

testParseMutableDateTime_chrono(org.joda.time.format.TestDateTimeFormatter)  Time elapsed: 0 sec  <<< FAILURE!
junit.framework.AssertionFailedError: expected:<2004-06-09T12:20:30.000+01:00> but was:<2004-06-09T11:20:30.000+01:00>
	at junit.framework.Assert.fail(Assert.java:47)
	at junit.framework.Assert.failNotEquals(Assert.java:280)
	at junit.framework.Assert.assertEquals(Assert.java:64)
	at junit.framework.Assert.assertEquals(Assert.java:71)
	at org.joda.time.format.TestDateTimeFormatter.testParseMutableDateTime_chrono(TestDateTimeFormatter.java:718)

testParseInto_zone(org.joda.time.format.TestDateTimeFormatter)  Time elapsed: 0 sec  <<< FAILURE!
junit.framework.AssertionFailedError: expected:<2004-06-09T12:20:30.000+01:00> but was:<2004-06-09T11:20:30.000+01:00>
	at junit.framework.Assert.fail(Assert.java:47)
	at junit.framework.Assert.failNotEquals(Assert.java:280)
	at junit.framework.Assert.assertEquals(Assert.java:64)
	at junit.framework.Assert.assertEquals(Assert.java:71)
	at org.joda.time.format.TestDateTimeFormatter.testParseInto_zone(TestDateTimeFormatter.java:764)

testParseInto_zone2(org.joda.time.format.TestDateTimeFormatter)  Time elapsed: 0.001 sec  <<< FAILURE!
junit.framework.AssertionFailedError: expected:<2004-06-09T12:20:30.000+01:00> but was:<2004-06-09T11:20:30.000+01:00>
	at junit.framework.Assert.fail(Assert.java:47)
	at junit.framework.Assert.failNotEquals(Assert.java:280)
	at junit.framework.Assert.assertEquals(Assert.java:64)
	at junit.framework.Assert.assertEquals(Assert.java:71)
	at org.joda.time.format.TestDateTimeFormatter.testParseInto_zone2(TestDateTimeFormatter.java:781)

testParseInto_offsetParsed(org.joda.time.format.TestDateTimeFormatter)  Time elapsed: 0.001 sec  <<< FAILURE!
junit.framework.AssertionFailedError: expected:<2004-06-09T10:20:30.000+01:00> but was:<2004-06-09T11:20:30.000+01:00>
	at junit.framework.Assert.fail(Assert.java:47)
	at junit.framework.Assert.failNotEquals(Assert.java:280)
	at junit.framework.Assert.assertEquals(Assert.java:64)
	at junit.framework.Assert.assertEquals(Assert.java:71)
	at org.joda.time.format.TestDateTimeFormatter.testParseInto_offsetParsed(TestDateTimeFormatter.java:825)

testParseInto_chrono(org.joda.time.format.TestDateTimeFormatter)  Time elapsed: 0 sec  <<< FAILURE!
junit.framework.AssertionFailedError: expected:<2004-06-09T12:20:30.000+01:00> but was:<2004-06-09T11:20:30.000+01:00>
	at junit.framework.Assert.fail(Assert.java:47)
	at junit.framework.Assert.failNotEquals(Assert.java:280)
	at junit.framework.Assert.assertEquals(Assert.java:64)
	at junit.framework.Assert.assertEquals(Assert.java:71)
	at org.joda.time.format.TestDateTimeFormatter.testParseInto_chrono(TestDateTimeFormatter.java:848)

testParseMillis_fractionOfSecondLong(org.joda.time.format.TestDateTimeFormatter)  Time elapsed: 0.001 sec  <<< FAILURE!
junit.framework.AssertionFailedError: expected:<10512> but was:<-3589488>
	at junit.framework.Assert.fail(Assert.java:47)
	at junit.framework.Assert.failNotEquals(Assert.java:280)
	at junit.framework.Assert.assertEquals(Assert.java:64)
	at junit.framework.Assert.assertEquals(Assert.java:133)
	at junit.framework.Assert.assertEquals(Assert.java:139)
	at org.joda.time.format.TestDateTimeFormatter.testParseMillis_fractionOfSecondLong(TestDateTimeFormatter.java:989)

testZoneNameNearTransition(org.joda.time.format.TestDateTimeFormatter)  Time elapsed: 0.001 sec  <<< FAILURE!
junit.framework.ComparisonFailure: expected:<...05-10-30 01:00:00.0 [Eastern Daylight] Time> but was:<...05-10-30 01:00:00.0 [British Summer] Time>
	at junit.framework.Assert.assertEquals(Assert.java:81)
	at junit.framework.Assert.assertEquals(Assert.java:87)
	at org.joda.time.format.TestDateTimeFormatter.testZoneNameNearTransition(TestDateTimeFormatter.java:1003)

testZoneShortNameNearTransition(org.joda.time.format.TestDateTimeFormatter)  Time elapsed: 0.001 sec  <<< FAILURE!
junit.framework.ComparisonFailure: expected:<...05-10-30 01:00:00.0 [ED]T> but was:<...05-10-30 01:00:00.0 [BS]T>
	at junit.framework.Assert.assertEquals(Assert.java:81)
	at junit.framework.Assert.assertEquals(Assert.java:87)
	at org.joda.time.format.TestDateTimeFormatter.testZoneShortNameNearTransition(TestDateTimeFormatter.java:1019)

testParseLocalDateTime_simple(org.joda.time.format.TestDateTimeFormatter)  Time elapsed: 0.001 sec  <<< FAILURE!
junit.framework.AssertionFailedError: expected:<2004-06-09T10:20:30.000> but was:<2004-06-08T17:20:30.000>
	at junit.framework.Assert.fail(Assert.java:47)
	at junit.framework.Assert.failNotEquals(Assert.java:280)
	at junit.framework.Assert.assertEquals(Assert.java:64)
	at junit.framework.Assert.assertEquals(Assert.java:71)
	at org.joda.time.format.TestDateTimeFormatter.testParseLocalDateTime_simple(TestDateTimeFormatter.java:509)

testPrint_appendableMethods(org.joda.time.format.TestDateTimeFormatter)  Time elapsed: 0 sec  <<< FAILURE!
junit.framework.ComparisonFailure: expected:<... 2004-06-09T10:20:30[Z]> but was:<... 2004-06-09T10:20:30[+01:00]>
	at junit.framework.Assert.assertEquals(Assert.java:81)
	at junit.framework.Assert.assertEquals(Assert.java:87)
	at org.joda.time.format.TestDateTimeFormatter.testPrint_appendableMethods(TestDateTimeFormatter.java:208)

testPrint_chrono_and_zone(org.joda.time.format.TestDateTimeFormatter)  Time elapsed: 0.001 sec  <<< FAILURE!
junit.framework.ComparisonFailure: expected:<... 2004-06-09T10:20:30[Z]> but was:<... 2004-06-09T10:20:30[+01:00]>
	at junit.framework.Assert.assertEquals(Assert.java:81)
	at junit.framework.Assert.assertEquals(Assert.java:87)
	at org.joda.time.format.TestDateTimeFormatter.testPrint_chrono_and_zone(TestDateTimeFormatter.java:228)

testPrint_zone(org.joda.time.format.TestDateTimeFormatter)  Time elapsed: 0.001 sec  <<< FAILURE!
junit.framework.ComparisonFailure: expected:<Wed 2004-06-09T[06:20:30-04]:00> but was:<Wed 2004-06-09T[10:20:30+01]:00>
	at junit.framework.Assert.assertEquals(Assert.java:81)
	at junit.framework.Assert.assertEquals(Assert.java:87)
	at org.joda.time.format.TestDateTimeFormatter.testPrint_zone(TestDateTimeFormatter.java:134)

testPrint_chrono(org.joda.time.format.TestDateTimeFormatter)  Time elapsed: 0 sec  <<< FAILURE!
junit.framework.ComparisonFailure: expected:<Wed 2004-06-09T1[2:20:30+02]:00> but was:<Wed 2004-06-09T1[0:20:30+01]:00>
	at junit.framework.Assert.assertEquals(Assert.java:81)
	at junit.framework.Assert.assertEquals(Assert.java:87)
	at org.joda.time.format.TestDateTimeFormatter.testPrint_chrono(TestDateTimeFormatter.java:148)

testPrint_bufferMethods(org.joda.time.format.TestDateTimeFormatter)  Time elapsed: 0 sec  <<< FAILURE!
junit.framework.ComparisonFailure: expected:<... 2004-06-09T10:20:30[Z]> but was:<... 2004-06-09T10:20:30[+01:00]>
	at junit.framework.Assert.assertEquals(Assert.java:81)
	at junit.framework.Assert.assertEquals(Assert.java:87)
	at org.joda.time.format.TestDateTimeFormatter.testPrint_bufferMethods(TestDateTimeFormatter.java:164)

testPrint_writerMethods(org.joda.time.format.TestDateTimeFormatter)  Time elapsed: 0.001 sec  <<< FAILURE!
junit.framework.ComparisonFailure: expected:<... 2004-06-09T10:20:30[Z]> but was:<... 2004-06-09T10:20:30[+01:00]>
	at junit.framework.Assert.assertEquals(Assert.java:81)
	at junit.framework.Assert.assertEquals(Assert.java:87)
	at org.joda.time.format.TestDateTimeFormatter.testPrint_writerMethods(TestDateTimeFormatter.java:186)

testPrint_locale(org.joda.time.format.TestDateTimeFormatter)  Time elapsed: 0 sec  <<< FAILURE!
junit.framework.ComparisonFailure: expected:<... 2004-06-09T10:20:30[Z]> but was:<... 2004-06-09T10:20:30[+01:00]>
	at junit.framework.Assert.assertEquals(Assert.java:81)
	at junit.framework.Assert.assertEquals(Assert.java:87)
	at org.joda.time.format.TestDateTimeFormatter.testPrint_locale(TestDateTimeFormatter.java:127)

testPrint_simple(org.joda.time.format.TestDateTimeFormatter)  Time elapsed: 0.001 sec  <<< FAILURE!
junit.framework.ComparisonFailure: expected:<... 2004-06-09T10:20:30[Z]> but was:<... 2004-06-09T10:20:30[+01:00]>
	at junit.framework.Assert.assertEquals(Assert.java:81)
	at junit.framework.Assert.assertEquals(Assert.java:87)
	at org.joda.time.format.TestDateTimeFormatter.testPrint_simple(TestDateTimeFormatter.java:112)

testParseLocalDate_simple(org.joda.time.format.TestDateTimeFormatter)  Time elapsed: 0.001 sec  <<< FAILURE!
junit.framework.AssertionFailedError: expected:<2004-06-09> but was:<2004-06-08>
	at junit.framework.Assert.fail(Assert.java:47)
	at junit.framework.Assert.failNotEquals(Assert.java:280)
	at junit.framework.Assert.assertEquals(Assert.java:64)
	at junit.framework.Assert.assertEquals(Assert.java:71)
	at org.joda.time.format.TestDateTimeFormatter.testParseLocalDate_simple(TestDateTimeFormatter.java:366)

testParseLocalTime_simple(org.joda.time.format.TestDateTimeFormatter)  Time elapsed: 0.001 sec  <<< FAILURE!
junit.framework.AssertionFailedError: expected:<10:20:30.000> but was:<17:20:30.000>
	at junit.framework.Assert.fail(Assert.java:47)
	at junit.framework.Assert.failNotEquals(Assert.java:280)
	at junit.framework.Assert.assertEquals(Assert.java:64)
	at junit.framework.Assert.assertEquals(Assert.java:71)
	at org.joda.time.format.TestDateTimeFormatter.testParseLocalTime_simple(TestDateTimeFormatter.java:496)

testParseDateTime_zone(org.joda.time.format.TestDateTimeFormatter)  Time elapsed: 0 sec  <<< FAILURE!
junit.framework.AssertionFailedError: expected:<2004-06-09T12:20:30.000+01:00> but was:<2004-06-09T11:20:30.000+01:00>
	at junit.framework.Assert.fail(Assert.java:47)
	at junit.framework.Assert.failNotEquals(Assert.java:280)
	at junit.framework.Assert.assertEquals(Assert.java:64)
	at junit.framework.Assert.assertEquals(Assert.java:71)
	at org.joda.time.format.TestDateTimeFormatter.testParseDateTime_zone(TestDateTimeFormatter.java:561)

testParseDateTime_zone2(org.joda.time.format.TestDateTimeFormatter)  Time elapsed: 0 sec  <<< FAILURE!
junit.framework.AssertionFailedError: expected:<2004-06-09T12:20:30.000+01:00> but was:<2004-06-09T11:20:30.000+01:00>
	at junit.framework.Assert.fail(Assert.java:47)
	at junit.framework.Assert.failNotEquals(Assert.java:280)
	at junit.framework.Assert.assertEquals(Assert.java:64)
	at junit.framework.Assert.assertEquals(Assert.java:71)
	at org.joda.time.format.TestDateTimeFormatter.testParseDateTime_zone2(TestDateTimeFormatter.java:573)

testParseDateTime_offsetParsed(org.joda.time.format.TestDateTimeFormatter)  Time elapsed: 0 sec  <<< FAILURE!
junit.framework.AssertionFailedError: expected:<2004-06-09T10:20:30.000+01:00> but was:<2004-06-09T11:20:30.000+01:00>
	at junit.framework.Assert.fail(Assert.java:47)
	at junit.framework.Assert.failNotEquals(Assert.java:280)
	at junit.framework.Assert.assertEquals(Assert.java:64)
	at junit.framework.Assert.assertEquals(Assert.java:71)
	at org.joda.time.format.TestDateTimeFormatter.testParseDateTime_offsetParsed(TestDateTimeFormatter.java:609)

testParseDateTime_chrono(org.joda.time.format.TestDateTimeFormatter)  Time elapsed: 0 sec  <<< FAILURE!
junit.framework.AssertionFailedError: expected:<2004-06-09T12:20:30.000+01:00> but was:<2004-06-09T11:20:30.000+01:00>
	at junit.framework.Assert.fail(Assert.java:47)
	at junit.framework.Assert.failNotEquals(Assert.java:280)
	at junit.framework.Assert.assertEquals(Assert.java:64)
	at junit.framework.Assert.assertEquals(Assert.java:71)
	at org.joda.time.format.TestDateTimeFormatter.testParseDateTime_chrono(TestDateTimeFormatter.java:623)

testParseMutableDateTime_zone(org.joda.time.format.TestDateTimeFormatter)  Time elapsed: 0.001 sec  <<< FAILURE!
junit.framework.AssertionFailedError: expected:<2004-06-09T12:20:30.000+01:00> but was:<2004-06-09T11:20:30.000+01:00>
	at junit.framework.Assert.fail(Assert.java:47)
	at junit.framework.Assert.failNotEquals(Assert.java:280)
	at junit.framework.Assert.assertEquals(Assert.java:64)
	at junit.framework.Assert.assertEquals(Assert.java:71)
	at org.joda.time.format.TestDateTimeFormatter.testParseMutableDateTime_zone(TestDateTimeFormatter.java:656)

testParseMutableDateTime_zone2(org.joda.time.format.TestDateTimeFormatter)  Time elapsed: 0 sec  <<< FAILURE!
junit.framework.AssertionFailedError: expected:<2004-06-09T12:20:30.000+01:00> but was:<2004-06-09T11:20:30.000+01:00>
	at junit.framework.Assert.fail(Assert.java:47)
	at junit.framework.Assert.failNotEquals(Assert.java:280)
	at junit.framework.Assert.assertEquals(Assert.java:64)
	at junit.framework.Assert.assertEquals(Assert.java:71)
	at org.joda.time.format.TestDateTimeFormatter.testParseMutableDateTime_zone2(TestDateTimeFormatter.java:668)

testFormat_zoneText(org.joda.time.format.TestDateTimeFormat)  Time elapsed: 0 sec  <<< FAILURE!
junit.framework.ComparisonFailure: 2004-06-09T10:20:30.040+01:00 expected:<[UTC]> but was:<[BST]>
	at junit.framework.Assert.assertEquals(Assert.java:81)
	at org.joda.time.format.TestDateTimeFormat.testFormat_zoneText(TestDateTimeFormat.java:757)

testFormat_zoneLongText(org.joda.time.format.TestDateTimeFormat)  Time elapsed: 0.001 sec  <<< FAILURE!
junit.framework.ComparisonFailure: 2004-06-09T10:20:30.040+01:00 expected:<[Coordinated Universal] Time> but was:<[British Summer] Time>
	at junit.framework.Assert.assertEquals(Assert.java:81)
	at org.joda.time.format.TestDateTimeFormat.testFormat_zoneLongText(TestDateTimeFormat.java:769)

testFormat_zoneAmount(org.joda.time.format.TestDateTimeFormat)  Time elapsed: 0 sec  <<< FAILURE!
junit.framework.ComparisonFailure: 2004-06-09T10:20:30.040+01:00 expected:<+0[0]00> but was:<+0[1]00>
	at junit.framework.Assert.assertEquals(Assert.java:81)
	at org.joda.time.format.TestDateTimeFormat.testFormat_zoneAmount(TestDateTimeFormat.java:782)

testFormat_zoneAmountColon(org.joda.time.format.TestDateTimeFormat)  Time elapsed: 0.001 sec  <<< FAILURE!
junit.framework.ComparisonFailure: 2004-06-09T10:20:30.040+01:00 expected:<+0[0]:00> but was:<+0[1]:00>
	at junit.framework.Assert.assertEquals(Assert.java:81)
	at org.joda.time.format.TestDateTimeFormat.testFormat_zoneAmountColon(TestDateTimeFormat.java:794)

testFormat_zoneAmountID(org.joda.time.format.TestDateTimeFormat)  Time elapsed: 0.002 sec  <<< FAILURE!
junit.framework.ComparisonFailure: 2004-06-09T10:20:30.040+01:00 expected:<[UTC]> but was:<[Europe/London]>
	at junit.framework.Assert.assertEquals(Assert.java:81)
	at org.joda.time.format.TestDateTimeFormat.testFormat_zoneAmountID(TestDateTimeFormat.java:806)

testFormatParse_zoneId_noColon(org.joda.time.format.TestDateTimeFormat)  Time elapsed: 0.001 sec  <<< FAILURE!
junit.framework.ComparisonFailure: expected:<01:02 +0[0]00> but was:<01:02 +0[1]00>
	at junit.framework.Assert.assertEquals(Assert.java:81)
	at junit.framework.Assert.assertEquals(Assert.java:87)
	at org.joda.time.format.TestDateTimeFormat.testFormatParse_zoneId_noColon(TestDateTimeFormat.java:1142)

testFormatParse_zoneId_noColon_parseZ(org.joda.time.format.TestDateTimeFormat)  Time elapsed: 0 sec  <<< FAILURE!
junit.framework.AssertionFailedError: expected:<1> but was:<2>
	at junit.framework.Assert.fail(Assert.java:47)
	at junit.framework.Assert.failNotEquals(Assert.java:280)
	at junit.framework.Assert.assertEquals(Assert.java:64)
	at junit.framework.Assert.assertEquals(Assert.java:198)
	at junit.framework.Assert.assertEquals(Assert.java:204)
	at org.joda.time.format.TestDateTimeFormat.testFormatParse_zoneId_noColon_parseZ(TestDateTimeFormat.java:1151)

testFormatParse_zoneId_colon(org.joda.time.format.TestDateTimeFormat)  Time elapsed: 0.001 sec  <<< FAILURE!
junit.framework.ComparisonFailure: expected:<01:02 +0[0]:00> but was:<01:02 +0[1]:00>
	at junit.framework.Assert.assertEquals(Assert.java:81)
	at junit.framework.Assert.assertEquals(Assert.java:87)
	at org.joda.time.format.TestDateTimeFormat.testFormatParse_zoneId_colon(TestDateTimeFormat.java:1158)

testFormatParse_zoneId_colon_parseZ(org.joda.time.format.TestDateTimeFormat)  Time elapsed: 0 sec  <<< FAILURE!
junit.framework.AssertionFailedError: expected:<1> but was:<2>
	at junit.framework.Assert.fail(Assert.java:47)
	at junit.framework.Assert.failNotEquals(Assert.java:280)
	at junit.framework.Assert.assertEquals(Assert.java:64)
	at junit.framework.Assert.assertEquals(Assert.java:198)
	at junit.framework.Assert.assertEquals(Assert.java:204)
	at org.joda.time.format.TestDateTimeFormat.testFormatParse_zoneId_colon_parseZ(TestDateTimeFormat.java:1167)

testFormat_halfdayOfDay(org.joda.time.format.TestDateTimeFormat)  Time elapsed: 0.001 sec  <<< FAILURE!
junit.framework.ComparisonFailure: 2004-06-09T10:20:30.040+01:00 expected:<[P]M> but was:<[A]M>
	at junit.framework.Assert.assertEquals(Assert.java:81)
	at org.joda.time.format.TestDateTimeFormat.testFormat_halfdayOfDay(TestDateTimeFormat.java:634)

testFormat_hourOfHalfday(org.joda.time.format.TestDateTimeFormat)  Time elapsed: 0 sec  <<< FAILURE!
junit.framework.ComparisonFailure: 2004-06-09T10:20:30.040+01:00 expected:<[6]> but was:<[10]>
	at junit.framework.Assert.assertEquals(Assert.java:81)
	at org.joda.time.format.TestDateTimeFormat.testFormat_hourOfHalfday(TestDateTimeFormat.java:644)

testFormat_clockhourOfHalfday(org.joda.time.format.TestDateTimeFormat)  Time elapsed: 0 sec  <<< FAILURE!
junit.framework.ComparisonFailure: 2004-06-09T10:20:30.040+01:00 expected:<[6]> but was:<[10]>
	at junit.framework.Assert.assertEquals(Assert.java:81)
	at org.joda.time.format.TestDateTimeFormat.testFormat_clockhourOfHalfday(TestDateTimeFormat.java:660)

testFormat_hourOfDay(org.joda.time.format.TestDateTimeFormat)  Time elapsed: 0.001 sec  <<< FAILURE!
junit.framework.ComparisonFailure: 2004-06-09T10:20:30.040+01:00 expected:<[6]> but was:<[10]>
	at junit.framework.Assert.assertEquals(Assert.java:81)
	at org.joda.time.format.TestDateTimeFormat.testFormat_hourOfDay(TestDateTimeFormat.java:676)

testFormat_clockhourOfDay(org.joda.time.format.TestDateTimeFormat)  Time elapsed: 0 sec  <<< FAILURE!
junit.framework.ComparisonFailure: 2004-06-09T10:20:30.040+01:00 expected:<[6]> but was:<[10]>
	at junit.framework.Assert.assertEquals(Assert.java:81)
	at org.joda.time.format.TestDateTimeFormat.testFormat_clockhourOfDay(TestDateTimeFormat.java:692)

testParse(org.joda.time.format.TestDateTimeParserBucket)  Time elapsed: 0.001 sec  <<< FAILURE!
junit.framework.AssertionFailedError: expected:<-6840000> but was:<3960000>
	at junit.framework.Assert.fail(Assert.java:47)
	at junit.framework.Assert.failNotEquals(Assert.java:280)
	at junit.framework.Assert.assertEquals(Assert.java:64)
	at junit.framework.Assert.assertEquals(Assert.java:133)
	at junit.framework.Assert.assertEquals(Assert.java:139)
	at org.joda.time.format.TestDateTimeParserBucket.testParse(TestDateTimeParserBucket.java:287)

testReset(org.joda.time.format.TestDateTimeParserBucket)  Time elapsed: 0 sec  <<< FAILURE!
junit.framework.AssertionFailedError: expected:<+04:00> but was:<Europe/London>
	at junit.framework.Assert.fail(Assert.java:47)
	at junit.framework.Assert.failNotEquals(Assert.java:280)
	at junit.framework.Assert.assertEquals(Assert.java:64)
	at junit.framework.Assert.assertEquals(Assert.java:71)
	at org.joda.time.format.TestDateTimeParserBucket.testReset(TestDateTimeParserBucket.java:256)

testCompute(org.joda.time.format.TestDateTimeParserBucket)  Time elapsed: 0.001 sec  <<< FAILURE!
junit.framework.AssertionFailedError: expected:<-14399900> but was:<-3599900>
	at junit.framework.Assert.fail(Assert.java:47)
	at junit.framework.Assert.failNotEquals(Assert.java:280)
	at junit.framework.Assert.assertEquals(Assert.java:64)
	at junit.framework.Assert.assertEquals(Assert.java:133)
	at junit.framework.Assert.assertEquals(Assert.java:139)
	at org.joda.time.format.TestDateTimeParserBucket.testCompute(TestDateTimeParserBucket.java:116)

testSaveCompute(org.joda.time.format.TestDateTimeParserBucket)  Time elapsed: 0 sec  <<< FAILURE!
junit.framework.AssertionFailedError: expected:<-7199900> but was:<3600100>
	at junit.framework.Assert.fail(Assert.java:47)
	at junit.framework.Assert.failNotEquals(Assert.java:280)
	at junit.framework.Assert.assertEquals(Assert.java:64)
	at junit.framework.Assert.assertEquals(Assert.java:133)
	at junit.framework.Assert.assertEquals(Assert.java:139)
	at org.joda.time.format.TestDateTimeParserBucket.testSaveCompute(TestDateTimeParserBucket.java:125)

testSaveRestoreState(org.joda.time.format.TestDateTimeParserBucket)  Time elapsed: 0.001 sec  <<< FAILURE!
junit.framework.AssertionFailedError: expected:<-7199900> but was:<3600100>
	at junit.framework.Assert.fail(Assert.java:47)
	at junit.framework.Assert.failNotEquals(Assert.java:280)
	at junit.framework.Assert.assertEquals(Assert.java:64)
	at junit.framework.Assert.assertEquals(Assert.java:133)
	at junit.framework.Assert.assertEquals(Assert.java:139)
	at org.joda.time.format.TestDateTimeParserBucket.testSaveRestoreState(TestDateTimeParserBucket.java:136)

testSaveRestoreState_avoidSideEffects(org.joda.time.format.TestDateTimeParserBucket)  Time elapsed: 0.001 sec  <<< FAILURE!
junit.framework.AssertionFailedError: expected:<-6779900> but was:<4020100>
	at junit.framework.Assert.fail(Assert.java:47)
	at junit.framework.Assert.failNotEquals(Assert.java:280)
	at junit.framework.Assert.assertEquals(Assert.java:64)
	at junit.framework.Assert.assertEquals(Assert.java:133)
	at junit.framework.Assert.assertEquals(Assert.java:139)
	at org.joda.time.format.TestDateTimeParserBucket.testSaveRestoreState_avoidSideEffects(TestDateTimeParserBucket.java:157)

testSaveRestoreState_offset(org.joda.time.format.TestDateTimeParserBucket)  Time elapsed: 0 sec  <<< FAILURE!
junit.framework.AssertionFailedError: expected:<-7199900> but was:<3600100>
	at junit.framework.Assert.fail(Assert.java:47)
	at junit.framework.Assert.failNotEquals(Assert.java:280)
	at junit.framework.Assert.assertEquals(Assert.java:64)
	at junit.framework.Assert.assertEquals(Assert.java:133)
	at junit.framework.Assert.assertEquals(Assert.java:139)
	at org.joda.time.format.TestDateTimeParserBucket.testSaveRestoreState_offset(TestDateTimeParserBucket.java:165)

testSaveRestoreState_zone(org.joda.time.format.TestDateTimeParserBucket)  Time elapsed: 0 sec  <<< FAILURE!
junit.framework.AssertionFailedError: expected:<-7199900> but was:<3600100>
	at junit.framework.Assert.fail(Assert.java:47)
	at junit.framework.Assert.failNotEquals(Assert.java:280)
	at junit.framework.Assert.assertEquals(Assert.java:64)
	at junit.framework.Assert.assertEquals(Assert.java:133)
	at junit.framework.Assert.assertEquals(Assert.java:139)
	at org.joda.time.format.TestDateTimeParserBucket.testSaveRestoreState_zone(TestDateTimeParserBucket.java:177)

testSaveRestoreState_text(org.joda.time.format.TestDateTimeParserBucket)  Time elapsed: 0.001 sec  <<< FAILURE!
junit.framework.AssertionFailedError: expected:<-7199900> but was:<3600100>
	at junit.framework.Assert.fail(Assert.java:47)
	at junit.framework.Assert.failNotEquals(Assert.java:280)
	at junit.framework.Assert.assertEquals(Assert.java:64)
	at junit.framework.Assert.assertEquals(Assert.java:133)
	at junit.framework.Assert.assertEquals(Assert.java:139)
	at org.joda.time.format.TestDateTimeParserBucket.testSaveRestoreState_text(TestDateTimeParserBucket.java:189)

testSaveRestoreState_twoStates(org.joda.time.format.TestDateTimeParserBucket)  Time elapsed: 0.001 sec  <<< FAILURE!
junit.framework.AssertionFailedError: expected:<-7199900> but was:<3600100>
	at junit.framework.Assert.fail(Assert.java:47)
	at junit.framework.Assert.failNotEquals(Assert.java:280)
	at junit.framework.Assert.assertEquals(Assert.java:64)
	at junit.framework.Assert.assertEquals(Assert.java:133)
	at junit.framework.Assert.assertEquals(Assert.java:139)
	at org.joda.time.format.TestDateTimeParserBucket.testSaveRestoreState_twoStates(TestDateTimeParserBucket.java:201)

testSaveRestoreState_sameStates(org.joda.time.format.TestDateTimeParserBucket)  Time elapsed: 0 sec  <<< FAILURE!
junit.framework.AssertionFailedError: expected:<-7199900> but was:<3600100>
	at junit.framework.Assert.fail(Assert.java:47)
	at junit.framework.Assert.failNotEquals(Assert.java:280)
	at junit.framework.Assert.assertEquals(Assert.java:64)
	at junit.framework.Assert.assertEquals(Assert.java:133)
	at junit.framework.Assert.assertEquals(Assert.java:139)
	at org.joda.time.format.TestDateTimeParserBucket.testSaveRestoreState_sameStates(TestDateTimeParserBucket.java:223)

testFormat_time(org.joda.time.format.TestISODateTimeFormat)  Time elapsed: 0 sec  <<< FAILURE!
junit.framework.ComparisonFailure: expected:<10:20:30.040[Z]> but was:<10:20:30.040[+01:00]>
	at junit.framework.Assert.assertEquals(Assert.java:81)
	at junit.framework.Assert.assertEquals(Assert.java:87)
	at org.joda.time.format.TestISODateTimeFormat.testFormat_time(TestISODateTimeFormat.java:116)

testFormat_timeNoMillis(org.joda.time.format.TestISODateTimeFormat)  Time elapsed: 0.001 sec  <<< FAILURE!
junit.framework.ComparisonFailure: expected:<10:20:30[Z]> but was:<10:20:30[+01:00]>
	at junit.framework.Assert.assertEquals(Assert.java:81)
	at junit.framework.Assert.assertEquals(Assert.java:87)
	at org.joda.time.format.TestISODateTimeFormat.testFormat_timeNoMillis(TestISODateTimeFormat.java:135)

testFormat_weekDateTime(org.joda.time.format.TestISODateTimeFormat)  Time elapsed: 0 sec  <<< FAILURE!
junit.framework.ComparisonFailure: expected:<...4-W24-3T10:20:30.040[Z]> but was:<...4-W24-3T10:20:30.040[+01:00]>
	at junit.framework.Assert.assertEquals(Assert.java:81)
	at junit.framework.Assert.assertEquals(Assert.java:87)
	at org.joda.time.format.TestISODateTimeFormat.testFormat_weekDateTime(TestISODateTimeFormat.java:254)

testFormat_weekDateTimeNoMillis(org.joda.time.format.TestISODateTimeFormat)  Time elapsed: 0.001 sec  <<< FAILURE!
junit.framework.ComparisonFailure: expected:<2004-W24-3T10:20:30[Z]> but was:<2004-W24-3T10:20:30[+01:00]>
	at junit.framework.Assert.assertEquals(Assert.java:81)
	at junit.framework.Assert.assertEquals(Assert.java:87)
	at org.joda.time.format.TestISODateTimeFormat.testFormat_weekDateTimeNoMillis(TestISODateTimeFormat.java:265)

testFormat_basicTime(org.joda.time.format.TestISODateTimeFormat)  Time elapsed: 0.001 sec  <<< FAILURE!
junit.framework.ComparisonFailure: expected:<102030.040[Z]> but was:<102030.040[+0100]>
	at junit.framework.Assert.assertEquals(Assert.java:81)
	at junit.framework.Assert.assertEquals(Assert.java:87)
	at org.joda.time.format.TestISODateTimeFormat.testFormat_basicTime(TestISODateTimeFormat.java:288)

testFormat_basicTimeNoMillis(org.joda.time.format.TestISODateTimeFormat)  Time elapsed: 0.001 sec  <<< FAILURE!
junit.framework.ComparisonFailure: expected:<102030[Z]> but was:<102030[+0100]>
	at junit.framework.Assert.assertEquals(Assert.java:81)
	at junit.framework.Assert.assertEquals(Assert.java:87)
	at org.joda.time.format.TestISODateTimeFormat.testFormat_basicTimeNoMillis(TestISODateTimeFormat.java:299)

testFormat_basicTTime(org.joda.time.format.TestISODateTimeFormat)  Time elapsed: 0 sec  <<< FAILURE!
junit.framework.ComparisonFailure: expected:<T102030.040[Z]> but was:<T102030.040[+0100]>
	at junit.framework.Assert.assertEquals(Assert.java:81)
	at junit.framework.Assert.assertEquals(Assert.java:87)
	at org.joda.time.format.TestISODateTimeFormat.testFormat_basicTTime(TestISODateTimeFormat.java:310)

testFormat_basicTTimeNoMillis(org.joda.time.format.TestISODateTimeFormat)  Time elapsed: 0 sec  <<< FAILURE!
junit.framework.ComparisonFailure: expected:<T102030[Z]> but was:<T102030[+0100]>
	at junit.framework.Assert.assertEquals(Assert.java:81)
	at junit.framework.Assert.assertEquals(Assert.java:87)
	at org.joda.time.format.TestISODateTimeFormat.testFormat_basicTTimeNoMillis(TestISODateTimeFormat.java:321)

testFormat_basicDateTime(org.joda.time.format.TestISODateTimeFormat)  Time elapsed: 0.001 sec  <<< FAILURE!
junit.framework.ComparisonFailure: expected:<20040609T102030.040[Z]> but was:<20040609T102030.040[+0100]>
	at junit.framework.Assert.assertEquals(Assert.java:81)
	at junit.framework.Assert.assertEquals(Assert.java:87)
	at org.joda.time.format.TestISODateTimeFormat.testFormat_basicDateTime(TestISODateTimeFormat.java:332)

testFormat_basicDateTimeNoMillis(org.joda.time.format.TestISODateTimeFormat)  Time elapsed: 0.001 sec  <<< FAILURE!
junit.framework.ComparisonFailure: expected:<20040609T102030[Z]> but was:<20040609T102030[+0100]>
	at junit.framework.Assert.assertEquals(Assert.java:81)
	at junit.framework.Assert.assertEquals(Assert.java:87)
	at org.joda.time.format.TestISODateTimeFormat.testFormat_basicDateTimeNoMillis(TestISODateTimeFormat.java:343)

testFormat_basicOrdinalDateTime(org.joda.time.format.TestISODateTimeFormat)  Time elapsed: 0.001 sec  <<< FAILURE!
junit.framework.ComparisonFailure: expected:<2004161T102030.040[Z]> but was:<2004161T102030.040[+0100]>
	at junit.framework.Assert.assertEquals(Assert.java:81)
	at junit.framework.Assert.assertEquals(Assert.java:87)
	at org.joda.time.format.TestISODateTimeFormat.testFormat_basicOrdinalDateTime(TestISODateTimeFormat.java:365)

testFormat_basicOrdinalDateTimeNoMillis(org.joda.time.format.TestISODateTimeFormat)  Time elapsed: 0.001 sec  <<< FAILURE!
junit.framework.ComparisonFailure: expected:<2004161T102030[Z]> but was:<2004161T102030[+0100]>
	at junit.framework.Assert.assertEquals(Assert.java:81)
	at junit.framework.Assert.assertEquals(Assert.java:87)
	at org.joda.time.format.TestISODateTimeFormat.testFormat_basicOrdinalDateTimeNoMillis(TestISODateTimeFormat.java:376)

testFormat_tTime(org.joda.time.format.TestISODateTimeFormat)  Time elapsed: 0.001 sec  <<< FAILURE!
junit.framework.ComparisonFailure: expected:<T10:20:30.040[Z]> but was:<T10:20:30.040[+01:00]>
	at junit.framework.Assert.assertEquals(Assert.java:81)
	at junit.framework.Assert.assertEquals(Assert.java:87)
	at org.joda.time.format.TestISODateTimeFormat.testFormat_tTime(TestISODateTimeFormat.java:154)

testFormat_tTimeNoMillis(org.joda.time.format.TestISODateTimeFormat)  Time elapsed: 0 sec  <<< FAILURE!
junit.framework.ComparisonFailure: expected:<T10:20:30[Z]> but was:<T10:20:30[+01:00]>
	at junit.framework.Assert.assertEquals(Assert.java:81)
	at junit.framework.Assert.assertEquals(Assert.java:87)
	at org.joda.time.format.TestISODateTimeFormat.testFormat_tTimeNoMillis(TestISODateTimeFormat.java:165)

testFormat_dateTime(org.joda.time.format.TestISODateTimeFormat)  Time elapsed: 0.001 sec  <<< FAILURE!
junit.framework.ComparisonFailure: expected:<...4-06-09T10:20:30.040[Z]> but was:<...4-06-09T10:20:30.040[+01:00]>
	at junit.framework.Assert.assertEquals(Assert.java:81)
	at junit.framework.Assert.assertEquals(Assert.java:87)
	at org.joda.time.format.TestISODateTimeFormat.testFormat_dateTime(TestISODateTimeFormat.java:176)

testFormat_dateTimeNoMillis(org.joda.time.format.TestISODateTimeFormat)  Time elapsed: 0.001 sec  <<< FAILURE!
junit.framework.ComparisonFailure: expected:<2004-06-09T10:20:30[Z]> but was:<2004-06-09T10:20:30[+01:00]>
	at junit.framework.Assert.assertEquals(Assert.java:81)
	at junit.framework.Assert.assertEquals(Assert.java:87)
	at org.joda.time.format.TestISODateTimeFormat.testFormat_dateTimeNoMillis(TestISODateTimeFormat.java:199)

testFormat_ordinalDateTime(org.joda.time.format.TestISODateTimeFormat)  Time elapsed: 0.001 sec  <<< FAILURE!
junit.framework.ComparisonFailure: expected:<...004-161T10:20:30.040[Z]> but was:<...004-161T10:20:30.040[+01:00]>
	at junit.framework.Assert.assertEquals(Assert.java:81)
	at junit.framework.Assert.assertEquals(Assert.java:87)
	at org.joda.time.format.TestISODateTimeFormat.testFormat_ordinalDateTime(TestISODateTimeFormat.java:221)

testFormat_ordinalDateTimeNoMillis(org.joda.time.format.TestISODateTimeFormat)  Time elapsed: 0 sec  <<< FAILURE!
junit.framework.ComparisonFailure: expected:<2004-161T10:20:30[Z]> but was:<2004-161T10:20:30[+01:00]>
	at junit.framework.Assert.assertEquals(Assert.java:81)
	at junit.framework.Assert.assertEquals(Assert.java:87)
	at org.joda.time.format.TestISODateTimeFormat.testFormat_ordinalDateTimeNoMillis(TestISODateTimeFormat.java:232)

testFormat_basicWeekDateTime(org.joda.time.format.TestISODateTimeFormat)  Time elapsed: 0.001 sec  <<< FAILURE!
junit.framework.ComparisonFailure: expected:<2004W243T102030.040[Z]> but was:<2004W243T102030.040[+0100]>
	at junit.framework.Assert.assertEquals(Assert.java:81)
	at junit.framework.Assert.assertEquals(Assert.java:87)
	at org.joda.time.format.TestISODateTimeFormat.testFormat_basicWeekDateTime(TestISODateTimeFormat.java:398)

testFormat_basicWeekDateTimeNoMillis(org.joda.time.format.TestISODateTimeFormat)  Time elapsed: 0 sec  <<< FAILURE!
junit.framework.ComparisonFailure: expected:<2004W243T102030[Z]> but was:<2004W243T102030[+0100]>
	at junit.framework.Assert.assertEquals(Assert.java:81)
	at junit.framework.Assert.assertEquals(Assert.java:87)
	at org.joda.time.format.TestISODateTimeFormat.testFormat_basicWeekDateTimeNoMillis(TestISODateTimeFormat.java:409)

testFormat_hour(org.joda.time.format.TestISODateTimeFormat)  Time elapsed: 0.001 sec  <<< FAILURE!
junit.framework.ComparisonFailure: expected:<1[1]> but was:<1[0]>
	at junit.framework.Assert.assertEquals(Assert.java:81)
	at junit.framework.Assert.assertEquals(Assert.java:87)
	at org.joda.time.format.TestISODateTimeFormat.testFormat_hour(TestISODateTimeFormat.java:491)

testFormat_hourMinute(org.joda.time.format.TestISODateTimeFormat)  Time elapsed: 0 sec  <<< FAILURE!
junit.framework.ComparisonFailure: expected:<1[1]:20> but was:<1[0]:20>
	at junit.framework.Assert.assertEquals(Assert.java:81)
	at junit.framework.Assert.assertEquals(Assert.java:87)
	at org.joda.time.format.TestISODateTimeFormat.testFormat_hourMinute(TestISODateTimeFormat.java:502)

testFormat_hourMinuteSecond(org.joda.time.format.TestISODateTimeFormat)  Time elapsed: 0 sec  <<< FAILURE!
junit.framework.ComparisonFailure: expected:<1[1]:20:30> but was:<1[0]:20:30>
	at junit.framework.Assert.assertEquals(Assert.java:81)
	at junit.framework.Assert.assertEquals(Assert.java:87)
	at org.joda.time.format.TestISODateTimeFormat.testFormat_hourMinuteSecond(TestISODateTimeFormat.java:513)

testFormat_hourMinuteSecondMillis(org.joda.time.format.TestISODateTimeFormat)  Time elapsed: 0.001 sec  <<< FAILURE!
junit.framework.ComparisonFailure: expected:<1[1]:20:30.040> but was:<1[0]:20:30.040>
	at junit.framework.Assert.assertEquals(Assert.java:81)
	at junit.framework.Assert.assertEquals(Assert.java:87)
	at org.joda.time.format.TestISODateTimeFormat.testFormat_hourMinuteSecondMillis(TestISODateTimeFormat.java:524)

testFormat_hourMinuteSecondFraction(org.joda.time.format.TestISODateTimeFormat)  Time elapsed: 0.001 sec  <<< FAILURE!
junit.framework.ComparisonFailure: expected:<1[1]:20:30.040> but was:<1[0]:20:30.040>
	at junit.framework.Assert.assertEquals(Assert.java:81)
	at junit.framework.Assert.assertEquals(Assert.java:87)
	at org.joda.time.format.TestISODateTimeFormat.testFormat_hourMinuteSecondFraction(TestISODateTimeFormat.java:535)

testFormat_dateHour(org.joda.time.format.TestISODateTimeFormat)  Time elapsed: 0.001 sec  <<< FAILURE!
junit.framework.ComparisonFailure: expected:<2004-06-09T1[1]> but was:<2004-06-09T1[0]>
	at junit.framework.Assert.assertEquals(Assert.java:81)
	at junit.framework.Assert.assertEquals(Assert.java:87)
	at org.joda.time.format.TestISODateTimeFormat.testFormat_dateHour(TestISODateTimeFormat.java:547)

testFormat_dateHourMinute(org.joda.time.format.TestISODateTimeFormat)  Time elapsed: 0 sec  <<< FAILURE!
junit.framework.ComparisonFailure: expected:<2004-06-09T1[1]:20> but was:<2004-06-09T1[0]:20>
	at junit.framework.Assert.assertEquals(Assert.java:81)
	at junit.framework.Assert.assertEquals(Assert.java:87)
	at org.joda.time.format.TestISODateTimeFormat.testFormat_dateHourMinute(TestISODateTimeFormat.java:558)

testFormat_dateHourMinuteSecond(org.joda.time.format.TestISODateTimeFormat)  Time elapsed: 0.001 sec  <<< FAILURE!
junit.framework.ComparisonFailure: expected:<2004-06-09T1[1]:20:30> but was:<2004-06-09T1[0]:20:30>
	at junit.framework.Assert.assertEquals(Assert.java:81)
	at junit.framework.Assert.assertEquals(Assert.java:87)
	at org.joda.time.format.TestISODateTimeFormat.testFormat_dateHourMinuteSecond(TestISODateTimeFormat.java:569)

testFormat_dateHourMinuteSecondMillis(org.joda.time.format.TestISODateTimeFormat)  Time elapsed: 0.001 sec  <<< FAILURE!
junit.framework.ComparisonFailure: expected:<2004-06-09T1[1]:20:30.040> but was:<2004-06-09T1[0]:20:30.040>
	at junit.framework.Assert.assertEquals(Assert.java:81)
	at junit.framework.Assert.assertEquals(Assert.java:87)
	at org.joda.time.format.TestISODateTimeFormat.testFormat_dateHourMinuteSecondMillis(TestISODateTimeFormat.java:580)

testFormat_dateHourMinuteSecondFraction(org.joda.time.format.TestISODateTimeFormat)  Time elapsed: 0 sec  <<< FAILURE!
junit.framework.ComparisonFailure: expected:<2004-06-09T1[1]:20:30.040> but was:<2004-06-09T1[0]:20:30.040>
	at junit.framework.Assert.assertEquals(Assert.java:81)
	at junit.framework.Assert.assertEquals(Assert.java:87)
	at org.joda.time.format.TestISODateTimeFormat.testFormat_dateHourMinuteSecondFraction(TestISODateTimeFormat.java:591)

test_localTimeParser(org.joda.time.format.TestISODateTimeFormatParsing)  Time elapsed: 0.03 sec  <<< FAILURE!
junit.framework.AssertionFailedError: expected:<10512> but was:<-3589488>
	at junit.framework.Assert.fail(Assert.java:47)
	at junit.framework.Assert.failNotEquals(Assert.java:280)
	at junit.framework.Assert.assertEquals(Assert.java:64)
	at junit.framework.Assert.assertEquals(Assert.java:133)
	at junit.framework.Assert.assertEquals(Assert.java:139)
	at org.joda.time.format.TestISODateTimeFormatParsing.test_localTimeParser(TestISODateTimeFormatParsing.java:225)

test_appendOptional_Parser(org.joda.time.format.TestDateTimeFormatterBuilder)  Time elapsed: 0.001 sec  <<< FAILURE!
junit.framework.AssertionFailedError: expected:<0> but was:<-3600000>
	at junit.framework.Assert.fail(Assert.java:47)
	at junit.framework.Assert.failNotEquals(Assert.java:280)
	at junit.framework.Assert.assertEquals(Assert.java:64)
	at junit.framework.Assert.assertEquals(Assert.java:133)
	at junit.framework.Assert.assertEquals(Assert.java:139)
	at org.joda.time.format.TestDateTimeFormatterBuilder.test_appendOptional_Parser(TestDateTimeFormatterBuilder.java:227)

test_appendTimeZoneOffset_parse(org.joda.time.format.TestDateTimeFormatterBuilder)  Time elapsed: 0 sec  <<< FAILURE!
junit.framework.AssertionFailedError: expected:<+02:00> but was:<Europe/London>
	at junit.framework.Assert.fail(Assert.java:47)
	at junit.framework.Assert.failNotEquals(Assert.java:280)
	at junit.framework.Assert.assertEquals(Assert.java:64)
	at junit.framework.Assert.assertEquals(Assert.java:71)
	at org.joda.time.format.TestDateTimeFormatterBuilder.test_appendTimeZoneOffset_parse(TestDateTimeFormatterBuilder.java:328)

test_appendTimeZoneOffset_print_min1max1(org.joda.time.format.TestDateTimeFormatterBuilder)  Time elapsed: 0.001 sec  <<< FAILURE!
junit.framework.ComparisonFailure: expected:<[+02]> but was:<[Z]>
	at junit.framework.Assert.assertEquals(Assert.java:81)
	at junit.framework.Assert.assertEquals(Assert.java:87)
	at org.joda.time.format.TestDateTimeFormatterBuilder.assertPrint(TestDateTimeFormatterBuilder.java:672)
	at org.joda.time.format.TestDateTimeFormatterBuilder.test_appendTimeZoneOffset_print_min1max1(TestDateTimeFormatterBuilder.java:338)

test_appendTimeZoneOffset_print_min1max2(org.joda.time.format.TestDateTimeFormatterBuilder)  Time elapsed: 0 sec  <<< FAILURE!
junit.framework.ComparisonFailure: expected:<[+02]> but was:<[Z]>
	at junit.framework.Assert.assertEquals(Assert.java:81)
	at junit.framework.Assert.assertEquals(Assert.java:87)
	at org.joda.time.format.TestDateTimeFormatterBuilder.assertPrint(TestDateTimeFormatterBuilder.java:672)
	at org.joda.time.format.TestDateTimeFormatterBuilder.test_appendTimeZoneOffset_print_min1max2(TestDateTimeFormatterBuilder.java:344)

test_appendTimeZoneOffset_print_min1max3(org.joda.time.format.TestDateTimeFormatterBuilder)  Time elapsed: 0 sec  <<< FAILURE!
junit.framework.ComparisonFailure: expected:<[+02]> but was:<[Z]>
	at junit.framework.Assert.assertEquals(Assert.java:81)
	at junit.framework.Assert.assertEquals(Assert.java:87)
	at org.joda.time.format.TestDateTimeFormatterBuilder.assertPrint(TestDateTimeFormatterBuilder.java:672)
	at org.joda.time.format.TestDateTimeFormatterBuilder.test_appendTimeZoneOffset_print_min1max3(TestDateTimeFormatterBuilder.java:350)

test_appendTimeZoneOffset_print_min2max2(org.joda.time.format.TestDateTimeFormatterBuilder)  Time elapsed: 0.001 sec  <<< FAILURE!
junit.framework.ComparisonFailure: expected:<[+02:00]> but was:<[Z]>
	at junit.framework.Assert.assertEquals(Assert.java:81)
	at junit.framework.Assert.assertEquals(Assert.java:87)
	at org.joda.time.format.TestDateTimeFormatterBuilder.assertPrint(TestDateTimeFormatterBuilder.java:672)
	at org.joda.time.format.TestDateTimeFormatterBuilder.test_appendTimeZoneOffset_print_min2max2(TestDateTimeFormatterBuilder.java:356)

test_appendTimeZoneOffset_print_min2max3(org.joda.time.format.TestDateTimeFormatterBuilder)  Time elapsed: 0 sec  <<< FAILURE!
junit.framework.ComparisonFailure: expected:<[+02:00]> but was:<[Z]>
	at junit.framework.Assert.assertEquals(Assert.java:81)
	at junit.framework.Assert.assertEquals(Assert.java:87)
	at org.joda.time.format.TestDateTimeFormatterBuilder.assertPrint(TestDateTimeFormatterBuilder.java:672)
	at org.joda.time.format.TestDateTimeFormatterBuilder.test_appendTimeZoneOffset_print_min2max3(TestDateTimeFormatterBuilder.java:362)

test_append_Parser(org.joda.time.format.TestDateTimeFormatterBuilder)  Time elapsed: 0.001 sec  <<< FAILURE!
junit.framework.AssertionFailedError: expected:<0> but was:<-3600000>
	at junit.framework.Assert.fail(Assert.java:47)
	at junit.framework.Assert.failNotEquals(Assert.java:280)
	at junit.framework.Assert.assertEquals(Assert.java:64)
	at junit.framework.Assert.assertEquals(Assert.java:133)
	at junit.framework.Assert.assertEquals(Assert.java:139)
	at org.joda.time.format.TestDateTimeFormatterBuilder.test_append_Parser(TestDateTimeFormatterBuilder.java:172)

test_appendTimeZoneOffset_print_min3max3(org.joda.time.format.TestDateTimeFormatterBuilder)  Time elapsed: 0 sec  <<< FAILURE!
junit.framework.ComparisonFailure: expected:<[+02:00:00]> but was:<[Z]>
	at junit.framework.Assert.assertEquals(Assert.java:81)
	at junit.framework.Assert.assertEquals(Assert.java:87)
	at org.joda.time.format.TestDateTimeFormatterBuilder.assertPrint(TestDateTimeFormatterBuilder.java:672)
	at org.joda.time.format.TestDateTimeFormatterBuilder.test_appendTimeZoneOffset_print_min3max3(TestDateTimeFormatterBuilder.java:368)

test_appendTimeZoneId(org.joda.time.format.TestDateTimeFormatterBuilder)  Time elapsed: 0 sec  <<< FAILURE!
junit.framework.ComparisonFailure: expected:<[Asia/Tokyo]> but was:<[Europe/London]>
	at junit.framework.Assert.assertEquals(Assert.java:81)
	at junit.framework.Assert.assertEquals(Assert.java:87)
	at org.joda.time.format.TestDateTimeFormatterBuilder.test_appendTimeZoneId(TestDateTimeFormatterBuilder.java:398)

test_printParseZoneTokyo(org.joda.time.format.TestDateTimeFormatterBuilder)  Time elapsed: 0.001 sec  <<< FAILURE!
junit.framework.ComparisonFailure: expected:<2007-03-04 12:30 [Asia/Tokyo]> but was:<2007-03-04 12:30 [Europe/London]>
	at junit.framework.Assert.assertEquals(Assert.java:81)
	at junit.framework.Assert.assertEquals(Assert.java:87)
	at org.joda.time.format.TestDateTimeFormatterBuilder.test_printParseZoneTokyo(TestDateTimeFormatterBuilder.java:413)

test_printParseZoneParis(org.joda.time.format.TestDateTimeFormatterBuilder)  Time elapsed: 0 sec  <<< FAILURE!
junit.framework.ComparisonFailure: expected:<...-03-04 12:30 Europe/[Paris]> but was:<...-03-04 12:30 Europe/[London]>
	at junit.framework.Assert.assertEquals(Assert.java:81)
	at junit.framework.Assert.assertEquals(Assert.java:87)
	at org.joda.time.format.TestDateTimeFormatterBuilder.test_printParseZoneParis(TestDateTimeFormatterBuilder.java:423)

test_printParseZoneDawsonCreek(org.joda.time.format.TestDateTimeFormatterBuilder)  Time elapsed: 0.001 sec  <<< FAILURE!
junit.framework.ComparisonFailure: expected:<2007-03-04 12:30 [America/Dawson_Creek]> but was:<2007-03-04 12:30 [Europe/London]>
	at junit.framework.Assert.assertEquals(Assert.java:81)
	at junit.framework.Assert.assertEquals(Assert.java:87)
	at org.joda.time.format.TestDateTimeFormatterBuilder.test_printParseZoneDawsonCreek(TestDateTimeFormatterBuilder.java:434)

test_printParseZoneBahiaBanderas(org.joda.time.format.TestDateTimeFormatterBuilder)  Time elapsed: 0.001 sec  <<< FAILURE!
junit.framework.ComparisonFailure: expected:<2007-03-04 12:30 [America/Bahia_Banderas]> but was:<2007-03-04 12:30 [Europe/London]>
	at junit.framework.Assert.assertEquals(Assert.java:81)
	at junit.framework.Assert.assertEquals(Assert.java:87)
	at org.joda.time.format.TestDateTimeFormatterBuilder.test_printParseZoneBahiaBanderas(TestDateTimeFormatterBuilder.java:444)

test_printParseOffset(org.joda.time.format.TestDateTimeFormatterBuilder)  Time elapsed: 0.001 sec  <<< FAILURE!
junit.framework.ComparisonFailure: expected:<2007-03-04 12:30 [+09:00]> but was:<2007-03-04 12:30 [Z]>
	at junit.framework.Assert.assertEquals(Assert.java:81)
	at junit.framework.Assert.assertEquals(Assert.java:87)
	at org.joda.time.format.TestDateTimeFormatterBuilder.test_printParseOffset(TestDateTimeFormatterBuilder.java:454)

test_printParseOffsetAndZone(org.joda.time.format.TestDateTimeFormatterBuilder)  Time elapsed: 0 sec  <<< FAILURE!
junit.framework.ComparisonFailure: expected:<2007-03-04 12:30 [+09:00 Asia/Tokyo]> but was:<2007-03-04 12:30 [Z Europe/London]>
	at junit.framework.Assert.assertEquals(Assert.java:81)
	at junit.framework.Assert.assertEquals(Assert.java:87)
	at org.joda.time.format.TestDateTimeFormatterBuilder.test_printParseOffsetAndZone(TestDateTimeFormatterBuilder.java:466)

test_parseWrongOffset(org.joda.time.format.TestDateTimeFormatterBuilder)  Time elapsed: 0.001 sec  <<< FAILURE!
junit.framework.AssertionFailedError: expected:<2007-03-04T12:30:00.000Z> but was:<2007-03-04T05:30:00.000Z>
	at junit.framework.Assert.fail(Assert.java:47)
	at junit.framework.Assert.failNotEquals(Assert.java:280)
	at junit.framework.Assert.assertEquals(Assert.java:64)
	at junit.framework.Assert.assertEquals(Assert.java:71)
	at org.joda.time.format.TestDateTimeFormatterBuilder.test_parseWrongOffset(TestDateTimeFormatterBuilder.java:479)

test_parseWrongOffsetAndZone(org.joda.time.format.TestDateTimeFormatterBuilder)  Time elapsed: 0.001 sec  <<< FAILURE!
junit.framework.AssertionFailedError: expected:<2007-03-04T12:30:00.000Z> but was:<2007-03-04T05:30:00.000Z>
	at junit.framework.Assert.fail(Assert.java:47)
	at junit.framework.Assert.failNotEquals(Assert.java:280)
	at junit.framework.Assert.assertEquals(Assert.java:64)
	at junit.framework.Assert.assertEquals(Assert.java:71)
	at org.joda.time.format.TestDateTimeFormatterBuilder.test_parseWrongOffsetAndZone(TestDateTimeFormatterBuilder.java:493)

test_localPrintParseZoneTokyo(org.joda.time.format.TestDateTimeFormatterBuilder)  Time elapsed: 0 sec  <<< FAILURE!
junit.framework.ComparisonFailure: expected:<2007-03-04 12:30 [Asia/Tokyo]> but was:<2007-03-04 12:30 [Europe/London]>
	at junit.framework.Assert.assertEquals(Assert.java:81)
	at junit.framework.Assert.assertEquals(Assert.java:87)
	at org.joda.time.format.TestDateTimeFormatterBuilder.test_localPrintParseZoneTokyo(TestDateTimeFormatterBuilder.java:507)

test_localPrintParseOffset(org.joda.time.format.TestDateTimeFormatterBuilder)  Time elapsed: 0.001 sec  <<< FAILURE!
junit.framework.ComparisonFailure: expected:<2007-03-04 12:30 [+09:00]> but was:<2007-03-04 12:30 [Z]>
	at junit.framework.Assert.assertEquals(Assert.java:81)
	at junit.framework.Assert.assertEquals(Assert.java:87)
	at org.joda.time.format.TestDateTimeFormatterBuilder.test_localPrintParseOffset(TestDateTimeFormatterBuilder.java:519)

test_localPrintParseOffsetAndZone(org.joda.time.format.TestDateTimeFormatterBuilder)  Time elapsed: 0 sec  <<< FAILURE!
junit.framework.ComparisonFailure: expected:<2007-03-04 12:30 [+09:00 Asia/Tokyo]> but was:<2007-03-04 12:30 [Z Europe/London]>
	at junit.framework.Assert.assertEquals(Assert.java:81)
	at junit.framework.Assert.assertEquals(Assert.java:87)
	at org.joda.time.format.TestDateTimeFormatterBuilder.test_localPrintParseOffsetAndZone(TestDateTimeFormatterBuilder.java:533)

test_localParseWrongOffsetAndZone(org.joda.time.format.TestDateTimeFormatterBuilder)  Time elapsed: 0.002 sec  <<< FAILURE!
junit.framework.AssertionFailedError: expected:<2007-03-04T12:30:00.000> but was:<2007-03-04T05:30:00.000>
	at junit.framework.Assert.fail(Assert.java:47)
	at junit.framework.Assert.failNotEquals(Assert.java:280)
	at junit.framework.Assert.assertEquals(Assert.java:64)
	at junit.framework.Assert.assertEquals(Assert.java:71)
	at org.joda.time.format.TestDateTimeFormatterBuilder.test_localParseWrongOffsetAndZone(TestDateTimeFormatterBuilder.java:547)

test_printParseShortNameWithAutoLookup(org.joda.time.format.TestDateTimeFormatterBuilder)  Time elapsed: 0.001 sec  <<< FAILURE!
junit.framework.ComparisonFailure: expected:<2011-01-04 12:30 [ES]T> but was:<2011-01-04 12:30 [GM]T>
	at junit.framework.Assert.assertEquals(Assert.java:81)
	at junit.framework.Assert.assertEquals(Assert.java:87)
	at org.joda.time.format.TestDateTimeFormatterBuilder.test_printParseShortNameWithAutoLookup(TestDateTimeFormatterBuilder.java:605)

test_Amman_2003(org.joda.time.tz.TestCompiler)  Time elapsed: 0 sec  <<< FAILURE!
junit.framework.AssertionFailedError: expected:<1048802400000> but was:<1048809600000>
	at junit.framework.Assert.fail(Assert.java:47)
	at junit.framework.Assert.failNotEquals(Assert.java:280)
	at junit.framework.Assert.assertEquals(Assert.java:64)
	at junit.framework.Assert.assertEquals(Assert.java:133)
	at junit.framework.Assert.assertEquals(Assert.java:139)
	at org.joda.time.tz.TestCompiler.test_Amman_2003(TestCompiler.java:210)

test_Amman_2004(org.joda.time.tz.TestCompiler)  Time elapsed: 0.001 sec  <<< FAILURE!
junit.framework.AssertionFailedError: expected:<1080252000000> but was:<1080259200000>
	at junit.framework.Assert.fail(Assert.java:47)
	at junit.framework.Assert.failNotEquals(Assert.java:280)
	at junit.framework.Assert.assertEquals(Assert.java:64)
	at junit.framework.Assert.assertEquals(Assert.java:133)
	at junit.framework.Assert.assertEquals(Assert.java:139)
	at org.joda.time.tz.TestCompiler.test_Amman_2004(TestCompiler.java:217)

test_Amman_2005(org.joda.time.tz.TestCompiler)  Time elapsed: 0 sec  <<< FAILURE!
junit.framework.AssertionFailedError: expected:<1112306400000> but was:<1112313600000>
	at junit.framework.Assert.fail(Assert.java:47)
	at junit.framework.Assert.failNotEquals(Assert.java:280)
	at junit.framework.Assert.assertEquals(Assert.java:64)
	at junit.framework.Assert.assertEquals(Assert.java:133)
	at junit.framework.Assert.assertEquals(Assert.java:139)
	at org.joda.time.tz.TestCompiler.test_Amman_2005(TestCompiler.java:224)

test_Amman_2006(org.joda.time.tz.TestCompiler)  Time elapsed: 0 sec  <<< FAILURE!
junit.framework.AssertionFailedError: expected:<1143756000000> but was:<1143763200000>
	at junit.framework.Assert.fail(Assert.java:47)
	at junit.framework.Assert.failNotEquals(Assert.java:280)
	at junit.framework.Assert.assertEquals(Assert.java:64)
	at junit.framework.Assert.assertEquals(Assert.java:133)
	at junit.framework.Assert.assertEquals(Assert.java:139)
	at org.joda.time.tz.TestCompiler.test_Amman_2006(TestCompiler.java:231)


Results :

Failed tests: 
  org.joda.time.TestChronology#testToString ComparisonFailure expected:<...SOChr...
  org.joda.time.TestDateMidnight_Basics#testIsBefore AssertionFailedError expect...
  org.joda.time.TestDateMidnight_Basics#testIsEqual AssertionFailedError expecte...
  org.joda.time.TestDateMidnight_Basics#testToCalendar_Locale AssertionFailedError
  org.joda.time.TestDateMidnight_Basics#testToDateTime AssertionFailedError expe...
  org.joda.time.TestDateMidnight_Basics#testToDateTime_DateTimeZone AssertionFailedError
  org.joda.time.TestDateMidnight_Basics#testToGregorianCalendar AssertionFailedError
  org.joda.time.TestDateMidnight_Basics#testToString ComparisonFailure expected:...
  org.joda.time.TestDateMidnight_Basics#testWithZoneRetainFields_DateTimeZone AssertionFailedError
  org.joda.time.TestDateMidnight_Constructors#testConstructor_DateTimeZone AssertionFailedError
  org.joda.time.TestDateMidnight_Constructors#testConstructor_Object_DateTimeZone AssertionFailedError
  org.joda.time.TestDateMidnight_Constructors#testConstructor_int_int_int_DateTimeZone AssertionFailedError
  org.joda.time.TestDateMidnight_Constructors#testConstructor_long1_DateTimeZone AssertionFailedError
  org.joda.time.TestDateMidnight_Constructors#testConstructor_long2_DateTimeZone AssertionFailedError
  org.joda.time.TestDateMidnight_Constructors#testConstructor_nullObject_DateTimeZone AssertionFailedError
  org.joda.time.TestDateMidnight_Constructors#test_now_DateTimeZone AssertionFailedError
  org.joda.time.TestDateTimeUtils#test_julianDay AssertionFailedError expected:<...
  org.joda.time.TestDateTimeZone#testCommentParse AssertionFailedError expected:...
  org.joda.time.TestDateTimeZone#testIsLocalDateTimeGap_Berlin AssertionFailedError
  org.joda.time.TestDateTimeZone#testIsLocalDateTimeGap_NewYork AssertionFailedError
  org.joda.time.TestDateTimeZoneCutover#testBug3192457_adjustOffset AssertionFailedError
  org.joda.time.TestDateTimeZoneCutover#testBug3476684_adjustOffset AssertionFailedError
  org.joda.time.TestDateTimeZoneCutover#testDateTimeCreation_athens ComparisonFailure
  org.joda.time.TestDateTimeZoneCutover#testDateTimeCreation_losAngeles ComparisonFailure
  org.joda.time.TestDateTimeZoneCutover#testDateTimeCreation_newYork ComparisonFailure
  org.joda.time.TestDateTimeZoneCutover#testDateTimeCreation_paris ComparisonFailure
  org.joda.time.TestDateTimeZoneCutover#testPlusMillisInDstChange ComparisonFailure
  org.joda.time.TestDateTimeZoneCutover#testPlusMinutesInDstChange ComparisonFailure
  org.joda.time.TestDateTimeZoneCutover#testPlusSecondsInDstChange ComparisonFailure
  org.joda.time.TestDateTimeZoneCutover#testWithHourOfDayInDstChange ComparisonFailure
  org.joda.time.TestDateTimeZoneCutover#testWithMillisOfSecondInDstChange_NewYork_summer ComparisonFailure
  org.joda.time.TestDateTimeZoneCutover#testWithMillisOfSecondInDstChange_NewYork_winter ComparisonFailure
  org.joda.time.TestDateTimeZoneCutover#testWithMillisOfSecondInDstChange_Paris_summer ComparisonFailure
  org.joda.time.TestDateTimeZoneCutover#testWithMillisOfSecondInDstChange_Paris_winter ComparisonFailure
  org.joda.time.TestDateTimeZoneCutover#testWithMinuteOfHourInDstChange ComparisonFailure
  org.joda.time.TestDateTimeZoneCutover#testWithMinuteOfHourInDstChange_mockZone ComparisonFailure
  org.joda.time.TestDateTimeZoneCutover#testWithSecondOfMinuteInDstChange ComparisonFailure
  org.joda.time.TestDateTimeZoneCutover#test_DateTime_JustAfterLastEverOverlap ComparisonFailure
  org.joda.time.TestDateTimeZoneCutover#test_DateTime_addWrapFieldDay_Gaza ComparisonFailure
  org.joda.time.TestDateTimeZoneCutover#test_DateTime_addWrapFieldDay_Turk ComparisonFailure
  org.joda.time.TestDateTimeZoneCutover#test_DateTime_constructor_Moscow_Autumn ComparisonFailure
  org.joda.time.TestDateTimeZoneCutover#test_DateTime_constructor_NewYork_Autumn ComparisonFailure
  org.joda.time.TestDateTimeZoneCutover#test_DateTime_minusDay_Gaza ComparisonFailure
  org.joda.time.TestDateTimeZoneCutover#test_DateTime_minusDay_Turk ComparisonFailure
  org.joda.time.TestDateTimeZoneCutover#test_DateTime_minusHour_Gaza ComparisonFailure
  org.joda.time.TestDateTimeZoneCutover#test_DateTime_minusHour_Guatemata_Autumn ComparisonFailure
  org.joda.time.TestDateTimeZoneCutover#test_DateTime_minusHour_Moscow_Autumn ComparisonFailure
  org.joda.time.TestDateTimeZoneCutover#test_DateTime_minusHour_NewYork_Autumn ComparisonFailure
  org.joda.time.TestDateTimeZoneCutover#test_DateTime_minusHour_Turk ComparisonFailure
  org.joda.time.TestDateTimeZoneCutover#test_DateTime_new_Gaza AssertionFailedError
  org.joda.time.TestDateTimeZoneCutover#test_DateTime_new_Turk AssertionFailedError
  org.joda.time.TestDateTimeZoneCutover#test_DateTime_parse_Gaza AssertionFailedError
  org.joda.time.TestDateTimeZoneCutover#test_DateTime_parse_Turk AssertionFailedError
  org.joda.time.TestDateTimeZoneCutover#test_DateTime_plusDayMidGap_Gaza ComparisonFailure
  org.joda.time.TestDateTimeZoneCutover#test_DateTime_plusDayMidGap_Turk ComparisonFailure
  org.joda.time.TestDateTimeZoneCutover#test_DateTime_plusDay_Gaza ComparisonFailure
  org.joda.time.TestDateTimeZoneCutover#test_DateTime_plusDay_Turk ComparisonFailure
  org.joda.time.TestDateTimeZoneCutover#test_DateTime_plusHour_Gaza ComparisonFailure
  org.joda.time.TestDateTimeZoneCutover#test_DateTime_plusHour_Guatemata_Autumn ComparisonFailure
  org.joda.time.TestDateTimeZoneCutover#test_DateTime_plusHour_Moscow_Autumn ComparisonFailure
  org.joda.time.TestDateTimeZoneCutover#test_DateTime_plusHour_NewYork_Autumn ComparisonFailure
  org.joda.time.TestDateTimeZoneCutover#test_DateTime_plusHour_Turk ComparisonFailure
  org.joda.time.TestDateTimeZoneCutover#test_DateTime_roundCeiling_Gaza ComparisonFailure
  org.joda.time.TestDateTimeZoneCutover#test_DateTime_roundCeiling_Turk ComparisonFailure
  org.joda.time.TestDateTimeZoneCutover#test_DateTime_roundCeiling_day_NewYork_Autumn_postCutover ComparisonFailure
  org.joda.time.TestDateTimeZoneCutover#test_DateTime_roundCeiling_day_NewYork_Autumn_preCutover ComparisonFailure
  org.joda.time.TestDateTimeZoneCutover#test_DateTime_roundCeiling_day_NewYork_Spring_postCutover ComparisonFailure
  org.joda.time.TestDateTimeZoneCutover#test_DateTime_roundCeiling_day_NewYork_Spring_preCutover ComparisonFailure
  org.joda.time.TestDateTimeZoneCutover#test_DateTime_roundCeiling_hourOfDay_NewYork_Autumn_postCutover ComparisonFailure
  org.joda.time.TestDateTimeZoneCutover#test_DateTime_roundCeiling_hourOfDay_NewYork_Autumn_preCutover ComparisonFailure
  org.joda.time.TestDateTimeZoneCutover#test_DateTime_roundCeiling_hour_NewYork_Spring_postCutover ComparisonFailure
  org.joda.time.TestDateTimeZoneCutover#test_DateTime_roundCeiling_hour_NewYork_Spring_preCutover ComparisonFailure
  org.joda.time.TestDateTimeZoneCutover#test_DateTime_roundCeiling_minuteOfHour_NewYork_Autumn_postCutover ComparisonFailure
  org.joda.time.TestDateTimeZoneCutover#test_DateTime_roundCeiling_minuteOfHour_NewYork_Autumn_preCutover ComparisonFailure
  org.joda.time.TestDateTimeZoneCutover#test_DateTime_roundCeiling_minute_NewYork_Spring_postCutover ComparisonFailure
  org.joda.time.TestDateTimeZoneCutover#test_DateTime_roundCeiling_minute_NewYork_Spring_preCutover ComparisonFailure
  org.joda.time.TestDateTimeZoneCutover#test_DateTime_roundCeiling_secondOfMinute_NewYork_Autumn_postCutover ComparisonFailure
  org.joda.time.TestDateTimeZoneCutover#test_DateTime_roundCeiling_secondOfMinute_NewYork_Autumn_preCutover ComparisonFailure
  org.joda.time.TestDateTimeZoneCutover#test_DateTime_roundFloorNotDST_Turk ComparisonFailure
  org.joda.time.TestDateTimeZoneCutover#test_DateTime_roundFloor_Gaza ComparisonFailure
  org.joda.time.TestDateTimeZoneCutover#test_DateTime_roundFloor_Turk ComparisonFailure
  org.joda.time.TestDateTimeZoneCutover#test_DateTime_roundFloor_day_NewYork_Autumn_postCutover ComparisonFailure
  org.joda.time.TestDateTimeZoneCutover#test_DateTime_roundFloor_day_NewYork_Autumn_preCutover ComparisonFailure
  org.joda.time.TestDateTimeZoneCutover#test_DateTime_roundFloor_day_NewYork_Spring_postCutover ComparisonFailure
  org.joda.time.TestDateTimeZoneCutover#test_DateTime_roundFloor_day_NewYork_Spring_preCutover ComparisonFailure
  org.joda.time.TestDateTimeZoneCutover#test_DateTime_roundFloor_hourOfDay_NewYork_Autumn_postCutover ComparisonFailure
  org.joda.time.TestDateTimeZoneCutover#test_DateTime_roundFloor_hourOfDay_NewYork_Autumn_preCutover ComparisonFailure
  org.joda.time.TestDateTimeZoneCutover#test_DateTime_roundFloor_hour_NewYork_Spring_postCutover ComparisonFailure
  org.joda.time.TestDateTimeZoneCutover#test_DateTime_roundFloor_hour_NewYork_Spring_preCutover ComparisonFailure
  org.joda.time.TestDateTimeZoneCutover#test_DateTime_roundFloor_minuteOfHour_NewYork_Autumn_postCutover ComparisonFailure
  org.joda.time.TestDateTimeZoneCutover#test_DateTime_roundFloor_minuteOfHour_NewYork_Autumn_preCutover ComparisonFailure
  org.joda.time.TestDateTimeZoneCutover#test_DateTime_roundFloor_minute_NewYork_Spring_postCutover ComparisonFailure
  org.joda.time.TestDateTimeZoneCutover#test_DateTime_roundFloor_minute_NewYork_Spring_preCutover ComparisonFailure
  org.joda.time.TestDateTimeZoneCutover#test_DateTime_roundFloor_secondOfMinute_NewYork_Autumn_postCutover ComparisonFailure
  org.joda.time.TestDateTimeZoneCutover#test_DateTime_roundFloor_secondOfMinute_NewYork_Autumn_preCutover ComparisonFailure
  org.joda.time.TestDateTimeZoneCutover#test_DateTime_setHourAcross_Moscow_Spring ComparisonFailure
  org.joda.time.TestDateTimeZoneCutover#test_DateTime_setHourAcross_NewYork_Spring ComparisonFailure
  org.joda.time.TestDateTimeZoneCutover#test_DateTime_setHourBack_Moscow_Spring ComparisonFailure
  org.joda.time.TestDateTimeZoneCutover#test_DateTime_setHourBack_NewYork_Spring ComparisonFailure
  org.joda.time.TestDateTimeZoneCutover#test_DateTime_setHourForward_Moscow_Spring ComparisonFailure
  org.joda.time.TestDateTimeZoneCutover#test_DateTime_setHourForward_NewYork_Spring ComparisonFailure
  org.joda.time.TestDateTimeZoneCutover#test_DateTime_setHourZero_Gaza ComparisonFailure
  org.joda.time.TestDateTimeZoneCutover#test_DateTime_setHourZero_Turk ComparisonFailure
  org.joda.time.TestDateTimeZoneCutover#test_DateTime_withDay_Gaza ComparisonFailure
  org.joda.time.TestDateTimeZoneCutover#test_DateTime_withDay_Turk ComparisonFailure
  org.joda.time.TestDateTimeZoneCutover#test_DateTime_withHourZero_Gaza ComparisonFailure
  org.joda.time.TestDateTimeZoneCutover#test_DateTime_withHourZero_Turk ComparisonFailure
  org.joda.time.TestDateTimeZoneCutover#test_DateTime_withZoneRetainFields_Gaza ComparisonFailure
  org.joda.time.TestDateTimeZoneCutover#test_DateTime_withZoneRetainFields_Turk ComparisonFailure
  org.joda.time.TestDateTimeZoneCutover#test_GuatemataIsCorrect_Autumn ComparisonFailure
  org.joda.time.TestDateTimeZoneCutover#test_LocalDate_new_Gaza ComparisonFailure
  org.joda.time.TestDateTimeZoneCutover#test_LocalDate_new_Turk ComparisonFailure
  org.joda.time.TestDateTimeZoneCutover#test_LocalDate_toDateMidnight_Gaza AssertionFailedError
  org.joda.time.TestDateTimeZoneCutover#test_LocalDate_toDateMidnight_Turk AssertionFailedError
  org.joda.time.TestDateTimeZoneCutover#test_MockGazaIsCorrect ComparisonFailure
  org.joda.time.TestDateTimeZoneCutover#test_MockTurkIsCorrect ComparisonFailure
  org.joda.time.TestDateTimeZoneCutover#test_MoscowIsCorrect_Autumn ComparisonFailure
  org.joda.time.TestDateTimeZoneCutover#test_MoscowIsCorrect_Spring ComparisonFailure
  org.joda.time.TestDateTimeZoneCutover#test_MutableDateTime_setZoneRetainFields_Turk ComparisonFailure
  org.joda.time.TestDateTimeZoneCutover#test_MutableDateTime_withZoneRetainFields_Gaza ComparisonFailure
  org.joda.time.TestDateTimeZoneCutover#test_NewYorkIsCorrect_Autumn ComparisonFailure
  org.joda.time.TestDateTimeZoneCutover#test_NewYorkIsCorrect_Spring ComparisonFailure
  org.joda.time.TestDateTimeZoneCutover#test_RioBrancoIsCorrect_Spring ComparisonFailure
  org.joda.time.TestDateTimeZoneCutover#test_getOffsetFromLocal_Gaza ComparisonFailure
  org.joda.time.TestDateTimeZoneCutover#test_getOffsetFromLocal_Guatemata_Autumn ComparisonFailure
  org.joda.time.TestDateTimeZoneCutover#test_getOffsetFromLocal_Moscow_Autumn ComparisonFailure
  org.joda.time.TestDateTimeZoneCutover#test_getOffsetFromLocal_Moscow_Autumn_overlap_mins ComparisonFailure
  org.joda.time.TestDateTimeZoneCutover#test_getOffsetFromLocal_NewYork_Autumn ComparisonFailure
  org.joda.time.TestDateTimeZoneCutover#test_getOffsetFromLocal_NewYork_Spring ComparisonFailure
  org.joda.time.TestDateTimeZoneCutover#test_getOffsetFromLocal_RioBranco_Spring ComparisonFailure
  org.joda.time.TestDateTimeZoneCutover#test_getOffsetFromLocal_Turk ComparisonFailure
  org.joda.time.TestDateTime_Basics#testToCalendar_Locale AssertionFailedError e...
  org.joda.time.TestDateTime_Basics#testToDateTimeISO AssertionFailedError expec...
  org.joda.time.TestDateTime_Basics#testToDateTime_DateTimeZone AssertionFailedError
  org.joda.time.TestDateTime_Basics#testToGregorianCalendar AssertionFailedError
  org.joda.time.TestDateTime_Basics#testToString ComparisonFailure expected:<200...
  org.joda.time.TestDateTime_Basics#testWithDate_int_int_int_toDST1 AssertionFailedError
  org.joda.time.TestDateTime_Basics#testWithDate_int_int_int_toDST2 AssertionFailedError
  org.joda.time.TestDateTime_Basics#testWithTime_int_int_int_int_toDST AssertionFailedError
  org.joda.time.TestDateTime_Constructors#testConstructor_int_int_int_int_int_DateTimeZone AssertionFailedError
  org.joda.time.TestDateTime_Constructors#testConstructor_int_int_int_int_int_int_DateTimeZone AssertionFailedError
  org.joda.time.TestDateTime_Constructors#testConstructor_int_int_int_int_int_int_int_DateTimeZone AssertionFailedError
  org.joda.time.TestDateTime_Constructors#testParse_noFormatter AssertionFailedError
  org.joda.time.TestDateTime_Constructors#testParse_noFormatter_vs_constructor_correctOffset AssertionFailedError
  org.joda.time.TestDateTime_Properties#testPropertyWithMaximumValueMillisOfDayDSTGap ComparisonFailure
  org.joda.time.TestDateTime_Properties#testPropertyWithMinimumValueMillisOfDayDSTGap ComparisonFailure
  org.joda.time.TestIllegalFieldValueException#testZoneTransition AssertionFailedError
  org.joda.time.TestInterval_Basics#testToString ComparisonFailure expected:<......
  org.joda.time.TestLocalDateTime_Constructors#testConstructor_DateTimeZone AssertionFailedError
  org.joda.time.TestLocalDateTime_Constructors#testConstructor_Object_DateTimeZone AssertionFailedError
  org.joda.time.TestLocalDateTime_Constructors#testConstructor_long1_DateTimeZone AssertionFailedError
  org.joda.time.TestLocalDateTime_Constructors#testConstructor_long2_DateTimeZone AssertionFailedError
  org.joda.time.TestLocalDateTime_Constructors#testConstructor_nullObject_DateTimeZone AssertionFailedError
  org.joda.time.TestLocalDate_Basics#testToDateTimeAtStartOfDay_Zone_avoidDST AssertionFailedError
  org.joda.time.TestLocalDate_Basics#testToInterval_Zone_noMidnight AssertionFailedError
  org.joda.time.TestLocalDate_Constructors#testConstructor_DateTimeZone AssertionFailedError
  org.joda.time.TestLocalDate_Constructors#testConstructor_long3_DateTimeZone AssertionFailedError
  org.joda.time.TestLocalDate_Constructors#testConstructor_long4_DateTimeZone AssertionFailedError
  org.joda.time.TestLocalTime_Constructors#testConstructor_DateTimeZone AssertionFailedError
  org.joda.time.TestLocalTime_Constructors#testConstructor_long_DateTimeZone_2 AssertionFailedError
  org.joda.time.TestMonthDay_Constructors#testConstructor_DateTimeZone AssertionFailedError
  org.joda.time.TestMutableDateTime_Adds#testAddDays_int_dstOverlapSummer_addZero ComparisonFailure
  org.joda.time.TestMutableDateTime_Adds#testAddDays_int_dstOverlapWinter_addZero ComparisonFailure
  org.joda.time.TestMutableDateTime_Adds#testAddHours_int_dstOverlapSummer_addZero ComparisonFailure
  org.joda.time.TestMutableDateTime_Adds#testAddHours_int_dstOverlapWinter_addZero ComparisonFailure
  org.joda.time.TestMutableDateTime_Adds#testAddMillis_int_dstOverlapSummer_addZero ComparisonFailure
  org.joda.time.TestMutableDateTime_Adds#testAddMillis_int_dstOverlapWinter_addZero ComparisonFailure
  org.joda.time.TestMutableDateTime_Adds#testAddMinutes_int_dstOverlapSummer_addZero ComparisonFailure
  org.joda.time.TestMutableDateTime_Adds#testAddMinutes_int_dstOverlapWinter_addZero ComparisonFailure
  org.joda.time.TestMutableDateTime_Adds#testAddMonths_int_dstOverlapSummer_addZero ComparisonFailure
  org.joda.time.TestMutableDateTime_Adds#testAddMonths_int_dstOverlapWinter_addZero ComparisonFailure
  org.joda.time.TestMutableDateTime_Adds#testAddSeconds_int_dstOverlapSummer_addZero ComparisonFailure
  org.joda.time.TestMutableDateTime_Adds#testAddSeconds_int_dstOverlapWinter_addZero ComparisonFailure
  org.joda.time.TestMutableDateTime_Adds#testAddWeeks_int_dstOverlapSummer_addZero ComparisonFailure
  org.joda.time.TestMutableDateTime_Adds#testAddWeeks_int_dstOverlapWinter_addZero ComparisonFailure
  org.joda.time.TestMutableDateTime_Adds#testAddYears_int_dstOverlapSummer_addZero ComparisonFailure
  org.joda.time.TestMutableDateTime_Adds#testAddYears_int_dstOverlapWinter_addZero ComparisonFailure
  org.joda.time.TestMutableDateTime_Adds#testAdd_DurationFieldType_int_dstOverlapSummer_addZero ComparisonFailure
  org.joda.time.TestMutableDateTime_Adds#testAdd_DurationFieldType_int_dstOverlapWinter_addZero ComparisonFailure
  org.joda.time.TestMutableDateTime_Basics#testToCalendar_Locale AssertionFailedError
  org.joda.time.TestMutableDateTime_Basics#testToDateTime_DateTimeZone AssertionFailedError
  org.joda.time.TestMutableDateTime_Basics#testToGregorianCalendar AssertionFailedError
  org.joda.time.TestMutableDateTime_Basics#testToString ComparisonFailure expect...
  org.joda.time.TestMutableDateTime_Constructors#testConstructor_int_int_int_int_int_int_int_DateTimeZone AssertionFailedError
  org.joda.time.TestMutableDateTime_Constructors#testParse_noFormatter AssertionFailedError
  org.joda.time.TestMutableDateTime_Sets#testSetDayOfMonth_int_dstOverlapSummer_addZero ComparisonFailure
  org.joda.time.TestMutableDateTime_Sets#testSetDayOfMonth_int_dstOverlapWinter_addZero ComparisonFailure
  org.joda.time.TestMutableDateTime_Sets#testSetDayOfYear_int_dstOverlapSummer_addZero ComparisonFailure
  org.joda.time.TestMutableDateTime_Sets#testSetDayOfYear_int_dstOverlapWinter_addZero ComparisonFailure
  org.joda.time.TestMutableDateTime_Sets#testSetMonthOfYear_int_dstOverlapSummer_addZero ComparisonFailure
  org.joda.time.TestMutableDateTime_Sets#testSetMonthOfYear_int_dstOverlapWinter_addZero ComparisonFailure
  org.joda.time.TestMutableInterval_Basics#testToString ComparisonFailure expect...
  org.joda.time.TestPeriod_Constructors#testConstructor_RI_RI7 AssertionFailedError
  org.joda.time.TestSerialization#testSerializedTimeOfDay AssertionFailedError e...
  org.joda.time.TestSerialization#testSerializedYearMonthDay AssertionFailedError
  org.joda.time.TestStringConvert#testDateMidnight ComparisonFailure expected:<....
  org.joda.time.TestStringConvert#testDateTime ComparisonFailure expected:<...06...
  org.joda.time.TestStringConvert#testMutableDateTime ComparisonFailure expected...
  org.joda.time.TestTimeOfDay_Constructors#testConstructor_DateTimeZone AssertionFailedError
  org.joda.time.TestYearMonthDay_Constructors#testConstructor_DateTimeZone AssertionFailedError
  org.joda.time.TestYearMonth_Constructors#testConstructor_DateTimeZone AssertionFailedError
  org.joda.time.chrono.TestCopticChronology#testSampleDateWithZone AssertionFailedError
  org.joda.time.chrono.TestEthiopicChronology#testSampleDateWithZone AssertionFailedError
  org.joda.time.chrono.TestGJChronology#testFactory_Zone_RI AssertionFailedError
  org.joda.time.chrono.TestGJChronology#testFactory_Zone_RI_int AssertionFailedError
  org.joda.time.chrono.TestISOChronology#testDurationFields AssertionFailedError
  org.joda.time.chrono.TestISOChronology#testFactory_Zone AssertionFailedError e...
  org.joda.time.chrono.TestISOChronology#testToString ComparisonFailure expected...
  org.joda.time.chrono.TestIslamicChronology#testSampleDateWithZone AssertionFailedError
  org.joda.time.chrono.TestLenientChronology#test_MockTurkIsCorrect ComparisonFailure
  org.joda.time.chrono.TestLenientChronology#test_isoChrononolgy_Chicago AssertionFailedError
  org.joda.time.chrono.TestLenientChronology#test_lenientChrononolgy_Chicago ComparisonFailure
  org.joda.time.chrono.TestLenientChronology#test_lenientChrononolgy_Turk ComparisonFailure
  org.joda.time.chrono.TestLenientChronology#test_strictChrononolgy_Chicago AssertionFailedError
  org.joda.time.convert.TestStringConverter#testGetDateTime3 AssertionFailedError
  org.joda.time.convert.TestStringConverter#testGetDateTime4 AssertionFailedError
  org.joda.time.convert.TestStringConverter#testGetInstantMillis_Object AssertionFailedError
  org.joda.time.convert.TestStringConverter#testGetInstantMillis_Object_Zone AssertionFailedError
  org.joda.time.convert.TestStringConverter#testSetIntoInterval_Object_Chronology4 AssertionFailedError
  org.joda.time.convert.TestStringConverter#testSetIntoInterval_Object_Chronology5 AssertionFailedError
  org.joda.time.convert.TestStringConverter#testSetIntoInterval_Object_Chronology6 AssertionFailedError
  org.joda.time.format.TestDateTimeFormat#testFormatParse_zoneId_colon ComparisonFailure
  org.joda.time.format.TestDateTimeFormat#testFormatParse_zoneId_colon_parseZ AssertionFailedError
  org.joda.time.format.TestDateTimeFormat#testFormatParse_zoneId_noColon ComparisonFailure
  org.joda.time.format.TestDateTimeFormat#testFormatParse_zoneId_noColon_parseZ AssertionFailedError
  org.joda.time.format.TestDateTimeFormat#testFormat_clockhourOfDay ComparisonFailure
  org.joda.time.format.TestDateTimeFormat#testFormat_clockhourOfHalfday ComparisonFailure
  org.joda.time.format.TestDateTimeFormat#testFormat_halfdayOfDay ComparisonFailure
  org.joda.time.format.TestDateTimeFormat#testFormat_hourOfDay ComparisonFailure
  org.joda.time.format.TestDateTimeFormat#testFormat_hourOfHalfday ComparisonFailure
  org.joda.time.format.TestDateTimeFormat#testFormat_zoneAmount ComparisonFailure
  org.joda.time.format.TestDateTimeFormat#testFormat_zoneAmountColon ComparisonFailure
  org.joda.time.format.TestDateTimeFormat#testFormat_zoneAmountID ComparisonFailure
  org.joda.time.format.TestDateTimeFormat#testFormat_zoneLongText ComparisonFailure
  org.joda.time.format.TestDateTimeFormat#testFormat_zoneText ComparisonFailure ...
  org.joda.time.format.TestDateTimeFormatter#testParseDateTime_chrono AssertionFailedError
  org.joda.time.format.TestDateTimeFormatter#testParseDateTime_offsetParsed AssertionFailedError
  org.joda.time.format.TestDateTimeFormatter#testParseDateTime_zone AssertionFailedError
  org.joda.time.format.TestDateTimeFormatter#testParseDateTime_zone2 AssertionFailedError
  org.joda.time.format.TestDateTimeFormatter#testParseInto_chrono AssertionFailedError
  org.joda.time.format.TestDateTimeFormatter#testParseInto_offsetParsed AssertionFailedError
  org.joda.time.format.TestDateTimeFormatter#testParseInto_zone AssertionFailedError
  org.joda.time.format.TestDateTimeFormatter#testParseInto_zone2 AssertionFailedError
  org.joda.time.format.TestDateTimeFormatter#testParseLocalDateTime_simple AssertionFailedError
  org.joda.time.format.TestDateTimeFormatter#testParseLocalDate_simple AssertionFailedError
  org.joda.time.format.TestDateTimeFormatter#testParseLocalTime_simple AssertionFailedError
  org.joda.time.format.TestDateTimeFormatter#testParseMillis_fractionOfSecondLong AssertionFailedError
  org.joda.time.format.TestDateTimeFormatter#testParseMutableDateTime_chrono AssertionFailedError
  org.joda.time.format.TestDateTimeFormatter#testParseMutableDateTime_offsetParsed AssertionFailedError
  org.joda.time.format.TestDateTimeFormatter#testParseMutableDateTime_zone AssertionFailedError
  org.joda.time.format.TestDateTimeFormatter#testParseMutableDateTime_zone2 AssertionFailedError
  org.joda.time.format.TestDateTimeFormatter#testPrint_appendableMethods ComparisonFailure
  org.joda.time.format.TestDateTimeFormatter#testPrint_bufferMethods ComparisonFailure
  org.joda.time.format.TestDateTimeFormatter#testPrint_chrono ComparisonFailure ...
  org.joda.time.format.TestDateTimeFormatter#testPrint_chrono_and_zone ComparisonFailure
  org.joda.time.format.TestDateTimeFormatter#testPrint_locale ComparisonFailure ...
  org.joda.time.format.TestDateTimeFormatter#testPrint_simple ComparisonFailure ...
  org.joda.time.format.TestDateTimeFormatter#testPrint_writerMethods ComparisonFailure
  org.joda.time.format.TestDateTimeFormatter#testPrint_zone ComparisonFailure ex...
  org.joda.time.format.TestDateTimeFormatter#testZoneNameNearTransition ComparisonFailure
  org.joda.time.format.TestDateTimeFormatter#testZoneShortNameNearTransition ComparisonFailure
  org.joda.time.format.TestDateTimeFormatterBuilder#test_appendOptional_Parser AssertionFailedError
  org.joda.time.format.TestDateTimeFormatterBuilder#test_appendTimeZoneId ComparisonFailure
  org.joda.time.format.TestDateTimeFormatterBuilder#test_appendTimeZoneOffset_parse AssertionFailedError
  org.joda.time.format.TestDateTimeFormatterBuilder#test_appendTimeZoneOffset_print_min1max1 ComparisonFailure
  org.joda.time.format.TestDateTimeFormatterBuilder#test_appendTimeZoneOffset_print_min1max2 ComparisonFailure
  org.joda.time.format.TestDateTimeFormatterBuilder#test_appendTimeZoneOffset_print_min1max3 ComparisonFailure
  org.joda.time.format.TestDateTimeFormatterBuilder#test_appendTimeZoneOffset_print_min2max2 ComparisonFailure
  org.joda.time.format.TestDateTimeFormatterBuilder#test_appendTimeZoneOffset_print_min2max3 ComparisonFailure
  org.joda.time.format.TestDateTimeFormatterBuilder#test_appendTimeZoneOffset_print_min3max3 ComparisonFailure
  org.joda.time.format.TestDateTimeFormatterBuilder#test_append_Parser AssertionFailedError
  org.joda.time.format.TestDateTimeFormatterBuilder#test_localParseWrongOffsetAndZone AssertionFailedError
  org.joda.time.format.TestDateTimeFormatterBuilder#test_localPrintParseOffset ComparisonFailure
  org.joda.time.format.TestDateTimeFormatterBuilder#test_localPrintParseOffsetAndZone ComparisonFailure
  org.joda.time.format.TestDateTimeFormatterBuilder#test_localPrintParseZoneTokyo ComparisonFailure
  org.joda.time.format.TestDateTimeFormatterBuilder#test_parseWrongOffset AssertionFailedError
  org.joda.time.format.TestDateTimeFormatterBuilder#test_parseWrongOffsetAndZone AssertionFailedError
  org.joda.time.format.TestDateTimeFormatterBuilder#test_printParseOffset ComparisonFailure
  org.joda.time.format.TestDateTimeFormatterBuilder#test_printParseOffsetAndZone ComparisonFailure
  org.joda.time.format.TestDateTimeFormatterBuilder#test_printParseShortNameWithAutoLookup ComparisonFailure
  org.joda.time.format.TestDateTimeFormatterBuilder#test_printParseZoneBahiaBanderas ComparisonFailure
  org.joda.time.format.TestDateTimeFormatterBuilder#test_printParseZoneDawsonCreek ComparisonFailure
  org.joda.time.format.TestDateTimeFormatterBuilder#test_printParseZoneParis ComparisonFailure
  org.joda.time.format.TestDateTimeFormatterBuilder#test_printParseZoneTokyo ComparisonFailure
  org.joda.time.format.TestDateTimeParserBucket#testCompute AssertionFailedError
  org.joda.time.format.TestDateTimeParserBucket#testParse AssertionFailedError e...
  org.joda.time.format.TestDateTimeParserBucket#testReset AssertionFailedError e...
  org.joda.time.format.TestDateTimeParserBucket#testSaveCompute AssertionFailedError
  org.joda.time.format.TestDateTimeParserBucket#testSaveRestoreState AssertionFailedError
  org.joda.time.format.TestDateTimeParserBucket#testSaveRestoreState_avoidSideEffects AssertionFailedError
  org.joda.time.format.TestDateTimeParserBucket#testSaveRestoreState_offset AssertionFailedError
  org.joda.time.format.TestDateTimeParserBucket#testSaveRestoreState_sameStates AssertionFailedError
  org.joda.time.format.TestDateTimeParserBucket#testSaveRestoreState_text AssertionFailedError
  org.joda.time.format.TestDateTimeParserBucket#testSaveRestoreState_twoStates AssertionFailedError
  org.joda.time.format.TestDateTimeParserBucket#testSaveRestoreState_zone AssertionFailedError
  org.joda.time.format.TestISODateTimeFormat#testFormat_basicDateTime ComparisonFailure
  org.joda.time.format.TestISODateTimeFormat#testFormat_basicDateTimeNoMillis ComparisonFailure
  org.joda.time.format.TestISODateTimeFormat#testFormat_basicOrdinalDateTime ComparisonFailure
  org.joda.time.format.TestISODateTimeFormat#testFormat_basicOrdinalDateTimeNoMillis ComparisonFailure
  org.joda.time.format.TestISODateTimeFormat#testFormat_basicTTime ComparisonFailure
  org.joda.time.format.TestISODateTimeFormat#testFormat_basicTTimeNoMillis ComparisonFailure
  org.joda.time.format.TestISODateTimeFormat#testFormat_basicTime ComparisonFailure
  org.joda.time.format.TestISODateTimeFormat#testFormat_basicTimeNoMillis ComparisonFailure
  org.joda.time.format.TestISODateTimeFormat#testFormat_basicWeekDateTime ComparisonFailure
  org.joda.time.format.TestISODateTimeFormat#testFormat_basicWeekDateTimeNoMillis ComparisonFailure
  org.joda.time.format.TestISODateTimeFormat#testFormat_dateHour ComparisonFailure
  org.joda.time.format.TestISODateTimeFormat#testFormat_dateHourMinute ComparisonFailure
  org.joda.time.format.TestISODateTimeFormat#testFormat_dateHourMinuteSecond ComparisonFailure
  org.joda.time.format.TestISODateTimeFormat#testFormat_dateHourMinuteSecondFraction ComparisonFailure
  org.joda.time.format.TestISODateTimeFormat#testFormat_dateHourMinuteSecondMillis ComparisonFailure
  org.joda.time.format.TestISODateTimeFormat#testFormat_dateTime ComparisonFailure
  org.joda.time.format.TestISODateTimeFormat#testFormat_dateTimeNoMillis ComparisonFailure
  org.joda.time.format.TestISODateTimeFormat#testFormat_hour ComparisonFailure e...
  org.joda.time.format.TestISODateTimeFormat#testFormat_hourMinute ComparisonFailure
  org.joda.time.format.TestISODateTimeFormat#testFormat_hourMinuteSecond ComparisonFailure
  org.joda.time.format.TestISODateTimeFormat#testFormat_hourMinuteSecondFraction ComparisonFailure
  org.joda.time.format.TestISODateTimeFormat#testFormat_hourMinuteSecondMillis ComparisonFailure
  org.joda.time.format.TestISODateTimeFormat#testFormat_ordinalDateTime ComparisonFailure
  org.joda.time.format.TestISODateTimeFormat#testFormat_ordinalDateTimeNoMillis ComparisonFailure
  org.joda.time.format.TestISODateTimeFormat#testFormat_tTime ComparisonFailure ...
  org.joda.time.format.TestISODateTimeFormat#testFormat_tTimeNoMillis ComparisonFailure
  org.joda.time.format.TestISODateTimeFormat#testFormat_time ComparisonFailure e...
  org.joda.time.format.TestISODateTimeFormat#testFormat_timeNoMillis ComparisonFailure
  org.joda.time.format.TestISODateTimeFormat#testFormat_weekDateTime ComparisonFailure
  org.joda.time.format.TestISODateTimeFormat#testFormat_weekDateTimeNoMillis ComparisonFailure
  org.joda.time.format.TestISODateTimeFormatParsing#test_localTimeParser AssertionFailedError
  org.joda.time.tz.TestCompiler#test_Amman_2003 AssertionFailedError expected:<1...
  org.joda.time.tz.TestCompiler#test_Amman_2004 AssertionFailedError expected:<1...
  org.joda.time.tz.TestCompiler#test_Amman_2005 AssertionFailedError expected:<1...
  org.joda.time.tz.TestCompiler#test_Amman_2006 AssertionFailedError expected:<1...
Tests in error: 
  org.joda.time.TestDateMidnight_Constructors#testConstructor_Object_nullDateTimeZone NullPointerException
  org.joda.time.TestDateMidnight_Constructors#testConstructor_int_int_int_nullDateTimeZone NullPointerException
  org.joda.time.TestDateMidnight_Constructors#testConstructor_long_nullDateTimeZone NullPointerException
  org.joda.time.TestDateMidnight_Constructors#testConstructor_nullDateTimeZone NullPointerException
  org.joda.time.TestDateMidnight_Constructors#testConstructor_nullObject_nullDateTimeZone NullPointerException
  org.joda.time.TestDateTimeZoneCutover#test_getOffsetFromLocal_Moscow_Spring IllegalInstantException
  org.joda.time.TestDateTime_Constructors#testConstructor_Object_nullDateTimeZone NullPointerException
  org.joda.time.TestDateTime_Constructors#testConstructor_int_int_int_int_int_int_int_nullDateTimeZone NullPointerException
  org.joda.time.TestDateTime_Constructors#testConstructor_int_int_int_int_int_int_nullDateTimeZone NullPointerException
  org.joda.time.TestDateTime_Constructors#testConstructor_int_int_int_int_int_nullDateTimeZone NullPointerException
  org.joda.time.TestDateTime_Constructors#testConstructor_long_nullDateTimeZone NullPointerException
  org.joda.time.TestDateTime_Constructors#testConstructor_nullDateTimeZone NullPointerException
  org.joda.time.TestDateTime_Constructors#testConstructor_nullObject_nullDateTimeZone NullPointerException
  org.joda.time.TestInterval_Constructors#testConstructor_long_long_nullZone NullPointerException
  org.joda.time.TestLocalDateTime_Constructors#testConstructor_Object_DateTimeZoneMoscowBadDateTime IllegalInstantException
  org.joda.time.TestLocalDateTime_Constructors#testConstructor_Object_nullDateTimeZone NullPointerException
  org.joda.time.TestLocalDateTime_Constructors#testConstructor_long_nullDateTimeZone NullPointerException
  org.joda.time.TestLocalDateTime_Constructors#testConstructor_nullDateTimeZone NullPointerException
  org.joda.time.TestLocalDateTime_Constructors#testConstructor_nullObject_nullDateTimeZone NullPointerException
  org.joda.time.TestLocalDate_Constructors#testConstructor_Object_nullDateTimeZone NullPointerException
  org.joda.time.TestLocalDate_Constructors#testConstructor_long_nullDateTimeZone NullPointerException
  org.joda.time.TestLocalDate_Constructors#testConstructor_nullDateTimeZone NullPointerException
  org.joda.time.TestLocalDate_Constructors#testConstructor_nullObject_nullDateTimeZone NullPointerException
  org.joda.time.TestLocalTime_Constructors#testConstructor_Object_nullDateTimeZone NullPointerException
  org.joda.time.TestLocalTime_Constructors#testConstructor_long_nullDateTimeZone NullPointerException
  org.joda.time.TestLocalTime_Constructors#testConstructor_nullDateTimeZone NullPointerException
  org.joda.time.TestLocalTime_Constructors#testConstructor_nullObject_nullDateTimeZone NullPointerException
  org.joda.time.TestMonthDay_Constructors#testConstructor_nullDateTimeZone NullPointerException
  org.joda.time.TestMutableDateTime_Constructors#testConstructor_Object_nullDateTimeZone NullPointerException
  org.joda.time.TestMutableDateTime_Constructors#testConstructor_int_int_int_int_int_int_int_nullDateTimeZone NullPointerException
  org.joda.time.TestMutableDateTime_Constructors#testConstructor_long_nullDateTimeZone NullPointerException
  org.joda.time.TestMutableDateTime_Constructors#testConstructor_nullDateTimeZone NullPointerException
  org.joda.time.TestMutableDateTime_Constructors#testConstructor_nullObject_nullDateTimeZone NullPointerException
  org.joda.time.TestTimeOfDay_Constructors#testConstructor_nullDateTimeZone NullPointerException
  org.joda.time.TestYearMonthDay_Constructors#testConstructor_nullDateTimeZone NullPointerException
  org.joda.time.TestYearMonth_Constructors#testConstructor_nullDateTimeZone NullPointerException
  org.joda.time.convert.TestDateConverter#testGetChronology_Object_Zone NullPointerException
  org.joda.time.convert.TestLongConverter#testGetChronology_Object_Zone NullPointerException
  org.joda.time.convert.TestNullConverter#testGetChronology_Object_Zone NullPointerException
  org.joda.time.convert.TestStringConverter#testGetChronology_Object_Zone NullPointerException

Tests run: 4157, Failures: 330, Errors: 40, Skipped: 0

[INFO] ------------------------------------------------------------------------
[INFO] BUILD FAILURE
[INFO] ------------------------------------------------------------------------
[INFO] Total time: 16.316s
[INFO] Finished at: Thu Aug 06 01:27:26 BST 2015
[INFO] Final Memory: 10M/342M
[INFO] ------------------------------------------------------------------------
[ERROR] Failed to execute goal org.apache.maven.plugins:maven-surefire-plugin:2.18.1:test (default-test) on project joda-time: There are test failures.
[ERROR] 
[ERROR] Please refer to /home/perham/Study/LittleDarwin/Cases/joda-time-2.8.1/target/surefire-reports for the individual test results.
[ERROR] -> [Help 1]
[ERROR] 
[ERROR] To see the full stack trace of the errors, re-run Maven with the -e switch.
[ERROR] Re-run Maven using the -X switch to enable full debug logging.
[ERROR] 
[ERROR] For more information about the errors and possible solutions, please read the following articles:
[ERROR] [Help 1] http://cwiki.apache.org/confluence/display/MAVEN/MojoFailureException
