[INFO] Scanning for projects...
[INFO]                                                                         
[INFO] ------------------------------------------------------------------------
[INFO] Building Joda-Time 2.8.1
[INFO] ------------------------------------------------------------------------
[INFO] 
[INFO] --- maven-resources-plugin:2.7:resources (default-resources) @ joda-time ---
[INFO] Using 'UTF-8' encoding to copy filtered resources.
[INFO] Copying 2 resources to META-INF
[INFO] Copying 10 resources
[INFO] 
[INFO] --- maven-compiler-plugin:3.3:compile (default-compile) @ joda-time ---
[INFO] Changes detected - recompiling the module!
[INFO] Compiling 166 source files to /home/perham/Study/LittleDarwin/Cases/joda-time-2.8.1/target/classes
[INFO] 
[INFO] --- exec-maven-plugin:1.4.0:java (compile-tzdb) @ joda-time ---
Writing zoneinfo files
Writing ZoneInfoMap
[INFO] 
[INFO] --- maven-resources-plugin:2.7:testResources (default-testResources) @ joda-time ---
[INFO] Using 'UTF-8' encoding to copy filtered resources.
[INFO] Copying 34 resources
[INFO] 
[INFO] --- maven-compiler-plugin:3.3:testCompile (default-testCompile) @ joda-time ---
[INFO] Nothing to compile - all classes are up to date
[INFO] 
[INFO] --- maven-surefire-plugin:2.18.1:test (default-test) @ joda-time ---
[INFO] Surefire report directory: /home/perham/Study/LittleDarwin/Cases/joda-time-2.8.1/target/surefire-reports

-------------------------------------------------------
 T E S T S
-------------------------------------------------------
Running org.joda.time.TestAllPackages
org.joda.time.IllegalFieldValueException: Cannot parse "2000-02-29T00:00:00": Value 29 for dayOfMonth must be in the range [1,28]
	at org.joda.time.field.FieldUtils.verifyValueBounds(FieldUtils.java:234)
	at org.joda.time.field.PreciseDurationDateTimeField.set(PreciseDurationDateTimeField.java:79)
	at org.joda.time.format.DateTimeParserBucket$SavedField.set(DateTimeParserBucket.java:568)
	at org.joda.time.format.DateTimeParserBucket.computeMillis(DateTimeParserBucket.java:447)
	at org.joda.time.format.DateTimeParserBucket.doParseMillis(DateTimeParserBucket.java:182)
	at org.joda.time.format.DateTimeFormatter.parseMillis(DateTimeFormatter.java:780)
	at org.joda.time.convert.StringConverter.getInstantMillis(StringConverter.java:65)
	at org.joda.time.base.BaseDateTime.<init>(BaseDateTime.java:154)
	at org.joda.time.DateTime.<init>(DateTime.java:281)
	at org.joda.time.TestDateTimeComparator.getADate(TestDateTimeComparator.java:906)
	at org.joda.time.TestDateTimeComparator.testDOY(TestDateTimeComparator.java:512)
	at sun.reflect.NativeMethodAccessorImpl.invoke0(Native Method)
	at sun.reflect.NativeMethodAccessorImpl.invoke(NativeMethodAccessorImpl.java:57)
	at sun.reflect.DelegatingMethodAccessorImpl.invoke(DelegatingMethodAccessorImpl.java:43)
	at java.lang.reflect.Method.invoke(Method.java:606)
	at junit.framework.TestCase.runTest(TestCase.java:164)
	at junit.framework.TestCase.runBare(TestCase.java:130)
	at junit.framework.TestResult$1.protect(TestResult.java:106)
	at junit.framework.TestResult.runProtected(TestResult.java:124)
	at junit.framework.TestResult.run(TestResult.java:109)
	at junit.framework.TestCase.run(TestCase.java:120)
	at junit.framework.TestSuite.runTest(TestSuite.java:230)
	at junit.framework.TestSuite.run(TestSuite.java:225)
	at junit.framework.TestSuite.runTest(TestSuite.java:230)
	at junit.framework.TestSuite.run(TestSuite.java:225)
	at junit.framework.TestSuite.runTest(TestSuite.java:230)
	at junit.framework.TestSuite.run(TestSuite.java:225)
	at sun.reflect.NativeMethodAccessorImpl.invoke0(Native Method)
	at sun.reflect.NativeMethodAccessorImpl.invoke(NativeMethodAccessorImpl.java:57)
	at sun.reflect.DelegatingMethodAccessorImpl.invoke(DelegatingMethodAccessorImpl.java:43)
	at java.lang.reflect.Method.invoke(Method.java:606)
	at org.apache.maven.surefire.junit.JUnitTestSet.execute(JUnitTestSet.java:99)
	at org.apache.maven.surefire.junit.JUnit3Provider.executeTestSet(JUnit3Provider.java:130)
	at org.apache.maven.surefire.junit.JUnit3Provider.invoke(JUnit3Provider.java:107)
	at org.apache.maven.surefire.booter.ForkedBooter.invokeProviderInSameClassLoader(ForkedBooter.java:203)
	at org.apache.maven.surefire.booter.ForkedBooter.runSuitesInProcess(ForkedBooter.java:155)
	at org.apache.maven.surefire.booter.ForkedBooter.main(ForkedBooter.java:103)

TestBuddhistChronology.testCalendar

TestCopticChronology.testCalendar

TestEthiopicChronology.testCalendar

TestIslamicChronology.testCalendar

Testing Gregorian chronology over 1000 iterations
Failure on year.set
org.joda.time.chrono.gj.TestGJYearField
	vs. org.joda.time.chrono.BasicYearDateTimeField
Datetime: Sat 1960-03-25T03:29:34.468Z / 1960-W12-6
Millis from 1970: -308262625532
Mon -0049-03-26T03:29:34.468Z / -49-W13-1 != Sun -0049-03-25T03:29:34.468Z / -49-W12-7
-63706249825532 != -63706336225532
Original value as reported by first field: 1960
Original value as reported by second field: 1960
First new value as reported by first field: -49
First new value as reported by second field: -49
Second new value as reported by first field: -49
Second new value as reported by second field: -49
Value to set for first field: -49
Value to set for second field: -49
Failure index: 0
Test millis: -308262625532
Test value: -49
Test millis2: -46922557997542

Testing Julian chronology over 1000 iterations
100% complete (i=1000)
Writing zoneinfo files
Writing ZoneInfoMap
Tests run: 4157, Failures: 186, Errors: 7, Skipped: 0, Time elapsed: 5.153 sec <<< FAILURE! - in org.joda.time.TestAllPackages
testConstructor_ObjectString5(org.joda.time.TestDateTime_Constructors)  Time elapsed: 0.007 sec  <<< FAILURE!
junit.framework.AssertionFailedError: expected:<1970> but was:<1969>
	at junit.framework.Assert.fail(Assert.java:47)
	at junit.framework.Assert.failNotEquals(Assert.java:280)
	at junit.framework.Assert.assertEquals(Assert.java:64)
	at junit.framework.Assert.assertEquals(Assert.java:198)
	at junit.framework.Assert.assertEquals(Assert.java:204)
	at org.joda.time.TestDateTime_Constructors.testConstructor_ObjectString5(TestDateTime_Constructors.java:425)

testConstructor_ObjectString6(org.joda.time.TestDateTime_Constructors)  Time elapsed: 0 sec  <<< FAILURE!
junit.framework.AssertionFailedError: expected:<31> but was:<30>
	at junit.framework.Assert.fail(Assert.java:47)
	at junit.framework.Assert.failNotEquals(Assert.java:280)
	at junit.framework.Assert.assertEquals(Assert.java:64)
	at junit.framework.Assert.assertEquals(Assert.java:198)
	at junit.framework.Assert.assertEquals(Assert.java:204)
	at org.joda.time.TestDateTime_Constructors.testConstructor_ObjectString6(TestDateTime_Constructors.java:439)

testWithers(org.joda.time.TestDateTime_Basics)  Time elapsed: 0.001 sec  <<< FAILURE!
junit.framework.AssertionFailedError: expected:<13> but was:<12>
	at junit.framework.Assert.fail(Assert.java:47)
	at junit.framework.Assert.failNotEquals(Assert.java:280)
	at junit.framework.Assert.assertEquals(Assert.java:64)
	at junit.framework.Assert.assertEquals(Assert.java:198)
	at junit.framework.Assert.assertEquals(Assert.java:204)
	at org.joda.time.TestDateTime_Basics.check(TestDateTime_Basics.java:1286)
	at org.joda.time.TestDateTime_Basics.testWithers(TestDateTime_Basics.java:258)

testPropertySetTextYear(org.joda.time.TestDateTime_Properties)  Time elapsed: 0.002 sec  <<< FAILURE!
junit.framework.ComparisonFailure: expected:<...0-06-09T00:00:00.000[+01:00]> but was:<...0-06-09T00:00:00.000[Z]>
	at junit.framework.Assert.assertEquals(Assert.java:81)
	at junit.framework.Assert.assertEquals(Assert.java:87)
	at org.joda.time.TestDateTime_Properties.testPropertySetTextYear(TestDateTime_Properties.java:296)

testPropertySetYear(org.joda.time.TestDateTime_Properties)  Time elapsed: 0.001 sec  <<< FAILURE!
junit.framework.ComparisonFailure: expected:<...0-06-09T00:00:00.000[+01:00]> but was:<...0-06-09T00:00:00.000[Z]>
	at junit.framework.Assert.assertEquals(Assert.java:81)
	at junit.framework.Assert.assertEquals(Assert.java:87)
	at org.joda.time.TestDateTime_Properties.testPropertySetYear(TestDateTime_Properties.java:289)

testPropertyWithMaximumValueMillisOfDayDSTGap(org.joda.time.TestDateTime_Properties)  Time elapsed: 0.001 sec  <<< FAILURE!
junit.framework.ComparisonFailure: expected:<1926-04-17T2[2]:59:59.999Z> but was:<1926-04-17T2[3]:59:59.999Z>
	at junit.framework.Assert.assertEquals(Assert.java:81)
	at junit.framework.Assert.assertEquals(Assert.java:87)
	at org.joda.time.TestDateTime_Properties.testPropertyWithMaximumValueMillisOfDayDSTGap(TestDateTime_Properties.java:651)

testPropertySetTextYear(org.joda.time.TestMutableDateTime_Properties)  Time elapsed: 0.001 sec  <<< FAILURE!
junit.framework.ComparisonFailure: expected:<...0-06-09T00:00:00.000[+01:00]> but was:<...0-06-09T00:00:00.000[Z]>
	at junit.framework.Assert.assertEquals(Assert.java:81)
	at junit.framework.Assert.assertEquals(Assert.java:87)
	at org.joda.time.TestMutableDateTime_Properties.testPropertySetTextYear(TestMutableDateTime_Properties.java:228)

testPropertySetYear(org.joda.time.TestMutableDateTime_Properties)  Time elapsed: 0.001 sec  <<< FAILURE!
junit.framework.ComparisonFailure: expected:<...0-06-09T00:00:00.000[+01:00]> but was:<...0-06-09T00:00:00.000[Z]>
	at junit.framework.Assert.assertEquals(Assert.java:81)
	at junit.framework.Assert.assertEquals(Assert.java:87)
	at org.joda.time.TestMutableDateTime_Properties.testPropertySetYear(TestMutableDateTime_Properties.java:222)

testWithers(org.joda.time.TestDateMidnight_Basics)  Time elapsed: 0.001 sec  <<< FAILURE!
junit.framework.AssertionFailedError: expected:<13> but was:<12>
	at junit.framework.Assert.fail(Assert.java:47)
	at junit.framework.Assert.failNotEquals(Assert.java:280)
	at junit.framework.Assert.assertEquals(Assert.java:64)
	at junit.framework.Assert.assertEquals(Assert.java:198)
	at junit.framework.Assert.assertEquals(Assert.java:204)
	at org.joda.time.TestDateMidnight_Basics.check(TestDateMidnight_Basics.java:1019)
	at org.joda.time.TestDateMidnight_Basics.testWithers(TestDateMidnight_Basics.java:246)

testConstructor(org.joda.time.TestLocalDateTime_Constructors)  Time elapsed: 0 sec  <<< FAILURE!
junit.framework.AssertionFailedError: expected:<9> but was:<8>
	at junit.framework.Assert.fail(Assert.java:47)
	at junit.framework.Assert.failNotEquals(Assert.java:280)
	at junit.framework.Assert.assertEquals(Assert.java:64)
	at junit.framework.Assert.assertEquals(Assert.java:198)
	at junit.framework.Assert.assertEquals(Assert.java:204)
	at org.joda.time.TestLocalDateTime_Constructors.testConstructor(TestLocalDateTime_Constructors.java:179)

testConstructor_long1(org.joda.time.TestLocalDateTime_Constructors)  Time elapsed: 0 sec  <<< FAILURE!
junit.framework.AssertionFailedError: expected:<6> but was:<5>
	at junit.framework.Assert.fail(Assert.java:47)
	at junit.framework.Assert.failNotEquals(Assert.java:280)
	at junit.framework.Assert.assertEquals(Assert.java:64)
	at junit.framework.Assert.assertEquals(Assert.java:198)
	at junit.framework.Assert.assertEquals(Assert.java:204)
	at org.joda.time.TestLocalDateTime_Constructors.testConstructor_long1(TestLocalDateTime_Constructors.java:260)

testConstructor_long2(org.joda.time.TestLocalDateTime_Constructors)  Time elapsed: 0.001 sec  <<< FAILURE!
junit.framework.AssertionFailedError: expected:<7> but was:<6>
	at junit.framework.Assert.fail(Assert.java:47)
	at junit.framework.Assert.failNotEquals(Assert.java:280)
	at junit.framework.Assert.assertEquals(Assert.java:64)
	at junit.framework.Assert.assertEquals(Assert.java:198)
	at junit.framework.Assert.assertEquals(Assert.java:204)
	at org.joda.time.TestLocalDateTime_Constructors.testConstructor_long2(TestLocalDateTime_Constructors.java:272)

testConstructor_nullObject(org.joda.time.TestLocalDateTime_Constructors)  Time elapsed: 0 sec  <<< FAILURE!
junit.framework.AssertionFailedError: expected:<9> but was:<8>
	at junit.framework.Assert.fail(Assert.java:47)
	at junit.framework.Assert.failNotEquals(Assert.java:280)
	at junit.framework.Assert.assertEquals(Assert.java:64)
	at junit.framework.Assert.assertEquals(Assert.java:198)
	at junit.framework.Assert.assertEquals(Assert.java:204)
	at org.joda.time.TestLocalDateTime_Constructors.testConstructor_nullObject(TestLocalDateTime_Constructors.java:372)

testConstructor_Chronology(org.joda.time.TestLocalDateTime_Constructors)  Time elapsed: 0 sec  <<< FAILURE!
junit.framework.AssertionFailedError: expected:<9> but was:<8>
	at junit.framework.Assert.fail(Assert.java:47)
	at junit.framework.Assert.failNotEquals(Assert.java:280)
	at junit.framework.Assert.assertEquals(Assert.java:64)
	at junit.framework.Assert.assertEquals(Assert.java:198)
	at junit.framework.Assert.assertEquals(Assert.java:204)
	at org.joda.time.TestLocalDateTime_Constructors.testConstructor_Chronology(TestLocalDateTime_Constructors.java:234)

testConstructor_nullChronology(org.joda.time.TestLocalDateTime_Constructors)  Time elapsed: 0 sec  <<< FAILURE!
junit.framework.AssertionFailedError: expected:<9> but was:<8>
	at junit.framework.Assert.fail(Assert.java:47)
	at junit.framework.Assert.failNotEquals(Assert.java:280)
	at junit.framework.Assert.assertEquals(Assert.java:64)
	at junit.framework.Assert.assertEquals(Assert.java:198)
	at junit.framework.Assert.assertEquals(Assert.java:204)
	at org.joda.time.TestLocalDateTime_Constructors.testConstructor_nullChronology(TestLocalDateTime_Constructors.java:247)

testConstructor_long1_DateTimeZone(org.joda.time.TestLocalDateTime_Constructors)  Time elapsed: 0 sec  <<< FAILURE!
junit.framework.AssertionFailedError: expected:<6> but was:<5>
	at junit.framework.Assert.fail(Assert.java:47)
	at junit.framework.Assert.failNotEquals(Assert.java:280)
	at junit.framework.Assert.assertEquals(Assert.java:64)
	at junit.framework.Assert.assertEquals(Assert.java:198)
	at junit.framework.Assert.assertEquals(Assert.java:204)
	at org.joda.time.TestLocalDateTime_Constructors.testConstructor_long1_DateTimeZone(TestLocalDateTime_Constructors.java:285)

testConstructor_long2_DateTimeZone(org.joda.time.TestLocalDateTime_Constructors)  Time elapsed: 0 sec  <<< FAILURE!
junit.framework.AssertionFailedError: expected:<7> but was:<6>
	at junit.framework.Assert.fail(Assert.java:47)
	at junit.framework.Assert.failNotEquals(Assert.java:280)
	at junit.framework.Assert.assertEquals(Assert.java:64)
	at junit.framework.Assert.assertEquals(Assert.java:198)
	at junit.framework.Assert.assertEquals(Assert.java:204)
	at org.joda.time.TestLocalDateTime_Constructors.testConstructor_long2_DateTimeZone(TestLocalDateTime_Constructors.java:297)

testConstructor_long_nullDateTimeZone(org.joda.time.TestLocalDateTime_Constructors)  Time elapsed: 0 sec  <<< FAILURE!
junit.framework.AssertionFailedError: expected:<6> but was:<5>
	at junit.framework.Assert.fail(Assert.java:47)
	at junit.framework.Assert.failNotEquals(Assert.java:280)
	at junit.framework.Assert.assertEquals(Assert.java:64)
	at junit.framework.Assert.assertEquals(Assert.java:198)
	at junit.framework.Assert.assertEquals(Assert.java:204)
	at org.joda.time.TestLocalDateTime_Constructors.testConstructor_long_nullDateTimeZone(TestLocalDateTime_Constructors.java:309)

testConstructor_long1_Chronology(org.joda.time.TestLocalDateTime_Constructors)  Time elapsed: 0 sec  <<< FAILURE!
junit.framework.AssertionFailedError: expected:<6> but was:<5>
	at junit.framework.Assert.fail(Assert.java:47)
	at junit.framework.Assert.failNotEquals(Assert.java:280)
	at junit.framework.Assert.assertEquals(Assert.java:64)
	at junit.framework.Assert.assertEquals(Assert.java:198)
	at junit.framework.Assert.assertEquals(Assert.java:204)
	at org.joda.time.TestLocalDateTime_Constructors.testConstructor_long1_Chronology(TestLocalDateTime_Constructors.java:322)

testConstructor_long2_Chronology(org.joda.time.TestLocalDateTime_Constructors)  Time elapsed: 0.001 sec  <<< FAILURE!
junit.framework.AssertionFailedError: expected:<7> but was:<6>
	at junit.framework.Assert.fail(Assert.java:47)
	at junit.framework.Assert.failNotEquals(Assert.java:280)
	at junit.framework.Assert.assertEquals(Assert.java:64)
	at junit.framework.Assert.assertEquals(Assert.java:198)
	at junit.framework.Assert.assertEquals(Assert.java:204)
	at org.joda.time.TestLocalDateTime_Constructors.testConstructor_long2_Chronology(TestLocalDateTime_Constructors.java:334)

testConstructor_long_nullChronology(org.joda.time.TestLocalDateTime_Constructors)  Time elapsed: 0 sec  <<< FAILURE!
junit.framework.AssertionFailedError: expected:<6> but was:<5>
	at junit.framework.Assert.fail(Assert.java:47)
	at junit.framework.Assert.failNotEquals(Assert.java:280)
	at junit.framework.Assert.assertEquals(Assert.java:64)
	at junit.framework.Assert.assertEquals(Assert.java:198)
	at junit.framework.Assert.assertEquals(Assert.java:204)
	at org.joda.time.TestLocalDateTime_Constructors.testConstructor_long_nullChronology(TestLocalDateTime_Constructors.java:346)

testConstructor_Object_DateTimeZone(org.joda.time.TestLocalDateTime_Constructors)  Time elapsed: 0.001 sec  <<< FAILURE!
junit.framework.AssertionFailedError: expected:<6> but was:<5>
	at junit.framework.Assert.fail(Assert.java:47)
	at junit.framework.Assert.failNotEquals(Assert.java:280)
	at junit.framework.Assert.assertEquals(Assert.java:64)
	at junit.framework.Assert.assertEquals(Assert.java:198)
	at junit.framework.Assert.assertEquals(Assert.java:204)
	at org.joda.time.TestLocalDateTime_Constructors.testConstructor_Object_DateTimeZone(TestLocalDateTime_Constructors.java:505)

testConstructor_nullObject_DateTimeZone(org.joda.time.TestLocalDateTime_Constructors)  Time elapsed: 0 sec  <<< FAILURE!
junit.framework.AssertionFailedError: expected:<9> but was:<8>
	at junit.framework.Assert.fail(Assert.java:47)
	at junit.framework.Assert.failNotEquals(Assert.java:280)
	at junit.framework.Assert.assertEquals(Assert.java:64)
	at junit.framework.Assert.assertEquals(Assert.java:198)
	at junit.framework.Assert.assertEquals(Assert.java:204)
	at org.joda.time.TestLocalDateTime_Constructors.testConstructor_nullObject_DateTimeZone(TestLocalDateTime_Constructors.java:545)

testConstructor_Object_nullDateTimeZone(org.joda.time.TestLocalDateTime_Constructors)  Time elapsed: 0.001 sec  <<< FAILURE!
junit.framework.AssertionFailedError: expected:<6> but was:<5>
	at junit.framework.Assert.fail(Assert.java:47)
	at junit.framework.Assert.failNotEquals(Assert.java:280)
	at junit.framework.Assert.assertEquals(Assert.java:64)
	at junit.framework.Assert.assertEquals(Assert.java:198)
	at junit.framework.Assert.assertEquals(Assert.java:204)
	at org.joda.time.TestLocalDateTime_Constructors.testConstructor_Object_nullDateTimeZone(TestLocalDateTime_Constructors.java:558)

testConstructor_nullObject_nullDateTimeZone(org.joda.time.TestLocalDateTime_Constructors)  Time elapsed: 0 sec  <<< FAILURE!
junit.framework.AssertionFailedError: expected:<9> but was:<8>
	at junit.framework.Assert.fail(Assert.java:47)
	at junit.framework.Assert.failNotEquals(Assert.java:280)
	at junit.framework.Assert.assertEquals(Assert.java:64)
	at junit.framework.Assert.assertEquals(Assert.java:198)
	at junit.framework.Assert.assertEquals(Assert.java:204)
	at org.joda.time.TestLocalDateTime_Constructors.testConstructor_nullObject_nullDateTimeZone(TestLocalDateTime_Constructors.java:570)

testConstructor_Object_Chronology(org.joda.time.TestLocalDateTime_Constructors)  Time elapsed: 0.001 sec  <<< FAILURE!
junit.framework.AssertionFailedError: expected:<6> but was:<5>
	at junit.framework.Assert.fail(Assert.java:47)
	at junit.framework.Assert.failNotEquals(Assert.java:280)
	at junit.framework.Assert.assertEquals(Assert.java:64)
	at junit.framework.Assert.assertEquals(Assert.java:198)
	at junit.framework.Assert.assertEquals(Assert.java:204)
	at org.joda.time.TestLocalDateTime_Constructors.testConstructor_Object_Chronology(TestLocalDateTime_Constructors.java:584)

testConstructor_nullObject_Chronology(org.joda.time.TestLocalDateTime_Constructors)  Time elapsed: 0.001 sec  <<< FAILURE!
junit.framework.AssertionFailedError: expected:<9> but was:<8>
	at junit.framework.Assert.fail(Assert.java:47)
	at junit.framework.Assert.failNotEquals(Assert.java:280)
	at junit.framework.Assert.assertEquals(Assert.java:64)
	at junit.framework.Assert.assertEquals(Assert.java:198)
	at junit.framework.Assert.assertEquals(Assert.java:204)
	at org.joda.time.TestLocalDateTime_Constructors.testConstructor_nullObject_Chronology(TestLocalDateTime_Constructors.java:637)

testConstructor_Object_nullChronology(org.joda.time.TestLocalDateTime_Constructors)  Time elapsed: 0 sec  <<< FAILURE!
junit.framework.AssertionFailedError: expected:<6> but was:<5>
	at junit.framework.Assert.fail(Assert.java:47)
	at junit.framework.Assert.failNotEquals(Assert.java:280)
	at junit.framework.Assert.assertEquals(Assert.java:64)
	at junit.framework.Assert.assertEquals(Assert.java:198)
	at junit.framework.Assert.assertEquals(Assert.java:204)
	at org.joda.time.TestLocalDateTime_Constructors.testConstructor_Object_nullChronology(TestLocalDateTime_Constructors.java:650)

testConstructor_nullObject_nullChronology(org.joda.time.TestLocalDateTime_Constructors)  Time elapsed: 0 sec  <<< FAILURE!
junit.framework.AssertionFailedError: expected:<9> but was:<8>
	at junit.framework.Assert.fail(Assert.java:47)
	at junit.framework.Assert.failNotEquals(Assert.java:280)
	at junit.framework.Assert.assertEquals(Assert.java:64)
	at junit.framework.Assert.assertEquals(Assert.java:198)
	at junit.framework.Assert.assertEquals(Assert.java:204)
	at org.joda.time.TestLocalDateTime_Constructors.testConstructor_nullObject_nullChronology(TestLocalDateTime_Constructors.java:662)

testConstructor_nullDateTimeZone(org.joda.time.TestLocalDateTime_Constructors)  Time elapsed: 0 sec  <<< FAILURE!
junit.framework.AssertionFailedError: expected:<9> but was:<8>
	at junit.framework.Assert.fail(Assert.java:47)
	at junit.framework.Assert.failNotEquals(Assert.java:280)
	at junit.framework.Assert.assertEquals(Assert.java:64)
	at junit.framework.Assert.assertEquals(Assert.java:198)
	at junit.framework.Assert.assertEquals(Assert.java:204)
	at org.joda.time.TestLocalDateTime_Constructors.testConstructor_nullDateTimeZone(TestLocalDateTime_Constructors.java:221)

testConstructor_Object1(org.joda.time.TestLocalDateTime_Constructors)  Time elapsed: 0.001 sec  <<< FAILURE!
junit.framework.AssertionFailedError: expected:<6> but was:<5>
	at junit.framework.Assert.fail(Assert.java:47)
	at junit.framework.Assert.failNotEquals(Assert.java:280)
	at junit.framework.Assert.assertEquals(Assert.java:64)
	at junit.framework.Assert.assertEquals(Assert.java:198)
	at junit.framework.Assert.assertEquals(Assert.java:204)
	at org.joda.time.TestLocalDateTime_Constructors.testConstructor_Object1(TestLocalDateTime_Constructors.java:360)

testGetters(org.joda.time.TestLocalDateTime_Basics)  Time elapsed: 0 sec  <<< FAILURE!
junit.framework.AssertionFailedError: expected:<2> but was:<3>
	at junit.framework.Assert.fail(Assert.java:47)
	at junit.framework.Assert.failNotEquals(Assert.java:280)
	at junit.framework.Assert.assertEquals(Assert.java:64)
	at junit.framework.Assert.assertEquals(Assert.java:198)
	at junit.framework.Assert.assertEquals(Assert.java:204)
	at org.joda.time.TestLocalDateTime_Basics.testGetters(TestLocalDateTime_Basics.java:722)

testWithers(org.joda.time.TestLocalDateTime_Basics)  Time elapsed: 0.001 sec  <<< FAILURE!
junit.framework.AssertionFailedError: expected:<13> but was:<12>
	at junit.framework.Assert.fail(Assert.java:47)
	at junit.framework.Assert.failNotEquals(Assert.java:280)
	at junit.framework.Assert.assertEquals(Assert.java:64)
	at junit.framework.Assert.assertEquals(Assert.java:198)
	at junit.framework.Assert.assertEquals(Assert.java:204)
	at org.joda.time.TestLocalDateTime_Basics.check(TestLocalDateTime_Basics.java:1103)
	at org.joda.time.TestLocalDateTime_Basics.testWithers(TestLocalDateTime_Basics.java:743)

testToString_String_Locale(org.joda.time.TestLocalDateTime_Basics)  Time elapsed: 0.001 sec  <<< FAILURE!
junit.framework.ComparisonFailure: expected:<[Tue] 9/6> but was:<[Wed] 9/6>
	at junit.framework.Assert.assertEquals(Assert.java:81)
	at junit.framework.Assert.assertEquals(Assert.java:87)
	at org.joda.time.TestLocalDateTime_Basics.testToString_String_Locale(TestLocalDateTime_Basics.java:1085)

testGet_DateTimeFieldType(org.joda.time.TestLocalDateTime_Basics)  Time elapsed: 0 sec  <<< FAILURE!
junit.framework.AssertionFailedError: expected:<2> but was:<3>
	at junit.framework.Assert.fail(Assert.java:47)
	at junit.framework.Assert.failNotEquals(Assert.java:280)
	at junit.framework.Assert.assertEquals(Assert.java:64)
	at junit.framework.Assert.assertEquals(Assert.java:198)
	at junit.framework.Assert.assertEquals(Assert.java:204)
	at org.joda.time.TestLocalDateTime_Basics.testGet_DateTimeFieldType(TestLocalDateTime_Basics.java:121)

testGetValue_int(org.joda.time.TestLocalDateTime_Basics)  Time elapsed: 0 sec  <<< FAILURE!
junit.framework.AssertionFailedError: expected:<9> but was:<8>
	at junit.framework.Assert.fail(Assert.java:47)
	at junit.framework.Assert.failNotEquals(Assert.java:280)
	at junit.framework.Assert.assertEquals(Assert.java:64)
	at junit.framework.Assert.assertEquals(Assert.java:198)
	at junit.framework.Assert.assertEquals(Assert.java:204)
	at org.joda.time.TestLocalDateTime_Basics.testGetValue_int(TestLocalDateTime_Basics.java:213)

testGetValues(org.joda.time.TestLocalDateTime_Basics)  Time elapsed: 0.001 sec  <<< FAILURE!
junit.framework.AssertionFailedError: expected:<9> but was:<8>
	at junit.framework.Assert.fail(Assert.java:47)
	at junit.framework.Assert.failNotEquals(Assert.java:280)
	at junit.framework.Assert.assertEquals(Assert.java:64)
	at junit.framework.Assert.assertEquals(Assert.java:198)
	at junit.framework.Assert.assertEquals(Assert.java:204)
	at org.joda.time.TestLocalDateTime_Basics.testGetValues(TestLocalDateTime_Basics.java:228)

testConstructor(org.joda.time.TestLocalDate_Constructors)  Time elapsed: 0.001 sec  <<< FAILURE!
junit.framework.AssertionFailedError: expected:<9> but was:<8>
	at junit.framework.Assert.fail(Assert.java:47)
	at junit.framework.Assert.failNotEquals(Assert.java:280)
	at junit.framework.Assert.assertEquals(Assert.java:64)
	at junit.framework.Assert.assertEquals(Assert.java:198)
	at junit.framework.Assert.assertEquals(Assert.java:204)
	at org.joda.time.TestLocalDate_Constructors.testConstructor(TestLocalDate_Constructors.java:171)

testConstructor_long1(org.joda.time.TestLocalDate_Constructors)  Time elapsed: 0.001 sec  <<< FAILURE!
junit.framework.AssertionFailedError: expected:<6> but was:<5>
	at junit.framework.Assert.fail(Assert.java:47)
	at junit.framework.Assert.failNotEquals(Assert.java:280)
	at junit.framework.Assert.assertEquals(Assert.java:64)
	at junit.framework.Assert.assertEquals(Assert.java:198)
	at junit.framework.Assert.assertEquals(Assert.java:204)
	at org.joda.time.TestLocalDate_Constructors.testConstructor_long1(TestLocalDate_Constructors.java:230)

testConstructor_long2(org.joda.time.TestLocalDate_Constructors)  Time elapsed: 0 sec  <<< FAILURE!
junit.framework.AssertionFailedError: expected:<7> but was:<6>
	at junit.framework.Assert.fail(Assert.java:47)
	at junit.framework.Assert.failNotEquals(Assert.java:280)
	at junit.framework.Assert.assertEquals(Assert.java:64)
	at junit.framework.Assert.assertEquals(Assert.java:198)
	at junit.framework.Assert.assertEquals(Assert.java:204)
	at org.joda.time.TestLocalDate_Constructors.testConstructor_long2(TestLocalDate_Constructors.java:238)

testConstructor_nullObject(org.joda.time.TestLocalDate_Constructors)  Time elapsed: 0 sec  <<< FAILURE!
junit.framework.AssertionFailedError: expected:<9> but was:<8>
	at junit.framework.Assert.fail(Assert.java:47)
	at junit.framework.Assert.failNotEquals(Assert.java:280)
	at junit.framework.Assert.assertEquals(Assert.java:64)
	at junit.framework.Assert.assertEquals(Assert.java:198)
	at junit.framework.Assert.assertEquals(Assert.java:204)
	at org.joda.time.TestLocalDate_Constructors.testConstructor_nullObject(TestLocalDate_Constructors.java:329)

testConstructor_Chronology(org.joda.time.TestLocalDate_Constructors)  Time elapsed: 0 sec  <<< FAILURE!
junit.framework.AssertionFailedError: expected:<9> but was:<8>
	at junit.framework.Assert.fail(Assert.java:47)
	at junit.framework.Assert.failNotEquals(Assert.java:280)
	at junit.framework.Assert.assertEquals(Assert.java:64)
	at junit.framework.Assert.assertEquals(Assert.java:198)
	at junit.framework.Assert.assertEquals(Assert.java:204)
	at org.joda.time.TestLocalDate_Constructors.testConstructor_Chronology(TestLocalDate_Constructors.java:212)

testConstructor_nullChronology(org.joda.time.TestLocalDate_Constructors)  Time elapsed: 0.001 sec  <<< FAILURE!
junit.framework.AssertionFailedError: expected:<9> but was:<8>
	at junit.framework.Assert.fail(Assert.java:47)
	at junit.framework.Assert.failNotEquals(Assert.java:280)
	at junit.framework.Assert.assertEquals(Assert.java:64)
	at junit.framework.Assert.assertEquals(Assert.java:198)
	at junit.framework.Assert.assertEquals(Assert.java:204)
	at org.joda.time.TestLocalDate_Constructors.testConstructor_nullChronology(TestLocalDate_Constructors.java:221)

testConstructor_long1_DateTimeZone(org.joda.time.TestLocalDate_Constructors)  Time elapsed: 0 sec  <<< FAILURE!
junit.framework.AssertionFailedError: expected:<6> but was:<5>
	at junit.framework.Assert.fail(Assert.java:47)
	at junit.framework.Assert.failNotEquals(Assert.java:280)
	at junit.framework.Assert.assertEquals(Assert.java:64)
	at junit.framework.Assert.assertEquals(Assert.java:198)
	at junit.framework.Assert.assertEquals(Assert.java:204)
	at org.joda.time.TestLocalDate_Constructors.testConstructor_long1_DateTimeZone(TestLocalDate_Constructors.java:246)

testConstructor_long2_DateTimeZone(org.joda.time.TestLocalDate_Constructors)  Time elapsed: 0 sec  <<< FAILURE!
junit.framework.AssertionFailedError: expected:<7> but was:<6>
	at junit.framework.Assert.fail(Assert.java:47)
	at junit.framework.Assert.failNotEquals(Assert.java:280)
	at junit.framework.Assert.assertEquals(Assert.java:64)
	at junit.framework.Assert.assertEquals(Assert.java:198)
	at junit.framework.Assert.assertEquals(Assert.java:204)
	at org.joda.time.TestLocalDate_Constructors.testConstructor_long2_DateTimeZone(TestLocalDate_Constructors.java:255)

testConstructor_long_nullDateTimeZone(org.joda.time.TestLocalDate_Constructors)  Time elapsed: 0.001 sec  <<< FAILURE!
junit.framework.AssertionFailedError: expected:<6> but was:<5>
	at junit.framework.Assert.fail(Assert.java:47)
	at junit.framework.Assert.failNotEquals(Assert.java:280)
	at junit.framework.Assert.assertEquals(Assert.java:64)
	at junit.framework.Assert.assertEquals(Assert.java:198)
	at junit.framework.Assert.assertEquals(Assert.java:204)
	at org.joda.time.TestLocalDate_Constructors.testConstructor_long_nullDateTimeZone(TestLocalDate_Constructors.java:287)

testConstructor_long1_Chronology(org.joda.time.TestLocalDate_Constructors)  Time elapsed: 0.001 sec  <<< FAILURE!
junit.framework.AssertionFailedError: expected:<6> but was:<5>
	at junit.framework.Assert.fail(Assert.java:47)
	at junit.framework.Assert.failNotEquals(Assert.java:280)
	at junit.framework.Assert.assertEquals(Assert.java:64)
	at junit.framework.Assert.assertEquals(Assert.java:198)
	at junit.framework.Assert.assertEquals(Assert.java:204)
	at org.joda.time.TestLocalDate_Constructors.testConstructor_long1_Chronology(TestLocalDate_Constructors.java:295)

testConstructor_long2_Chronology(org.joda.time.TestLocalDate_Constructors)  Time elapsed: 0 sec  <<< FAILURE!
junit.framework.AssertionFailedError: expected:<7> but was:<6>
	at junit.framework.Assert.fail(Assert.java:47)
	at junit.framework.Assert.failNotEquals(Assert.java:280)
	at junit.framework.Assert.assertEquals(Assert.java:64)
	at junit.framework.Assert.assertEquals(Assert.java:198)
	at junit.framework.Assert.assertEquals(Assert.java:204)
	at org.joda.time.TestLocalDate_Constructors.testConstructor_long2_Chronology(TestLocalDate_Constructors.java:303)

testConstructor_long_nullChronology(org.joda.time.TestLocalDate_Constructors)  Time elapsed: 0 sec  <<< FAILURE!
junit.framework.AssertionFailedError: expected:<6> but was:<5>
	at junit.framework.Assert.fail(Assert.java:47)
	at junit.framework.Assert.failNotEquals(Assert.java:280)
	at junit.framework.Assert.assertEquals(Assert.java:64)
	at junit.framework.Assert.assertEquals(Assert.java:198)
	at junit.framework.Assert.assertEquals(Assert.java:204)
	at org.joda.time.TestLocalDate_Constructors.testConstructor_long_nullChronology(TestLocalDate_Constructors.java:311)

testConstructor_Object_DateTimeZone(org.joda.time.TestLocalDate_Constructors)  Time elapsed: 0 sec  <<< FAILURE!
junit.framework.AssertionFailedError: expected:<6> but was:<5>
	at junit.framework.Assert.fail(Assert.java:47)
	at junit.framework.Assert.failNotEquals(Assert.java:280)
	at junit.framework.Assert.assertEquals(Assert.java:64)
	at junit.framework.Assert.assertEquals(Assert.java:198)
	at junit.framework.Assert.assertEquals(Assert.java:204)
	at org.joda.time.TestLocalDate_Constructors.testConstructor_Object_DateTimeZone(TestLocalDate_Constructors.java:448)

testConstructor_nullObject_DateTimeZone(org.joda.time.TestLocalDate_Constructors)  Time elapsed: 0 sec  <<< FAILURE!
junit.framework.AssertionFailedError: expected:<9> but was:<8>
	at junit.framework.Assert.fail(Assert.java:47)
	at junit.framework.Assert.failNotEquals(Assert.java:280)
	at junit.framework.Assert.assertEquals(Assert.java:64)
	at junit.framework.Assert.assertEquals(Assert.java:198)
	at junit.framework.Assert.assertEquals(Assert.java:204)
	at org.joda.time.TestLocalDate_Constructors.testConstructor_nullObject_DateTimeZone(TestLocalDate_Constructors.java:456)

testConstructor_Object_nullDateTimeZone(org.joda.time.TestLocalDate_Constructors)  Time elapsed: 0 sec  <<< FAILURE!
junit.framework.AssertionFailedError: expected:<6> but was:<5>
	at junit.framework.Assert.fail(Assert.java:47)
	at junit.framework.Assert.failNotEquals(Assert.java:280)
	at junit.framework.Assert.assertEquals(Assert.java:64)
	at junit.framework.Assert.assertEquals(Assert.java:198)
	at junit.framework.Assert.assertEquals(Assert.java:204)
	at org.joda.time.TestLocalDate_Constructors.testConstructor_Object_nullDateTimeZone(TestLocalDate_Constructors.java:465)

testConstructor_nullObject_nullDateTimeZone(org.joda.time.TestLocalDate_Constructors)  Time elapsed: 0.001 sec  <<< FAILURE!
junit.framework.AssertionFailedError: expected:<9> but was:<8>
	at junit.framework.Assert.fail(Assert.java:47)
	at junit.framework.Assert.failNotEquals(Assert.java:280)
	at junit.framework.Assert.assertEquals(Assert.java:64)
	at junit.framework.Assert.assertEquals(Assert.java:198)
	at junit.framework.Assert.assertEquals(Assert.java:204)
	at org.joda.time.TestLocalDate_Constructors.testConstructor_nullObject_nullDateTimeZone(TestLocalDate_Constructors.java:473)

testConstructor_Object_Chronology(org.joda.time.TestLocalDate_Constructors)  Time elapsed: 0 sec  <<< FAILURE!
junit.framework.AssertionFailedError: expected:<6> but was:<5>
	at junit.framework.Assert.fail(Assert.java:47)
	at junit.framework.Assert.failNotEquals(Assert.java:280)
	at junit.framework.Assert.assertEquals(Assert.java:64)
	at junit.framework.Assert.assertEquals(Assert.java:198)
	at junit.framework.Assert.assertEquals(Assert.java:204)
	at org.joda.time.TestLocalDate_Constructors.testConstructor_Object_Chronology(TestLocalDate_Constructors.java:482)

testConstructor_nullObject_Chronology(org.joda.time.TestLocalDate_Constructors)  Time elapsed: 0.001 sec  <<< FAILURE!
junit.framework.AssertionFailedError: expected:<9> but was:<8>
	at junit.framework.Assert.fail(Assert.java:47)
	at junit.framework.Assert.failNotEquals(Assert.java:280)
	at junit.framework.Assert.assertEquals(Assert.java:64)
	at junit.framework.Assert.assertEquals(Assert.java:198)
	at junit.framework.Assert.assertEquals(Assert.java:204)
	at org.joda.time.TestLocalDate_Constructors.testConstructor_nullObject_Chronology(TestLocalDate_Constructors.java:499)

testConstructor_Object_nullChronology(org.joda.time.TestLocalDate_Constructors)  Time elapsed: 0.001 sec  <<< FAILURE!
junit.framework.AssertionFailedError: expected:<6> but was:<5>
	at junit.framework.Assert.fail(Assert.java:47)
	at junit.framework.Assert.failNotEquals(Assert.java:280)
	at junit.framework.Assert.assertEquals(Assert.java:64)
	at junit.framework.Assert.assertEquals(Assert.java:198)
	at junit.framework.Assert.assertEquals(Assert.java:204)
	at org.joda.time.TestLocalDate_Constructors.testConstructor_Object_nullChronology(TestLocalDate_Constructors.java:508)

testConstructor_nullObject_nullChronology(org.joda.time.TestLocalDate_Constructors)  Time elapsed: 0 sec  <<< FAILURE!
junit.framework.AssertionFailedError: expected:<9> but was:<8>
	at junit.framework.Assert.fail(Assert.java:47)
	at junit.framework.Assert.failNotEquals(Assert.java:280)
	at junit.framework.Assert.assertEquals(Assert.java:64)
	at junit.framework.Assert.assertEquals(Assert.java:198)
	at junit.framework.Assert.assertEquals(Assert.java:204)
	at org.joda.time.TestLocalDate_Constructors.testConstructor_nullObject_nullChronology(TestLocalDate_Constructors.java:516)

testConstructor_Object1(org.joda.time.TestLocalDate_Constructors)  Time elapsed: 0.001 sec  <<< FAILURE!
junit.framework.AssertionFailedError: expected:<6> but was:<5>
	at junit.framework.Assert.fail(Assert.java:47)
	at junit.framework.Assert.failNotEquals(Assert.java:280)
	at junit.framework.Assert.assertEquals(Assert.java:64)
	at junit.framework.Assert.assertEquals(Assert.java:198)
	at junit.framework.Assert.assertEquals(Assert.java:204)
	at org.joda.time.TestLocalDate_Constructors.testConstructor_Object1(TestLocalDate_Constructors.java:321)

testGetters(org.joda.time.TestLocalDate_Basics)  Time elapsed: 0 sec  <<< FAILURE!
junit.framework.AssertionFailedError: expected:<2> but was:<3>
	at junit.framework.Assert.fail(Assert.java:47)
	at junit.framework.Assert.failNotEquals(Assert.java:280)
	at junit.framework.Assert.assertEquals(Assert.java:64)
	at junit.framework.Assert.assertEquals(Assert.java:198)
	at junit.framework.Assert.assertEquals(Assert.java:204)
	at org.joda.time.TestLocalDate_Basics.testGetters(TestLocalDate_Basics.java:629)

testWithers(org.joda.time.TestLocalDate_Basics)  Time elapsed: 0 sec  <<< FAILURE!
junit.framework.AssertionFailedError: expected:<13> but was:<12>
	at junit.framework.Assert.fail(Assert.java:47)
	at junit.framework.Assert.failNotEquals(Assert.java:280)
	at junit.framework.Assert.assertEquals(Assert.java:64)
	at junit.framework.Assert.assertEquals(Assert.java:198)
	at junit.framework.Assert.assertEquals(Assert.java:204)
	at org.joda.time.TestLocalDate_Basics.check(TestLocalDate_Basics.java:1157)
	at org.joda.time.TestLocalDate_Basics.testWithers(TestLocalDate_Basics.java:645)

testToString_String_Locale(org.joda.time.TestLocalDate_Basics)  Time elapsed: 0 sec  <<< FAILURE!
junit.framework.ComparisonFailure: expected:<[Tue] 9/6> but was:<[Wed] 9/6>
	at junit.framework.Assert.assertEquals(Assert.java:81)
	at junit.framework.Assert.assertEquals(Assert.java:87)
	at org.joda.time.TestLocalDate_Basics.testToString_String_Locale(TestLocalDate_Basics.java:1139)

testGet_DateTimeFieldType(org.joda.time.TestLocalDate_Basics)  Time elapsed: 0.001 sec  <<< FAILURE!
junit.framework.AssertionFailedError: expected:<9> but was:<8>
	at junit.framework.Assert.fail(Assert.java:47)
	at junit.framework.Assert.failNotEquals(Assert.java:280)
	at junit.framework.Assert.assertEquals(Assert.java:64)
	at junit.framework.Assert.assertEquals(Assert.java:198)
	at junit.framework.Assert.assertEquals(Assert.java:204)
	at org.joda.time.TestLocalDate_Basics.testGet_DateTimeFieldType(TestLocalDate_Basics.java:125)

testGetValue_int(org.joda.time.TestLocalDate_Basics)  Time elapsed: 0 sec  <<< FAILURE!
junit.framework.AssertionFailedError: expected:<9> but was:<8>
	at junit.framework.Assert.fail(Assert.java:47)
	at junit.framework.Assert.failNotEquals(Assert.java:280)
	at junit.framework.Assert.assertEquals(Assert.java:64)
	at junit.framework.Assert.assertEquals(Assert.java:198)
	at junit.framework.Assert.assertEquals(Assert.java:204)
	at org.joda.time.TestLocalDate_Basics.testGetValue_int(TestLocalDate_Basics.java:193)

testGetValues(org.joda.time.TestLocalDate_Basics)  Time elapsed: 0.001 sec  <<< FAILURE!
junit.framework.AssertionFailedError: expected:<9> but was:<8>
	at junit.framework.Assert.fail(Assert.java:47)
	at junit.framework.Assert.failNotEquals(Assert.java:280)
	at junit.framework.Assert.assertEquals(Assert.java:64)
	at junit.framework.Assert.assertEquals(Assert.java:198)
	at junit.framework.Assert.assertEquals(Assert.java:204)
	at org.joda.time.TestLocalDate_Basics.testGetValues(TestLocalDate_Basics.java:207)

testToInterval_Zone_noMidnight(org.joda.time.TestLocalDate_Basics)  Time elapsed: 0 sec  <<< FAILURE!
junit.framework.AssertionFailedError: expected:<2006-04-01T01:00:00.000+03:00/2006-04-02T00:00:00.000+03:00> but was:<2006-04-01T00:00:00.000+03:00/2006-04-02T00:00:00.000+03:00>
	at junit.framework.Assert.fail(Assert.java:47)
	at junit.framework.Assert.failNotEquals(Assert.java:280)
	at junit.framework.Assert.assertEquals(Assert.java:64)
	at junit.framework.Assert.assertEquals(Assert.java:71)
	at org.joda.time.TestLocalDate_Basics.testToInterval_Zone_noMidnight(TestLocalDate_Basics.java:988)

testConstructor_long_DateTimeZone_2(org.joda.time.TestLocalTime_Constructors)  Time elapsed: 0 sec  <<< FAILURE!
junit.framework.AssertionFailedError: expected:<90123004> but was:<3723004>
	at junit.framework.Assert.fail(Assert.java:47)
	at junit.framework.Assert.failNotEquals(Assert.java:280)
	at junit.framework.Assert.assertEquals(Assert.java:64)
	at junit.framework.Assert.assertEquals(Assert.java:133)
	at junit.framework.Assert.assertEquals(Assert.java:139)
	at org.joda.time.TestLocalTime_Constructors.testConstructor_long_DateTimeZone_2(TestLocalTime_Constructors.java:291)

testToDateTime_RI(org.joda.time.TestLocalTime_Basics)  Time elapsed: 0 sec  <<< FAILURE!
junit.framework.ComparisonFailure: expected:<19[70-01-0]1T01:00:00.000+01:00> but was:<19[69-12-3]1T01:00:00.000+01:00>
	at junit.framework.Assert.assertEquals(Assert.java:81)
	at junit.framework.Assert.assertEquals(Assert.java:87)
	at org.joda.time.TestLocalTime_Basics.testToDateTime_RI(TestLocalTime_Basics.java:718)

testToDateTime_nullRI(org.joda.time.TestLocalTime_Basics)  Time elapsed: 0 sec  <<< FAILURE!
junit.framework.ComparisonFailure: expected:<1970-01-0[2]T01:02:03.004+01:00> but was:<1970-01-0[1]T01:02:03.004+01:00>
	at junit.framework.Assert.assertEquals(Assert.java:81)
	at junit.framework.Assert.assertEquals(Assert.java:87)
	at org.joda.time.TestLocalTime_Basics.testToDateTime_nullRI(TestLocalTime_Basics.java:732)

testFactory_monthsBetween_RPartial_MonthDay(org.joda.time.TestMonths)  Time elapsed: 0.001 sec  <<< ERROR!
org.joda.time.IllegalFieldValueException: Value 29 for dayOfMonth must be in the range [1,28]
	at org.joda.time.field.FieldUtils.verifyValueBounds(FieldUtils.java:234)
	at org.joda.time.field.PreciseDurationDateTimeField.set(PreciseDurationDateTimeField.java:79)
	at org.joda.time.chrono.BaseChronology.set(BaseChronology.java:240)
	at org.joda.time.base.BaseSingleFieldPeriod.between(BaseSingleFieldPeriod.java:105)
	at org.joda.time.Months.monthsBetween(Months.java:161)
	at org.joda.time.TestMonths.testFactory_monthsBetween_RPartial_MonthDay(TestMonths.java:138)

testFactory_daysBetween_RPartial_MonthDay(org.joda.time.TestDays)  Time elapsed: 0 sec  <<< ERROR!
org.joda.time.IllegalFieldValueException: Value 29 for dayOfMonth must be in the range [1,28]
	at org.joda.time.field.FieldUtils.verifyValueBounds(FieldUtils.java:234)
	at org.joda.time.field.PreciseDurationDateTimeField.set(PreciseDurationDateTimeField.java:79)
	at org.joda.time.chrono.BaseChronology.set(BaseChronology.java:240)
	at org.joda.time.base.BaseSingleFieldPeriod.between(BaseSingleFieldPeriod.java:105)
	at org.joda.time.Days.daysBetween(Days.java:141)
	at org.joda.time.TestDays.testFactory_daysBetween_RPartial_MonthDay(TestDays.java:131)

testToDateTime_RI(org.joda.time.TestTimeOfDay_Basics)  Time elapsed: 0 sec  <<< FAILURE!
junit.framework.ComparisonFailure: expected:<19[70-01-0]1T01:00:00.000+01:00> but was:<19[69-12-3]1T01:00:00.000+01:00>
	at junit.framework.Assert.assertEquals(Assert.java:81)
	at junit.framework.Assert.assertEquals(Assert.java:87)
	at org.joda.time.TestTimeOfDay_Basics.testToDateTime_RI(TestTimeOfDay_Basics.java:798)

testToDateTime_nullRI(org.joda.time.TestTimeOfDay_Basics)  Time elapsed: 0 sec  <<< FAILURE!
junit.framework.ComparisonFailure: expected:<1970-01-0[2]T01:02:03.004+01:00> but was:<1970-01-0[1]T01:02:03.004+01:00>
	at junit.framework.Assert.assertEquals(Assert.java:81)
	at junit.framework.Assert.assertEquals(Assert.java:87)
	at org.joda.time.TestTimeOfDay_Basics.testToDateTime_nullRI(TestTimeOfDay_Basics.java:812)

testGetValues(org.joda.time.TestYearMonthDay_Basics)  Time elapsed: 0 sec  <<< FAILURE!
junit.framework.AssertionFailedError: expected:<9> but was:<8>
	at junit.framework.Assert.fail(Assert.java:47)
	at junit.framework.Assert.failNotEquals(Assert.java:280)
	at junit.framework.Assert.assertEquals(Assert.java:64)
	at junit.framework.Assert.assertEquals(Assert.java:198)
	at junit.framework.Assert.assertEquals(Assert.java:204)
	at org.joda.time.TestYearMonthDay_Basics.testGetValues(TestYearMonthDay_Basics.java:166)

testGetValue(org.joda.time.TestYearMonthDay_Basics)  Time elapsed: 0 sec  <<< FAILURE!
junit.framework.AssertionFailedError: expected:<9> but was:<8>
	at junit.framework.Assert.fail(Assert.java:47)
	at junit.framework.Assert.failNotEquals(Assert.java:280)
	at junit.framework.Assert.assertEquals(Assert.java:64)
	at junit.framework.Assert.assertEquals(Assert.java:198)
	at junit.framework.Assert.assertEquals(Assert.java:204)
	at org.joda.time.TestYearMonthDay_Basics.testGetValue(TestYearMonthDay_Basics.java:152)

testGet(org.joda.time.TestYearMonthDay_Basics)  Time elapsed: 0 sec  <<< FAILURE!
junit.framework.AssertionFailedError: expected:<9> but was:<8>
	at junit.framework.Assert.fail(Assert.java:47)
	at junit.framework.Assert.failNotEquals(Assert.java:280)
	at junit.framework.Assert.assertEquals(Assert.java:64)
	at junit.framework.Assert.assertEquals(Assert.java:198)
	at junit.framework.Assert.assertEquals(Assert.java:204)
	at org.joda.time.TestYearMonthDay_Basics.testGet(TestYearMonthDay_Basics.java:88)

testConstructor(org.joda.time.TestYearMonthDay_Constructors)  Time elapsed: 0.001 sec  <<< FAILURE!
junit.framework.AssertionFailedError: expected:<9> but was:<8>
	at junit.framework.Assert.fail(Assert.java:47)
	at junit.framework.Assert.failNotEquals(Assert.java:280)
	at junit.framework.Assert.assertEquals(Assert.java:64)
	at junit.framework.Assert.assertEquals(Assert.java:198)
	at junit.framework.Assert.assertEquals(Assert.java:204)
	at org.joda.time.TestYearMonthDay_Constructors.testConstructor(TestYearMonthDay_Constructors.java:114)

testConstructor_long1(org.joda.time.TestYearMonthDay_Constructors)  Time elapsed: 0 sec  <<< FAILURE!
junit.framework.AssertionFailedError: expected:<6> but was:<5>
	at junit.framework.Assert.fail(Assert.java:47)
	at junit.framework.Assert.failNotEquals(Assert.java:280)
	at junit.framework.Assert.assertEquals(Assert.java:64)
	at junit.framework.Assert.assertEquals(Assert.java:198)
	at junit.framework.Assert.assertEquals(Assert.java:204)
	at org.joda.time.TestYearMonthDay_Constructors.testConstructor_long1(TestYearMonthDay_Constructors.java:184)

testConstructor_long2(org.joda.time.TestYearMonthDay_Constructors)  Time elapsed: 0 sec  <<< FAILURE!
junit.framework.AssertionFailedError: expected:<7> but was:<6>
	at junit.framework.Assert.fail(Assert.java:47)
	at junit.framework.Assert.failNotEquals(Assert.java:280)
	at junit.framework.Assert.assertEquals(Assert.java:64)
	at junit.framework.Assert.assertEquals(Assert.java:198)
	at junit.framework.Assert.assertEquals(Assert.java:204)
	at org.joda.time.TestYearMonthDay_Constructors.testConstructor_long2(TestYearMonthDay_Constructors.java:195)

testConstructor_Object(org.joda.time.TestYearMonthDay_Constructors)  Time elapsed: 0 sec  <<< FAILURE!
junit.framework.AssertionFailedError: expected:<6> but was:<5>
	at junit.framework.Assert.fail(Assert.java:47)
	at junit.framework.Assert.failNotEquals(Assert.java:280)
	at junit.framework.Assert.assertEquals(Assert.java:64)
	at junit.framework.Assert.assertEquals(Assert.java:198)
	at junit.framework.Assert.assertEquals(Assert.java:204)
	at org.joda.time.TestYearMonthDay_Constructors.testConstructor_Object(TestYearMonthDay_Constructors.java:238)

testConstructor_nullObject(org.joda.time.TestYearMonthDay_Constructors)  Time elapsed: 0 sec  <<< FAILURE!
junit.framework.AssertionFailedError: expected:<9> but was:<8>
	at junit.framework.Assert.fail(Assert.java:47)
	at junit.framework.Assert.failNotEquals(Assert.java:280)
	at junit.framework.Assert.assertEquals(Assert.java:64)
	at junit.framework.Assert.assertEquals(Assert.java:198)
	at junit.framework.Assert.assertEquals(Assert.java:204)
	at org.joda.time.TestYearMonthDay_Constructors.testConstructor_nullObject(TestYearMonthDay_Constructors.java:246)

testConstructor_Chronology(org.joda.time.TestYearMonthDay_Constructors)  Time elapsed: 0.001 sec  <<< FAILURE!
junit.framework.AssertionFailedError: expected:<9> but was:<8>
	at junit.framework.Assert.fail(Assert.java:47)
	at junit.framework.Assert.failNotEquals(Assert.java:280)
	at junit.framework.Assert.assertEquals(Assert.java:64)
	at junit.framework.Assert.assertEquals(Assert.java:198)
	at junit.framework.Assert.assertEquals(Assert.java:204)
	at org.joda.time.TestYearMonthDay_Constructors.testConstructor_Chronology(TestYearMonthDay_Constructors.java:161)

testConstructor_nullChronology(org.joda.time.TestYearMonthDay_Constructors)  Time elapsed: 0.001 sec  <<< FAILURE!
junit.framework.AssertionFailedError: expected:<9> but was:<8>
	at junit.framework.Assert.fail(Assert.java:47)
	at junit.framework.Assert.failNotEquals(Assert.java:280)
	at junit.framework.Assert.assertEquals(Assert.java:64)
	at junit.framework.Assert.assertEquals(Assert.java:198)
	at junit.framework.Assert.assertEquals(Assert.java:204)
	at org.joda.time.TestYearMonthDay_Constructors.testConstructor_nullChronology(TestYearMonthDay_Constructors.java:172)

testConstructor_long1_Chronology(org.joda.time.TestYearMonthDay_Constructors)  Time elapsed: 0 sec  <<< FAILURE!
junit.framework.AssertionFailedError: expected:<6> but was:<5>
	at junit.framework.Assert.fail(Assert.java:47)
	at junit.framework.Assert.failNotEquals(Assert.java:280)
	at junit.framework.Assert.assertEquals(Assert.java:64)
	at junit.framework.Assert.assertEquals(Assert.java:198)
	at junit.framework.Assert.assertEquals(Assert.java:204)
	at org.joda.time.TestYearMonthDay_Constructors.testConstructor_long1_Chronology(TestYearMonthDay_Constructors.java:206)

testConstructor_long2_Chronology(org.joda.time.TestYearMonthDay_Constructors)  Time elapsed: 0.001 sec  <<< FAILURE!
junit.framework.AssertionFailedError: expected:<7> but was:<6>
	at junit.framework.Assert.fail(Assert.java:47)
	at junit.framework.Assert.failNotEquals(Assert.java:280)
	at junit.framework.Assert.assertEquals(Assert.java:64)
	at junit.framework.Assert.assertEquals(Assert.java:198)
	at junit.framework.Assert.assertEquals(Assert.java:204)
	at org.joda.time.TestYearMonthDay_Constructors.testConstructor_long2_Chronology(TestYearMonthDay_Constructors.java:217)

testConstructor_long_nullChronology(org.joda.time.TestYearMonthDay_Constructors)  Time elapsed: 0.001 sec  <<< FAILURE!
junit.framework.AssertionFailedError: expected:<6> but was:<5>
	at junit.framework.Assert.fail(Assert.java:47)
	at junit.framework.Assert.failNotEquals(Assert.java:280)
	at junit.framework.Assert.assertEquals(Assert.java:64)
	at junit.framework.Assert.assertEquals(Assert.java:198)
	at junit.framework.Assert.assertEquals(Assert.java:204)
	at org.joda.time.TestYearMonthDay_Constructors.testConstructor_long_nullChronology(TestYearMonthDay_Constructors.java:228)

testConstructor_Object_Chronology(org.joda.time.TestYearMonthDay_Constructors)  Time elapsed: 0 sec  <<< FAILURE!
junit.framework.AssertionFailedError: expected:<6> but was:<5>
	at junit.framework.Assert.fail(Assert.java:47)
	at junit.framework.Assert.failNotEquals(Assert.java:280)
	at junit.framework.Assert.assertEquals(Assert.java:64)
	at junit.framework.Assert.assertEquals(Assert.java:198)
	at junit.framework.Assert.assertEquals(Assert.java:204)
	at org.joda.time.TestYearMonthDay_Constructors.testConstructor_Object_Chronology(TestYearMonthDay_Constructors.java:335)

testConstructor_nullObject_Chronology(org.joda.time.TestYearMonthDay_Constructors)  Time elapsed: 0.001 sec  <<< FAILURE!
junit.framework.AssertionFailedError: expected:<9> but was:<8>
	at junit.framework.Assert.fail(Assert.java:47)
	at junit.framework.Assert.failNotEquals(Assert.java:280)
	at junit.framework.Assert.assertEquals(Assert.java:64)
	at junit.framework.Assert.assertEquals(Assert.java:198)
	at junit.framework.Assert.assertEquals(Assert.java:204)
	at org.joda.time.TestYearMonthDay_Constructors.testConstructor_nullObject_Chronology(TestYearMonthDay_Constructors.java:346)

testConstructor_Object_nullChronology(org.joda.time.TestYearMonthDay_Constructors)  Time elapsed: 0 sec  <<< FAILURE!
junit.framework.AssertionFailedError: expected:<6> but was:<5>
	at junit.framework.Assert.fail(Assert.java:47)
	at junit.framework.Assert.failNotEquals(Assert.java:280)
	at junit.framework.Assert.assertEquals(Assert.java:64)
	at junit.framework.Assert.assertEquals(Assert.java:198)
	at junit.framework.Assert.assertEquals(Assert.java:204)
	at org.joda.time.TestYearMonthDay_Constructors.testConstructor_Object_nullChronology(TestYearMonthDay_Constructors.java:358)

testConstructor_nullObject_nullChronology(org.joda.time.TestYearMonthDay_Constructors)  Time elapsed: 0.001 sec  <<< FAILURE!
junit.framework.AssertionFailedError: expected:<9> but was:<8>
	at junit.framework.Assert.fail(Assert.java:47)
	at junit.framework.Assert.failNotEquals(Assert.java:280)
	at junit.framework.Assert.assertEquals(Assert.java:64)
	at junit.framework.Assert.assertEquals(Assert.java:198)
	at junit.framework.Assert.assertEquals(Assert.java:204)
	at org.joda.time.TestYearMonthDay_Constructors.testConstructor_nullObject_nullChronology(TestYearMonthDay_Constructors.java:369)

testGetValues(org.joda.time.TestMonthDay_Basics)  Time elapsed: 0.001 sec  <<< FAILURE!
junit.framework.AssertionFailedError: expected:<9> but was:<8>
	at junit.framework.Assert.fail(Assert.java:47)
	at junit.framework.Assert.failNotEquals(Assert.java:280)
	at junit.framework.Assert.assertEquals(Assert.java:64)
	at junit.framework.Assert.assertEquals(Assert.java:198)
	at junit.framework.Assert.assertEquals(Assert.java:204)
	at org.joda.time.TestMonthDay_Basics.testGetValues(TestMonthDay_Basics.java:165)

testGetValue(org.joda.time.TestMonthDay_Basics)  Time elapsed: 0 sec  <<< FAILURE!
junit.framework.AssertionFailedError: expected:<9> but was:<8>
	at junit.framework.Assert.fail(Assert.java:47)
	at junit.framework.Assert.failNotEquals(Assert.java:280)
	at junit.framework.Assert.assertEquals(Assert.java:64)
	at junit.framework.Assert.assertEquals(Assert.java:198)
	at junit.framework.Assert.assertEquals(Assert.java:204)
	at org.joda.time.TestMonthDay_Basics.testGetValue(TestMonthDay_Basics.java:151)

testGet(org.joda.time.TestMonthDay_Basics)  Time elapsed: 0 sec  <<< FAILURE!
junit.framework.AssertionFailedError: expected:<9> but was:<8>
	at junit.framework.Assert.fail(Assert.java:47)
	at junit.framework.Assert.failNotEquals(Assert.java:280)
	at junit.framework.Assert.assertEquals(Assert.java:64)
	at junit.framework.Assert.assertEquals(Assert.java:198)
	at junit.framework.Assert.assertEquals(Assert.java:204)
	at org.joda.time.TestMonthDay_Basics.testGet(TestMonthDay_Basics.java:89)

testConstructor(org.joda.time.TestMonthDay_Constructors)  Time elapsed: 0 sec  <<< FAILURE!
junit.framework.AssertionFailedError: expected:<9> but was:<8>
	at junit.framework.Assert.fail(Assert.java:47)
	at junit.framework.Assert.failNotEquals(Assert.java:280)
	at junit.framework.Assert.assertEquals(Assert.java:64)
	at junit.framework.Assert.assertEquals(Assert.java:198)
	at junit.framework.Assert.assertEquals(Assert.java:204)
	at org.joda.time.TestMonthDay_Constructors.testConstructor(TestMonthDay_Constructors.java:125)

testParse_noFormatter(org.joda.time.TestMonthDay_Constructors)  Time elapsed: 0.001 sec  <<< ERROR!
org.joda.time.IllegalFieldValueException: Cannot parse "--02-29": Value 29 for dayOfMonth must be in the range [1,28]
	at org.joda.time.field.FieldUtils.verifyValueBounds(FieldUtils.java:234)
	at org.joda.time.field.PreciseDurationDateTimeField.set(PreciseDurationDateTimeField.java:79)
	at org.joda.time.format.DateTimeParserBucket$SavedField.set(DateTimeParserBucket.java:568)
	at org.joda.time.format.DateTimeParserBucket.computeMillis(DateTimeParserBucket.java:447)
	at org.joda.time.format.DateTimeParserBucket.computeMillis(DateTimeParserBucket.java:440)
	at org.joda.time.format.DateTimeParserBucket.computeMillis(DateTimeParserBucket.java:411)
	at org.joda.time.format.DateTimeFormatter.parseLocalDateTime(DateTimeFormatter.java:841)
	at org.joda.time.format.DateTimeFormatter.parseLocalDate(DateTimeFormatter.java:798)
	at org.joda.time.MonthDay.parse(MonthDay.java:160)
	at org.joda.time.MonthDay.parse(MonthDay.java:149)
	at org.joda.time.TestMonthDay_Constructors.testParse_noFormatter(TestMonthDay_Constructors.java:83)

testConstructor_long1(org.joda.time.TestMonthDay_Constructors)  Time elapsed: 0.004 sec  <<< FAILURE!
junit.framework.AssertionFailedError: expected:<6> but was:<5>
	at junit.framework.Assert.fail(Assert.java:47)
	at junit.framework.Assert.failNotEquals(Assert.java:280)
	at junit.framework.Assert.assertEquals(Assert.java:64)
	at junit.framework.Assert.assertEquals(Assert.java:198)
	at junit.framework.Assert.assertEquals(Assert.java:204)
	at org.joda.time.TestMonthDay_Constructors.testConstructor_long1(TestMonthDay_Constructors.java:193)

testConstructor_long2(org.joda.time.TestMonthDay_Constructors)  Time elapsed: 0 sec  <<< FAILURE!
junit.framework.AssertionFailedError: expected:<7> but was:<6>
	at junit.framework.Assert.fail(Assert.java:47)
	at junit.framework.Assert.failNotEquals(Assert.java:280)
	at junit.framework.Assert.assertEquals(Assert.java:64)
	at junit.framework.Assert.assertEquals(Assert.java:198)
	at junit.framework.Assert.assertEquals(Assert.java:204)
	at org.joda.time.TestMonthDay_Constructors.testConstructor_long2(TestMonthDay_Constructors.java:203)

testConstructor_Object(org.joda.time.TestMonthDay_Constructors)  Time elapsed: 0 sec  <<< FAILURE!
junit.framework.AssertionFailedError: expected:<6> but was:<5>
	at junit.framework.Assert.fail(Assert.java:47)
	at junit.framework.Assert.failNotEquals(Assert.java:280)
	at junit.framework.Assert.assertEquals(Assert.java:64)
	at junit.framework.Assert.assertEquals(Assert.java:198)
	at junit.framework.Assert.assertEquals(Assert.java:204)
	at org.joda.time.TestMonthDay_Constructors.testConstructor_Object(TestMonthDay_Constructors.java:242)

testConstructor_nullObject(org.joda.time.TestMonthDay_Constructors)  Time elapsed: 0 sec  <<< FAILURE!
junit.framework.AssertionFailedError: expected:<9> but was:<8>
	at junit.framework.Assert.fail(Assert.java:47)
	at junit.framework.Assert.failNotEquals(Assert.java:280)
	at junit.framework.Assert.assertEquals(Assert.java:64)
	at junit.framework.Assert.assertEquals(Assert.java:198)
	at junit.framework.Assert.assertEquals(Assert.java:204)
	at org.joda.time.TestMonthDay_Constructors.testConstructor_nullObject(TestMonthDay_Constructors.java:249)

testConstructor_Chronology(org.joda.time.TestMonthDay_Constructors)  Time elapsed: 0 sec  <<< FAILURE!
junit.framework.AssertionFailedError: expected:<9> but was:<8>
	at junit.framework.Assert.fail(Assert.java:47)
	at junit.framework.Assert.failNotEquals(Assert.java:280)
	at junit.framework.Assert.assertEquals(Assert.java:64)
	at junit.framework.Assert.assertEquals(Assert.java:198)
	at junit.framework.Assert.assertEquals(Assert.java:204)
	at org.joda.time.TestMonthDay_Constructors.testConstructor_Chronology(TestMonthDay_Constructors.java:171)

testConstructor_nullChronology(org.joda.time.TestMonthDay_Constructors)  Time elapsed: 0 sec  <<< FAILURE!
junit.framework.AssertionFailedError: expected:<9> but was:<8>
	at junit.framework.Assert.fail(Assert.java:47)
	at junit.framework.Assert.failNotEquals(Assert.java:280)
	at junit.framework.Assert.assertEquals(Assert.java:64)
	at junit.framework.Assert.assertEquals(Assert.java:198)
	at junit.framework.Assert.assertEquals(Assert.java:204)
	at org.joda.time.TestMonthDay_Constructors.testConstructor_nullChronology(TestMonthDay_Constructors.java:182)

testConstructor_long1_Chronology(org.joda.time.TestMonthDay_Constructors)  Time elapsed: 0 sec  <<< FAILURE!
junit.framework.AssertionFailedError: expected:<6> but was:<5>
	at junit.framework.Assert.fail(Assert.java:47)
	at junit.framework.Assert.failNotEquals(Assert.java:280)
	at junit.framework.Assert.assertEquals(Assert.java:64)
	at junit.framework.Assert.assertEquals(Assert.java:198)
	at junit.framework.Assert.assertEquals(Assert.java:204)
	at org.joda.time.TestMonthDay_Constructors.testConstructor_long1_Chronology(TestMonthDay_Constructors.java:213)

testConstructor_long2_Chronology(org.joda.time.TestMonthDay_Constructors)  Time elapsed: 0.001 sec  <<< FAILURE!
junit.framework.AssertionFailedError: expected:<7> but was:<6>
	at junit.framework.Assert.fail(Assert.java:47)
	at junit.framework.Assert.failNotEquals(Assert.java:280)
	at junit.framework.Assert.assertEquals(Assert.java:64)
	at junit.framework.Assert.assertEquals(Assert.java:198)
	at junit.framework.Assert.assertEquals(Assert.java:204)
	at org.joda.time.TestMonthDay_Constructors.testConstructor_long2_Chronology(TestMonthDay_Constructors.java:223)

testConstructor_long_nullChronology(org.joda.time.TestMonthDay_Constructors)  Time elapsed: 0 sec  <<< FAILURE!
junit.framework.AssertionFailedError: expected:<6> but was:<5>
	at junit.framework.Assert.fail(Assert.java:47)
	at junit.framework.Assert.failNotEquals(Assert.java:280)
	at junit.framework.Assert.assertEquals(Assert.java:64)
	at junit.framework.Assert.assertEquals(Assert.java:198)
	at junit.framework.Assert.assertEquals(Assert.java:204)
	at org.joda.time.TestMonthDay_Constructors.testConstructor_long_nullChronology(TestMonthDay_Constructors.java:233)

testConstructor_Object_Chronology(org.joda.time.TestMonthDay_Constructors)  Time elapsed: 0 sec  <<< FAILURE!
junit.framework.AssertionFailedError: expected:<6> but was:<5>
	at junit.framework.Assert.fail(Assert.java:47)
	at junit.framework.Assert.failNotEquals(Assert.java:280)
	at junit.framework.Assert.assertEquals(Assert.java:64)
	at junit.framework.Assert.assertEquals(Assert.java:198)
	at junit.framework.Assert.assertEquals(Assert.java:204)
	at org.joda.time.TestMonthDay_Constructors.testConstructor_Object_Chronology(TestMonthDay_Constructors.java:311)

testConstructor_nullObject_Chronology(org.joda.time.TestMonthDay_Constructors)  Time elapsed: 0.001 sec  <<< FAILURE!
junit.framework.AssertionFailedError: expected:<9> but was:<8>
	at junit.framework.Assert.fail(Assert.java:47)
	at junit.framework.Assert.failNotEquals(Assert.java:280)
	at junit.framework.Assert.assertEquals(Assert.java:64)
	at junit.framework.Assert.assertEquals(Assert.java:198)
	at junit.framework.Assert.assertEquals(Assert.java:204)
	at org.joda.time.TestMonthDay_Constructors.testConstructor_nullObject_Chronology(TestMonthDay_Constructors.java:321)

testConstructor_Object_nullChronology(org.joda.time.TestMonthDay_Constructors)  Time elapsed: 0.001 sec  <<< FAILURE!
junit.framework.AssertionFailedError: expected:<6> but was:<5>
	at junit.framework.Assert.fail(Assert.java:47)
	at junit.framework.Assert.failNotEquals(Assert.java:280)
	at junit.framework.Assert.assertEquals(Assert.java:64)
	at junit.framework.Assert.assertEquals(Assert.java:198)
	at junit.framework.Assert.assertEquals(Assert.java:204)
	at org.joda.time.TestMonthDay_Constructors.testConstructor_Object_nullChronology(TestMonthDay_Constructors.java:332)

testConstructor_nullObject_nullChronology(org.joda.time.TestMonthDay_Constructors)  Time elapsed: 0 sec  <<< FAILURE!
junit.framework.AssertionFailedError: expected:<9> but was:<8>
	at junit.framework.Assert.fail(Assert.java:47)
	at junit.framework.Assert.failNotEquals(Assert.java:280)
	at junit.framework.Assert.assertEquals(Assert.java:64)
	at junit.framework.Assert.assertEquals(Assert.java:198)
	at junit.framework.Assert.assertEquals(Assert.java:204)
	at org.joda.time.TestMonthDay_Constructors.testConstructor_nullObject_nullChronology(TestMonthDay_Constructors.java:342)

testToDateTime_RI(org.joda.time.TestPartial_Basics)  Time elapsed: 0.001 sec  <<< FAILURE!
junit.framework.ComparisonFailure: expected:<19[70-01-0]1T01:00:00.000+01:00> but was:<19[69-12-3]1T01:00:00.000+01:00>
	at junit.framework.Assert.assertEquals(Assert.java:81)
	at junit.framework.Assert.assertEquals(Assert.java:87)
	at org.joda.time.TestPartial_Basics.testToDateTime_RI(TestPartial_Basics.java:745)

testToDateTime_nullRI(org.joda.time.TestPartial_Basics)  Time elapsed: 0.001 sec  <<< FAILURE!
junit.framework.ComparisonFailure: expected:<1970-01-0[2]T01:02:07.008+01:00> but was:<1970-01-0[1]T01:02:07.008+01:00>
	at junit.framework.Assert.assertEquals(Assert.java:81)
	at junit.framework.Assert.assertEquals(Assert.java:87)
	at org.joda.time.TestPartial_Basics.testToDateTime_nullRI(TestPartial_Basics.java:759)

test_julianDay(org.joda.time.TestDateTimeUtils)  Time elapsed: 0 sec  <<< FAILURE!
junit.framework.AssertionFailedError: expected:<2440587.5> but was:<2440588.5>
	at junit.framework.Assert.fail(Assert.java:47)
	at junit.framework.Assert.failNotEquals(Assert.java:280)
	at junit.framework.Assert.assertEquals(Assert.java:98)
	at junit.framework.Assert.assertEquals(Assert.java:105)
	at org.joda.time.TestDateTimeUtils.test_julianDay(TestDateTimeUtils.java:479)

testIsLocalDateTimeGap_NewYork(org.joda.time.TestDateTimeZone)  Time elapsed: 0.001 sec  <<< FAILURE!
junit.framework.AssertionFailedError: expected:<true> but was:<false>
	at junit.framework.Assert.fail(Assert.java:47)
	at junit.framework.Assert.failNotEquals(Assert.java:280)
	at junit.framework.Assert.assertEquals(Assert.java:64)
	at junit.framework.Assert.assertEquals(Assert.java:146)
	at junit.framework.Assert.assertEquals(Assert.java:152)
	at org.joda.time.TestDateTimeZone.testIsLocalDateTimeGap_NewYork(TestDateTimeZone.java:951)

testPatchedNameKeysSydney(org.joda.time.TestDateTimeZone)  Time elapsed: 0.002 sec  <<< FAILURE!
junit.framework.AssertionFailedError: expected:<false> but was:<true>
	at junit.framework.Assert.fail(Assert.java:47)
	at junit.framework.Assert.failNotEquals(Assert.java:280)
	at junit.framework.Assert.assertEquals(Assert.java:64)
	at junit.framework.Assert.assertEquals(Assert.java:146)
	at junit.framework.Assert.assertEquals(Assert.java:152)
	at org.joda.time.TestDateTimeZone.testPatchedNameKeysSydney(TestDateTimeZone.java:1083)

testPatchedNameKeysSydneyHistoric(org.joda.time.TestDateTimeZone)  Time elapsed: 0 sec  <<< FAILURE!
junit.framework.AssertionFailedError: expected:<false> but was:<true>
	at junit.framework.Assert.fail(Assert.java:47)
	at junit.framework.Assert.failNotEquals(Assert.java:280)
	at junit.framework.Assert.assertEquals(Assert.java:64)
	at junit.framework.Assert.assertEquals(Assert.java:146)
	at junit.framework.Assert.assertEquals(Assert.java:152)
	at org.joda.time.TestDateTimeZone.testPatchedNameKeysSydneyHistoric(TestDateTimeZone.java:1093)

testPatchedNameKeysGazaHistoric(org.joda.time.TestDateTimeZone)  Time elapsed: 0.001 sec  <<< FAILURE!
junit.framework.AssertionFailedError: expected:<false> but was:<true>
	at junit.framework.Assert.fail(Assert.java:47)
	at junit.framework.Assert.failNotEquals(Assert.java:280)
	at junit.framework.Assert.assertEquals(Assert.java:64)
	at junit.framework.Assert.assertEquals(Assert.java:146)
	at junit.framework.Assert.assertEquals(Assert.java:152)
	at org.joda.time.TestDateTimeZone.testPatchedNameKeysGazaHistoric(TestDateTimeZone.java:1103)

test_GuatemataIsCorrect_Autumn(org.joda.time.TestDateTimeZoneCutover)  Time elapsed: 0.001 sec  <<< FAILURE!
junit.framework.ComparisonFailure: expected:<2006-09-30T2[3:59:59.999-05:00]> but was:<2006-09-30T2[2:57:55.999-06:02:04]>
	at junit.framework.Assert.assertEquals(Assert.java:81)
	at junit.framework.Assert.assertEquals(Assert.java:87)
	at org.joda.time.TestDateTimeZoneCutover.test_GuatemataIsCorrect_Autumn(TestDateTimeZoneCutover.java:964)

test_getOffsetFromLocal_Guatemata_Autumn(org.joda.time.TestDateTimeZoneCutover)  Time elapsed: 0 sec  <<< FAILURE!
junit.framework.AssertionFailedError: expected:<-18000000> but was:<-21724000>
	at junit.framework.Assert.fail(Assert.java:47)
	at junit.framework.Assert.failNotEquals(Assert.java:280)
	at junit.framework.Assert.assertEquals(Assert.java:64)
	at junit.framework.Assert.assertEquals(Assert.java:133)
	at junit.framework.Assert.assertEquals(Assert.java:139)
	at org.joda.time.TestDateTimeZoneCutover.doTest_getOffsetFromLocal(TestDateTimeZoneCutover.java:1369)
	at org.joda.time.TestDateTimeZoneCutover.doTest_getOffsetFromLocal(TestDateTimeZoneCutover.java:1363)
	at org.joda.time.TestDateTimeZoneCutover.test_getOffsetFromLocal_Guatemata_Autumn(TestDateTimeZoneCutover.java:972)

test_DateTime_plusHour_Guatemata_Autumn(org.joda.time.TestDateTimeZoneCutover)  Time elapsed: 0.001 sec  <<< FAILURE!
junit.framework.ComparisonFailure: expected:<...09-30T20:00:00.000-0[5:00]> but was:<...09-30T20:00:00.000-0[6:02:04]>
	at junit.framework.Assert.assertEquals(Assert.java:81)
	at junit.framework.Assert.assertEquals(Assert.java:87)
	at org.joda.time.TestDateTimeZoneCutover.test_DateTime_plusHour_Guatemata_Autumn(TestDateTimeZoneCutover.java:1014)

test_DateTime_minusHour_Guatemata_Autumn(org.joda.time.TestDateTimeZoneCutover)  Time elapsed: 0 sec  <<< FAILURE!
junit.framework.ComparisonFailure: expected:<...01T02:00:00.000-06:0[0]> but was:<...01T02:00:00.000-06:0[2:04]>
	at junit.framework.Assert.assertEquals(Assert.java:81)
	at junit.framework.Assert.assertEquals(Assert.java:87)
	at org.joda.time.TestDateTimeZoneCutover.test_DateTime_minusHour_Guatemata_Autumn(TestDateTimeZoneCutover.java:1034)

testWithMillisOfSecondInDstChange_NewYork_summer(org.joda.time.TestDateTimeZoneCutover)  Time elapsed: 0.001 sec  <<< FAILURE!
junit.framework.ComparisonFailure: expected:<2007-11-04T0[1:30:00.123-04]:00> but was:<2007-11-04T0[0:30:00.123-05]:00>
	at junit.framework.Assert.assertEquals(Assert.java:81)
	at junit.framework.Assert.assertEquals(Assert.java:87)
	at org.joda.time.TestDateTimeZoneCutover.testWithMillisOfSecondInDstChange_NewYork_summer(TestDateTimeZoneCutover.java:1175)

testBug2182444_ausNSW(org.joda.time.TestDateTimeZoneCutover)  Time elapsed: 0 sec  <<< FAILURE!
junit.framework.AssertionFailedError: Should be standard time
	at junit.framework.Assert.fail(Assert.java:47)
	at junit.framework.Assert.assertTrue(Assert.java:20)
	at org.joda.time.TestDateTimeZoneCutover.testBug2182444_ausNSW(TestDateTimeZoneCutover.java:1232)

testBug3476684_adjustOffset(org.joda.time.TestDateTimeZoneCutover)  Time elapsed: 0.001 sec  <<< FAILURE!
junit.framework.AssertionFailedError: expected:<2012-02-26T00:15:00.000-02:00> but was:<2012-02-25T23:15:00.000-02:00>
	at junit.framework.Assert.fail(Assert.java:47)
	at junit.framework.Assert.failNotEquals(Assert.java:280)
	at junit.framework.Assert.assertEquals(Assert.java:64)
	at junit.framework.Assert.assertEquals(Assert.java:71)
	at org.joda.time.TestDateTimeZoneCutover.testBug3476684_adjustOffset(TestDateTimeZoneCutover.java:1292)

test_NewYorkIsCorrect_Spring(org.joda.time.TestDateTimeZoneCutover)  Time elapsed: 0.001 sec  <<< FAILURE!
junit.framework.ComparisonFailure: expected:<2007-03-11T0[3:00:00.000-04]:00> but was:<2007-03-11T0[2:00:00.000-05]:00>
	at junit.framework.Assert.assertEquals(Assert.java:81)
	at junit.framework.Assert.assertEquals(Assert.java:87)
	at org.joda.time.TestDateTimeZoneCutover.test_NewYorkIsCorrect_Spring(TestDateTimeZoneCutover.java:493)

test_getOffsetFromLocal_NewYork_Spring(org.joda.time.TestDateTimeZoneCutover)  Time elapsed: 0 sec  <<< FAILURE!
junit.framework.ComparisonFailure: 2007-03-11T02:00:00.000-05:00 expected:<2007-03-11T0[3:00:00.000-04]:00> but was:<2007-03-11T0[2:00:00.000-05]:00>
	at junit.framework.Assert.assertEquals(Assert.java:81)
	at org.joda.time.TestDateTimeZoneCutover.doTest_getOffsetFromLocal(TestDateTimeZoneCutover.java:1371)
	at org.joda.time.TestDateTimeZoneCutover.doTest_getOffsetFromLocal(TestDateTimeZoneCutover.java:1355)
	at org.joda.time.TestDateTimeZoneCutover.test_getOffsetFromLocal_NewYork_Spring(TestDateTimeZoneCutover.java:502)

test_DateTime_setHourAcross_NewYork_Spring(org.joda.time.TestDateTimeZoneCutover)  Time elapsed: 0.001 sec  <<< FAILURE!
junit.framework.ComparisonFailure: expected:<...03-11T04:00:00.000-0[4]:00> but was:<...03-11T04:00:00.000-0[5]:00>
	at junit.framework.Assert.assertEquals(Assert.java:81)
	at junit.framework.Assert.assertEquals(Assert.java:87)
	at org.joda.time.TestDateTimeZoneCutover.test_DateTime_setHourAcross_NewYork_Spring(TestDateTimeZoneCutover.java:518)

test_DateTime_setHourForward_NewYork_Spring(org.joda.time.TestDateTimeZoneCutover)  Time elapsed: 0 sec  <<< FAILURE!
junit.framework.AssertionFailedError
	at junit.framework.Assert.fail(Assert.java:47)
	at junit.framework.Assert.fail(Assert.java:53)
	at org.joda.time.TestDateTimeZoneCutover.test_DateTime_setHourForward_NewYork_Spring(TestDateTimeZoneCutover.java:527)

test_DateTime_setHourBack_NewYork_Spring(org.joda.time.TestDateTimeZoneCutover)  Time elapsed: 0.001 sec  <<< FAILURE!
junit.framework.ComparisonFailure: expected:<...03-11T08:00:00.000-0[4]:00> but was:<...03-11T08:00:00.000-0[5]:00>
	at junit.framework.Assert.assertEquals(Assert.java:81)
	at junit.framework.Assert.assertEquals(Assert.java:87)
	at org.joda.time.TestDateTimeZoneCutover.test_DateTime_setHourBack_NewYork_Spring(TestDateTimeZoneCutover.java:535)

test_DateTime_roundFloor_day_NewYork_Spring_postCutover(org.joda.time.TestDateTimeZoneCutover)  Time elapsed: 0 sec  <<< FAILURE!
junit.framework.ComparisonFailure: expected:<...03-11T03:30:00.000-0[4]:00> but was:<...03-11T03:30:00.000-0[5]:00>
	at junit.framework.Assert.assertEquals(Assert.java:81)
	at junit.framework.Assert.assertEquals(Assert.java:87)
	at org.joda.time.TestDateTimeZoneCutover.test_DateTime_roundFloor_day_NewYork_Spring_postCutover(TestDateTimeZoneCutover.java:555)

test_DateTime_roundFloor_hour_NewYork_Spring_postCutover(org.joda.time.TestDateTimeZoneCutover)  Time elapsed: 0 sec  <<< FAILURE!
junit.framework.ComparisonFailure: expected:<...03-11T03:30:00.000-0[4]:00> but was:<...03-11T03:30:00.000-0[5]:00>
	at junit.framework.Assert.assertEquals(Assert.java:81)
	at junit.framework.Assert.assertEquals(Assert.java:87)
	at org.joda.time.TestDateTimeZoneCutover.test_DateTime_roundFloor_hour_NewYork_Spring_postCutover(TestDateTimeZoneCutover.java:569)

test_DateTime_roundFloor_minute_NewYork_Spring_postCutover(org.joda.time.TestDateTimeZoneCutover)  Time elapsed: 0.001 sec  <<< FAILURE!
junit.framework.ComparisonFailure: expected:<...03-11T03:30:40.000-0[4]:00> but was:<...03-11T03:30:40.000-0[5]:00>
	at junit.framework.Assert.assertEquals(Assert.java:81)
	at junit.framework.Assert.assertEquals(Assert.java:87)
	at org.joda.time.TestDateTimeZoneCutover.test_DateTime_roundFloor_minute_NewYork_Spring_postCutover(TestDateTimeZoneCutover.java:583)

test_DateTime_roundCeiling_day_NewYork_Spring_preCutover(org.joda.time.TestDateTimeZoneCutover)  Time elapsed: 0 sec  <<< FAILURE!
junit.framework.ComparisonFailure: expected:<...03-12T00:00:00.000-0[4]:00> but was:<...03-12T00:00:00.000-0[5]:00>
	at junit.framework.Assert.assertEquals(Assert.java:81)
	at junit.framework.Assert.assertEquals(Assert.java:87)
	at org.joda.time.TestDateTimeZoneCutover.test_DateTime_roundCeiling_day_NewYork_Spring_preCutover(TestDateTimeZoneCutover.java:593)

test_DateTime_roundCeiling_day_NewYork_Spring_postCutover(org.joda.time.TestDateTimeZoneCutover)  Time elapsed: 0.001 sec  <<< FAILURE!
junit.framework.ComparisonFailure: expected:<...03-11T03:30:00.000-0[4]:00> but was:<...03-11T03:30:00.000-0[5]:00>
	at junit.framework.Assert.assertEquals(Assert.java:81)
	at junit.framework.Assert.assertEquals(Assert.java:87)
	at org.joda.time.TestDateTimeZoneCutover.test_DateTime_roundCeiling_day_NewYork_Spring_postCutover(TestDateTimeZoneCutover.java:598)

test_DateTime_roundCeiling_hour_NewYork_Spring_preCutover(org.joda.time.TestDateTimeZoneCutover)  Time elapsed: 0 sec  <<< FAILURE!
junit.framework.ComparisonFailure: expected:<2007-03-11T0[3:00:00.000-04]:00> but was:<2007-03-11T0[2:00:00.000-05]:00>
	at junit.framework.Assert.assertEquals(Assert.java:81)
	at junit.framework.Assert.assertEquals(Assert.java:87)
	at org.joda.time.TestDateTimeZoneCutover.test_DateTime_roundCeiling_hour_NewYork_Spring_preCutover(TestDateTimeZoneCutover.java:607)

test_DateTime_roundCeiling_hour_NewYork_Spring_postCutover(org.joda.time.TestDateTimeZoneCutover)  Time elapsed: 0 sec  <<< FAILURE!
junit.framework.ComparisonFailure: expected:<...03-11T03:30:00.000-0[4]:00> but was:<...03-11T03:30:00.000-0[5]:00>
	at junit.framework.Assert.assertEquals(Assert.java:81)
	at junit.framework.Assert.assertEquals(Assert.java:87)
	at org.joda.time.TestDateTimeZoneCutover.test_DateTime_roundCeiling_hour_NewYork_Spring_postCutover(TestDateTimeZoneCutover.java:612)

test_DateTime_roundCeiling_minute_NewYork_Spring_postCutover(org.joda.time.TestDateTimeZoneCutover)  Time elapsed: 0 sec  <<< FAILURE!
junit.framework.ComparisonFailure: expected:<...03-11T03:30:40.000-0[4]:00> but was:<...03-11T03:30:40.000-0[5]:00>
	at junit.framework.Assert.assertEquals(Assert.java:81)
	at junit.framework.Assert.assertEquals(Assert.java:87)
	at org.joda.time.TestDateTimeZoneCutover.test_DateTime_roundCeiling_minute_NewYork_Spring_postCutover(TestDateTimeZoneCutover.java:626)

test_NewYorkIsCorrect_Autumn(org.joda.time.TestDateTimeZoneCutover)  Time elapsed: 0.003 sec  <<< FAILURE!
junit.framework.ComparisonFailure: expected:<2007-11-04T0[1:59:59.999-04]:00> but was:<2007-11-04T0[0:59:59.999-05]:00>
	at junit.framework.Assert.assertEquals(Assert.java:81)
	at junit.framework.Assert.assertEquals(Assert.java:87)
	at org.joda.time.TestDateTimeZoneCutover.test_NewYorkIsCorrect_Autumn(TestDateTimeZoneCutover.java:638)

test_getOffsetFromLocal_NewYork_Autumn(org.joda.time.TestDateTimeZoneCutover)  Time elapsed: 0 sec  <<< FAILURE!
junit.framework.AssertionFailedError: expected:<-14400000> but was:<-18000000>
	at junit.framework.Assert.fail(Assert.java:47)
	at junit.framework.Assert.failNotEquals(Assert.java:280)
	at junit.framework.Assert.assertEquals(Assert.java:64)
	at junit.framework.Assert.assertEquals(Assert.java:133)
	at junit.framework.Assert.assertEquals(Assert.java:139)
	at org.joda.time.TestDateTimeZoneCutover.doTest_getOffsetFromLocal(TestDateTimeZoneCutover.java:1369)
	at org.joda.time.TestDateTimeZoneCutover.doTest_getOffsetFromLocal(TestDateTimeZoneCutover.java:1355)
	at org.joda.time.TestDateTimeZoneCutover.test_getOffsetFromLocal_NewYork_Autumn(TestDateTimeZoneCutover.java:646)

test_DateTime_constructor_NewYork_Autumn(org.joda.time.TestDateTimeZoneCutover)  Time elapsed: 0 sec  <<< FAILURE!
junit.framework.ComparisonFailure: expected:<...11-04T01:30:00.000-0[4]:00> but was:<...11-04T01:30:00.000-0[5]:00>
	at junit.framework.Assert.assertEquals(Assert.java:81)
	at junit.framework.Assert.assertEquals(Assert.java:87)
	at org.joda.time.TestDateTimeZoneCutover.test_DateTime_constructor_NewYork_Autumn(TestDateTimeZoneCutover.java:665)

test_DateTime_plusHour_NewYork_Autumn(org.joda.time.TestDateTimeZoneCutover)  Time elapsed: 0 sec  <<< FAILURE!
junit.framework.ComparisonFailure: expected:<...11-03T18:00:00.000-0[4]:00> but was:<...11-03T18:00:00.000-0[5]:00>
	at junit.framework.Assert.assertEquals(Assert.java:81)
	at junit.framework.Assert.assertEquals(Assert.java:87)
	at org.joda.time.TestDateTimeZoneCutover.test_DateTime_plusHour_NewYork_Autumn(TestDateTimeZoneCutover.java:670)

test_DateTime_minusHour_NewYork_Autumn(org.joda.time.TestDateTimeZoneCutover)  Time elapsed: 0 sec  <<< FAILURE!
junit.framework.ComparisonFailure: expected:<2007-11-04T0[1:00:00.000-04]:00> but was:<2007-11-04T0[0:00:00.000-05]:00>
	at junit.framework.Assert.assertEquals(Assert.java:81)
	at junit.framework.Assert.assertEquals(Assert.java:87)
	at org.joda.time.TestDateTimeZoneCutover.test_DateTime_minusHour_NewYork_Autumn(TestDateTimeZoneCutover.java:691)

test_DateTime_roundFloor_day_NewYork_Autumn_preCutover(org.joda.time.TestDateTimeZoneCutover)  Time elapsed: 0 sec  <<< FAILURE!
junit.framework.ComparisonFailure: expected:<...11-04T01:30:00.000-0[4]:00> but was:<...11-04T01:30:00.000-0[5]:00>
	at junit.framework.Assert.assertEquals(Assert.java:81)
	at junit.framework.Assert.assertEquals(Assert.java:87)
	at org.joda.time.TestDateTimeZoneCutover.test_DateTime_roundFloor_day_NewYork_Autumn_preCutover(TestDateTimeZoneCutover.java:699)

test_DateTime_roundFloor_day_NewYork_Autumn_postCutover(org.joda.time.TestDateTimeZoneCutover)  Time elapsed: 0 sec  <<< FAILURE!
junit.framework.ComparisonFailure: expected:<2007-11-04T0[1]:30:00.000-05:00> but was:<2007-11-04T0[2]:30:00.000-05:00>
	at junit.framework.Assert.assertEquals(Assert.java:81)
	at junit.framework.Assert.assertEquals(Assert.java:87)
	at org.joda.time.TestDateTimeZoneCutover.test_DateTime_roundFloor_day_NewYork_Autumn_postCutover(TestDateTimeZoneCutover.java:706)

test_DateTime_roundFloor_hourOfDay_NewYork_Autumn_preCutover(org.joda.time.TestDateTimeZoneCutover)  Time elapsed: 0.001 sec  <<< FAILURE!
junit.framework.ComparisonFailure: expected:<...11-04T01:30:00.000-0[4]:00> but was:<...11-04T01:30:00.000-0[5]:00>
	at junit.framework.Assert.assertEquals(Assert.java:81)
	at junit.framework.Assert.assertEquals(Assert.java:87)
	at org.joda.time.TestDateTimeZoneCutover.test_DateTime_roundFloor_hourOfDay_NewYork_Autumn_preCutover(TestDateTimeZoneCutover.java:713)

test_DateTime_roundFloor_hourOfDay_NewYork_Autumn_postCutover(org.joda.time.TestDateTimeZoneCutover)  Time elapsed: 0 sec  <<< FAILURE!
junit.framework.ComparisonFailure: expected:<2007-11-04T0[1]:30:00.000-05:00> but was:<2007-11-04T0[2]:30:00.000-05:00>
	at junit.framework.Assert.assertEquals(Assert.java:81)
	at junit.framework.Assert.assertEquals(Assert.java:87)
	at org.joda.time.TestDateTimeZoneCutover.test_DateTime_roundFloor_hourOfDay_NewYork_Autumn_postCutover(TestDateTimeZoneCutover.java:720)

test_DateTime_roundFloor_minuteOfHour_NewYork_Autumn_preCutover(org.joda.time.TestDateTimeZoneCutover)  Time elapsed: 0.001 sec  <<< FAILURE!
junit.framework.ComparisonFailure: expected:<...11-04T01:30:40.000-0[4]:00> but was:<...11-04T01:30:40.000-0[5]:00>
	at junit.framework.Assert.assertEquals(Assert.java:81)
	at junit.framework.Assert.assertEquals(Assert.java:87)
	at org.joda.time.TestDateTimeZoneCutover.test_DateTime_roundFloor_minuteOfHour_NewYork_Autumn_preCutover(TestDateTimeZoneCutover.java:727)

test_DateTime_roundFloor_minuteOfHour_NewYork_Autumn_postCutover(org.joda.time.TestDateTimeZoneCutover)  Time elapsed: 0 sec  <<< FAILURE!
junit.framework.ComparisonFailure: expected:<2007-11-04T0[1]:30:40.000-05:00> but was:<2007-11-04T0[2]:30:40.000-05:00>
	at junit.framework.Assert.assertEquals(Assert.java:81)
	at junit.framework.Assert.assertEquals(Assert.java:87)
	at org.joda.time.TestDateTimeZoneCutover.test_DateTime_roundFloor_minuteOfHour_NewYork_Autumn_postCutover(TestDateTimeZoneCutover.java:734)

test_DateTime_roundFloor_secondOfMinute_NewYork_Autumn_preCutover(org.joda.time.TestDateTimeZoneCutover)  Time elapsed: 0.001 sec  <<< FAILURE!
junit.framework.ComparisonFailure: expected:<...11-04T01:30:40.500-0[4]:00> but was:<...11-04T01:30:40.500-0[5]:00>
	at junit.framework.Assert.assertEquals(Assert.java:81)
	at junit.framework.Assert.assertEquals(Assert.java:87)
	at org.joda.time.TestDateTimeZoneCutover.test_DateTime_roundFloor_secondOfMinute_NewYork_Autumn_preCutover(TestDateTimeZoneCutover.java:741)

test_DateTime_roundFloor_secondOfMinute_NewYork_Autumn_postCutover(org.joda.time.TestDateTimeZoneCutover)  Time elapsed: 0 sec  <<< FAILURE!
junit.framework.ComparisonFailure: expected:<2007-11-04T0[1]:30:40.500-05:00> but was:<2007-11-04T0[2]:30:40.500-05:00>
	at junit.framework.Assert.assertEquals(Assert.java:81)
	at junit.framework.Assert.assertEquals(Assert.java:87)
	at org.joda.time.TestDateTimeZoneCutover.test_DateTime_roundFloor_secondOfMinute_NewYork_Autumn_postCutover(TestDateTimeZoneCutover.java:748)

test_DateTime_roundCeiling_day_NewYork_Autumn_preCutover(org.joda.time.TestDateTimeZoneCutover)  Time elapsed: 0 sec  <<< FAILURE!
junit.framework.ComparisonFailure: expected:<...11-04T01:30:00.000-0[4]:00> but was:<...11-04T01:30:00.000-0[5]:00>
	at junit.framework.Assert.assertEquals(Assert.java:81)
	at junit.framework.Assert.assertEquals(Assert.java:87)
	at org.joda.time.TestDateTimeZoneCutover.test_DateTime_roundCeiling_day_NewYork_Autumn_preCutover(TestDateTimeZoneCutover.java:756)

test_DateTime_roundCeiling_day_NewYork_Autumn_postCutover(org.joda.time.TestDateTimeZoneCutover)  Time elapsed: 0 sec  <<< FAILURE!
junit.framework.ComparisonFailure: expected:<2007-11-04T0[1]:30:00.000-05:00> but was:<2007-11-04T0[2]:30:00.000-05:00>
	at junit.framework.Assert.assertEquals(Assert.java:81)
	at junit.framework.Assert.assertEquals(Assert.java:87)
	at org.joda.time.TestDateTimeZoneCutover.test_DateTime_roundCeiling_day_NewYork_Autumn_postCutover(TestDateTimeZoneCutover.java:763)

test_DateTime_roundCeiling_hourOfDay_NewYork_Autumn_preCutover(org.joda.time.TestDateTimeZoneCutover)  Time elapsed: 0 sec  <<< FAILURE!
junit.framework.ComparisonFailure: expected:<...11-04T01:30:00.000-0[4]:00> but was:<...11-04T01:30:00.000-0[5]:00>
	at junit.framework.Assert.assertEquals(Assert.java:81)
	at junit.framework.Assert.assertEquals(Assert.java:87)
	at org.joda.time.TestDateTimeZoneCutover.test_DateTime_roundCeiling_hourOfDay_NewYork_Autumn_preCutover(TestDateTimeZoneCutover.java:770)

test_DateTime_roundCeiling_hourOfDay_NewYork_Autumn_postCutover(org.joda.time.TestDateTimeZoneCutover)  Time elapsed: 0.001 sec  <<< FAILURE!
junit.framework.ComparisonFailure: expected:<2007-11-04T0[1]:30:00.000-05:00> but was:<2007-11-04T0[2]:30:00.000-05:00>
	at junit.framework.Assert.assertEquals(Assert.java:81)
	at junit.framework.Assert.assertEquals(Assert.java:87)
	at org.joda.time.TestDateTimeZoneCutover.test_DateTime_roundCeiling_hourOfDay_NewYork_Autumn_postCutover(TestDateTimeZoneCutover.java:777)

test_DateTime_roundCeiling_minuteOfHour_NewYork_Autumn_preCutover(org.joda.time.TestDateTimeZoneCutover)  Time elapsed: 0 sec  <<< FAILURE!
junit.framework.ComparisonFailure: expected:<...11-04T01:30:40.000-0[4]:00> but was:<...11-04T01:30:40.000-0[5]:00>
	at junit.framework.Assert.assertEquals(Assert.java:81)
	at junit.framework.Assert.assertEquals(Assert.java:87)
	at org.joda.time.TestDateTimeZoneCutover.test_DateTime_roundCeiling_minuteOfHour_NewYork_Autumn_preCutover(TestDateTimeZoneCutover.java:784)

test_DateTime_roundCeiling_minuteOfHour_NewYork_Autumn_postCutover(org.joda.time.TestDateTimeZoneCutover)  Time elapsed: 0.001 sec  <<< FAILURE!
junit.framework.ComparisonFailure: expected:<2007-11-04T0[1]:30:40.000-05:00> but was:<2007-11-04T0[2]:30:40.000-05:00>
	at junit.framework.Assert.assertEquals(Assert.java:81)
	at junit.framework.Assert.assertEquals(Assert.java:87)
	at org.joda.time.TestDateTimeZoneCutover.test_DateTime_roundCeiling_minuteOfHour_NewYork_Autumn_postCutover(TestDateTimeZoneCutover.java:791)

test_DateTime_roundCeiling_secondOfMinute_NewYork_Autumn_preCutover(org.joda.time.TestDateTimeZoneCutover)  Time elapsed: 0 sec  <<< FAILURE!
junit.framework.ComparisonFailure: expected:<...11-04T01:30:40.500-0[4]:00> but was:<...11-04T01:30:40.500-0[5]:00>
	at junit.framework.Assert.assertEquals(Assert.java:81)
	at junit.framework.Assert.assertEquals(Assert.java:87)
	at org.joda.time.TestDateTimeZoneCutover.test_DateTime_roundCeiling_secondOfMinute_NewYork_Autumn_preCutover(TestDateTimeZoneCutover.java:798)

test_DateTime_roundCeiling_secondOfMinute_NewYork_Autumn_postCutover(org.joda.time.TestDateTimeZoneCutover)  Time elapsed: 0.001 sec  <<< FAILURE!
junit.framework.ComparisonFailure: expected:<2007-11-04T0[1]:30:40.500-05:00> but was:<2007-11-04T0[2]:30:40.500-05:00>
	at junit.framework.Assert.assertEquals(Assert.java:81)
	at junit.framework.Assert.assertEquals(Assert.java:87)
	at org.joda.time.TestDateTimeZoneCutover.test_DateTime_roundCeiling_secondOfMinute_NewYork_Autumn_postCutover(TestDateTimeZoneCutover.java:805)

testMonthDay_leapDay(org.joda.time.TestStringConvert)  Time elapsed: 0 sec  <<< ERROR!
org.joda.time.IllegalFieldValueException: Cannot parse "--02-29": Value 29 for dayOfMonth must be in the range [1,28]
	at org.joda.time.field.FieldUtils.verifyValueBounds(FieldUtils.java:234)
	at org.joda.time.field.PreciseDurationDateTimeField.set(PreciseDurationDateTimeField.java:79)
	at org.joda.time.format.DateTimeParserBucket$SavedField.set(DateTimeParserBucket.java:568)
	at org.joda.time.format.DateTimeParserBucket.computeMillis(DateTimeParserBucket.java:447)
	at org.joda.time.format.DateTimeParserBucket.computeMillis(DateTimeParserBucket.java:440)
	at org.joda.time.format.DateTimeParserBucket.computeMillis(DateTimeParserBucket.java:411)
	at org.joda.time.format.DateTimeFormatter.parseLocalDateTime(DateTimeFormatter.java:841)
	at org.joda.time.format.DateTimeFormatter.parseLocalDate(DateTimeFormatter.java:798)
	at org.joda.time.MonthDay.parse(MonthDay.java:160)
	at org.joda.time.MonthDay.parse(MonthDay.java:149)
	at sun.reflect.NativeMethodAccessorImpl.invoke0(Native Method)
	at sun.reflect.NativeMethodAccessorImpl.invoke(NativeMethodAccessorImpl.java:57)
	at sun.reflect.DelegatingMethodAccessorImpl.invoke(DelegatingMethodAccessorImpl.java:43)
	at java.lang.reflect.Method.invoke(Method.java:606)
	at org.joda.convert.MethodsStringConverter.convertFromString(MethodsStringConverter.java:70)
	at org.joda.convert.StringConvert.convertFromString(StringConvert.java:163)
	at org.joda.time.TestStringConvert.testMonthDay_leapDay(TestStringConvert.java:113)

testGJCutover(org.joda.time.TestIllegalFieldValueException)  Time elapsed: 0.001 sec  <<< FAILURE!
junit.framework.AssertionFailedError
	at junit.framework.Assert.fail(Assert.java:47)
	at junit.framework.Assert.fail(Assert.java:53)
	at org.joda.time.TestIllegalFieldValueException.testGJCutover(TestIllegalFieldValueException.java:247)

testToString(org.joda.time.chrono.TestGJChronology)  Time elapsed: 0.001 sec  <<< FAILURE!
junit.framework.ComparisonFailure: expected:<...ology[UTC,cutover=19[70-01-0]1]> but was:<...ology[UTC,cutover=19[69-12-3]1]>
	at junit.framework.Assert.assertEquals(Assert.java:81)
	at junit.framework.Assert.assertEquals(Assert.java:87)
	at org.joda.time.chrono.TestGJChronology.testToString(TestGJChronology.java:194)

testFactory_Zone_RI_int(org.joda.time.chrono.TestGJChronology)  Time elapsed: 0.001 sec  <<< FAILURE!
junit.framework.AssertionFailedError: expected:<1582-10-15T00:00:00.000Z> but was:<1582-10-14T00:00:00.000Z>
	at junit.framework.Assert.fail(Assert.java:47)
	at junit.framework.Assert.failNotEquals(Assert.java:280)
	at junit.framework.Assert.assertEquals(Assert.java:64)
	at junit.framework.Assert.assertEquals(Assert.java:71)
	at org.joda.time.chrono.TestGJChronology.testFactory_Zone_RI_int(TestGJChronology.java:151)

testIllegalDates(org.joda.time.chrono.TestGJChronology)  Time elapsed: 0 sec  <<< FAILURE!
junit.framework.AssertionFailedError: Constructed illegal date
	at junit.framework.Assert.fail(Assert.java:47)
	at org.joda.time.chrono.TestGJChronology.testIllegalDates(TestGJChronology.java:357)

testCutoverAddWeekyears(org.joda.time.chrono.TestGJChronology)  Time elapsed: 0.001 sec  <<< ERROR!
org.joda.time.IllegalFieldValueException: Cannot parse "1580-W01-1": Value 53 for weekOfWeekyear must be in the range [1,52]
	at org.joda.time.field.FieldUtils.verifyValueBounds(FieldUtils.java:234)
	at org.joda.time.field.PreciseDurationDateTimeField.set(PreciseDurationDateTimeField.java:79)
	at org.joda.time.chrono.GJChronology.convertByWeekyear(GJChronology.java:95)
	at org.joda.time.chrono.GJChronology.gregorianToJulianByWeekyear(GJChronology.java:589)
	at org.joda.time.chrono.GJChronology$CutoverField.gregorianToJulian(GJChronology.java:929)
	at org.joda.time.chrono.GJChronology$CutoverField.set(GJChronology.java:731)
	at org.joda.time.format.DateTimeParserBucket$SavedField.set(DateTimeParserBucket.java:568)
	at org.joda.time.format.DateTimeParserBucket.computeMillis(DateTimeParserBucket.java:447)
	at org.joda.time.format.DateTimeParserBucket.doParseMillis(DateTimeParserBucket.java:182)
	at org.joda.time.format.DateTimeFormatter.parseMillis(DateTimeFormatter.java:780)
	at org.joda.time.convert.StringConverter.getInstantMillis(StringConverter.java:65)
	at org.joda.time.base.BaseDateTime.<init>(BaseDateTime.java:175)
	at org.joda.time.DateTime.<init>(DateTime.java:302)
	at org.joda.time.chrono.TestGJChronology.testAdd(TestGJChronology.java:482)
	at org.joda.time.chrono.TestGJChronology.testCutoverAddWeekyears(TestGJChronology.java:416)

testCutoverAddWeeks(org.joda.time.chrono.TestGJChronology)  Time elapsed: 0.001 sec  <<< FAILURE!
junit.framework.AssertionFailedError: expected:<1582-10-25T00:00:00.000Z> but was:<1582-10-24T00:00:00.000Z>
	at junit.framework.Assert.fail(Assert.java:47)
	at junit.framework.Assert.failNotEquals(Assert.java:280)
	at junit.framework.Assert.assertEquals(Assert.java:64)
	at junit.framework.Assert.assertEquals(Assert.java:71)
	at org.joda.time.chrono.TestGJChronology.testAdd(TestGJChronology.java:484)
	at org.joda.time.chrono.TestGJChronology.testCutoverAddWeeks(TestGJChronology.java:447)

testCutoverAddDays(org.joda.time.chrono.TestGJChronology)  Time elapsed: 0.001 sec  <<< FAILURE!
junit.framework.AssertionFailedError: expected:<1582-10-15T00:00:00.000Z> but was:<1582-10-14T00:00:00.000Z>
	at junit.framework.Assert.fail(Assert.java:47)
	at junit.framework.Assert.failNotEquals(Assert.java:280)
	at junit.framework.Assert.assertEquals(Assert.java:64)
	at junit.framework.Assert.assertEquals(Assert.java:71)
	at org.joda.time.chrono.TestGJChronology.testAdd(TestGJChronology.java:484)
	at org.joda.time.chrono.TestGJChronology.testCutoverAddDays(TestGJChronology.java:453)

testFactory_Zone_RI(org.joda.time.chrono.TestGJChronology)  Time elapsed: 0.001 sec  <<< FAILURE!
junit.framework.AssertionFailedError: expected:<1582-10-15T00:00:00.000Z> but was:<1582-10-14T00:00:00.000Z>
	at junit.framework.Assert.fail(Assert.java:47)
	at junit.framework.Assert.failNotEquals(Assert.java:280)
	at junit.framework.Assert.assertEquals(Assert.java:64)
	at junit.framework.Assert.assertEquals(Assert.java:71)
	at org.joda.time.chrono.TestGJChronology.testFactory_Zone_RI(TestGJChronology.java:138)

testFieldConstructor(org.joda.time.chrono.TestIslamicChronology)  Time elapsed: 0 sec  <<< FAILURE!
junit.framework.AssertionFailedError: expected:<-761616000000> but was:<-761702400000>
	at junit.framework.Assert.fail(Assert.java:47)
	at junit.framework.Assert.failNotEquals(Assert.java:280)
	at junit.framework.Assert.assertEquals(Assert.java:64)
	at junit.framework.Assert.assertEquals(Assert.java:133)
	at junit.framework.Assert.assertEquals(Assert.java:139)
	at org.joda.time.chrono.TestIslamicChronology.testFieldConstructor(TestIslamicChronology.java:314)

testSampleDate1(org.joda.time.chrono.TestIslamicChronology)  Time elapsed: 0.001 sec  <<< FAILURE!
junit.framework.AssertionFailedError: expected:<1365-12-06T00:00:00.000Z> but was:<1365-12-07T00:00:00.000Z>
	at junit.framework.Assert.fail(Assert.java:47)
	at junit.framework.Assert.failNotEquals(Assert.java:280)
	at junit.framework.Assert.assertEquals(Assert.java:64)
	at junit.framework.Assert.assertEquals(Assert.java:71)
	at org.joda.time.chrono.TestIslamicChronology.testSampleDate1(TestIslamicChronology.java:426)

test_lenientChrononolgy_Chicago(org.joda.time.chrono.TestLenientChronology)  Time elapsed: 0.001 sec  <<< FAILURE!
junit.framework.ComparisonFailure: expected:<2007-03-11T0[3:30:00.000-05]:00> but was:<2007-03-11T0[2:30:00.000-06]:00>
	at junit.framework.Assert.assertEquals(Assert.java:81)
	at junit.framework.Assert.assertEquals(Assert.java:87)
	at org.joda.time.chrono.TestLenientChronology.test_lenientChrononolgy_Chicago(TestLenientChronology.java:139)

test_strictChrononolgy_Chicago(org.joda.time.chrono.TestLenientChronology)  Time elapsed: 0 sec  <<< FAILURE!
junit.framework.AssertionFailedError
	at junit.framework.Assert.fail(Assert.java:47)
	at junit.framework.Assert.fail(Assert.java:53)
	at org.joda.time.chrono.TestLenientChronology.test_strictChrononolgy_Chicago(TestLenientChronology.java:153)

test_isoChrononolgy_Chicago(org.joda.time.chrono.TestLenientChronology)  Time elapsed: 0.001 sec  <<< FAILURE!
junit.framework.AssertionFailedError
	at junit.framework.Assert.fail(Assert.java:47)
	at junit.framework.Assert.fail(Assert.java:53)
	at org.joda.time.chrono.TestLenientChronology.test_isoChrononolgy_Chicago(TestLenientChronology.java:164)

testChronology(org.joda.time.chrono.gj.MainTest)  Time elapsed: 0.003 sec  <<< FAILURE!
junit.framework.AssertionFailedError
	at junit.framework.Assert.fail(Assert.java:47)
	at org.joda.time.chrono.gj.MainTest.testChronology(MainTest.java:158)

testParseLocalDateTime_monthDay_feb29(org.joda.time.format.TestDateTimeFormatter)  Time elapsed: 0 sec  <<< ERROR!
org.joda.time.IllegalFieldValueException: Cannot parse "2 29 13 40": Value 29 for dayOfMonth must be in the range [1,28]
	at org.joda.time.field.FieldUtils.verifyValueBounds(FieldUtils.java:234)
	at org.joda.time.field.PreciseDurationDateTimeField.set(PreciseDurationDateTimeField.java:79)
	at org.joda.time.chrono.GJChronology$CutoverField.set(GJChronology.java:727)
	at org.joda.time.format.DateTimeParserBucket$SavedField.set(DateTimeParserBucket.java:568)
	at org.joda.time.format.DateTimeParserBucket.computeMillis(DateTimeParserBucket.java:447)
	at org.joda.time.format.DateTimeParserBucket.computeMillis(DateTimeParserBucket.java:440)
	at org.joda.time.format.DateTimeParserBucket.computeMillis(DateTimeParserBucket.java:411)
	at org.joda.time.format.DateTimeFormatter.parseLocalDateTime(DateTimeFormatter.java:841)
	at org.joda.time.format.TestDateTimeFormatter.testParseLocalDateTime_monthDay_feb29(TestDateTimeFormatter.java:526)

testParseLocalDate_monthDay_feb29(org.joda.time.format.TestDateTimeFormatter)  Time elapsed: 0 sec  <<< ERROR!
org.joda.time.IllegalFieldValueException: Cannot parse "2 29": Value 29 for dayOfMonth must be in the range [1,28]
	at org.joda.time.field.FieldUtils.verifyValueBounds(FieldUtils.java:234)
	at org.joda.time.field.PreciseDurationDateTimeField.set(PreciseDurationDateTimeField.java:79)
	at org.joda.time.chrono.GJChronology$CutoverField.set(GJChronology.java:727)
	at org.joda.time.format.DateTimeParserBucket$SavedField.set(DateTimeParserBucket.java:568)
	at org.joda.time.format.DateTimeParserBucket.computeMillis(DateTimeParserBucket.java:447)
	at org.joda.time.format.DateTimeParserBucket.computeMillis(DateTimeParserBucket.java:440)
	at org.joda.time.format.DateTimeParserBucket.computeMillis(DateTimeParserBucket.java:411)
	at org.joda.time.format.DateTimeFormatter.parseLocalDateTime(DateTimeFormatter.java:841)
	at org.joda.time.format.DateTimeFormatter.parseLocalDate(DateTimeFormatter.java:798)
	at org.joda.time.format.TestDateTimeFormatter.testParseLocalDate_monthDay_feb29(TestDateTimeFormatter.java:411)

testFormat_weekyearOfEra_twoDigit(org.joda.time.format.TestDateTimeFormat)  Time elapsed: 0.001 sec  <<< FAILURE!
junit.framework.AssertionFailedError: expected:<1922-01-02T00:00:00.000Z> but was:<1922-01-01T00:00:00.000Z>
	at junit.framework.Assert.fail(Assert.java:47)
	at junit.framework.Assert.failNotEquals(Assert.java:280)
	at junit.framework.Assert.assertEquals(Assert.java:64)
	at junit.framework.Assert.assertEquals(Assert.java:71)
	at org.joda.time.format.TestDateTimeFormat.testFormat_weekyearOfEra_twoDigit(TestDateTimeFormat.java:395)

test_basicTime(org.joda.time.format.TestISODateTimeFormatParsing)  Time elapsed: 0 sec  <<< FAILURE!
junit.framework.AssertionFailedError: expected:<1970-01-01T10:20:30.400Z> but was:<1969-12-31T10:20:30.400Z>
	at junit.framework.Assert.fail(Assert.java:47)
	at junit.framework.Assert.failNotEquals(Assert.java:280)
	at junit.framework.Assert.assertEquals(Assert.java:64)
	at junit.framework.Assert.assertEquals(Assert.java:71)
	at org.joda.time.format.TestISODateTimeFormatParsing.assertParse(TestISODateTimeFormatParsing.java:841)
	at org.joda.time.format.TestISODateTimeFormatParsing.test_basicTime(TestISODateTimeFormatParsing.java:582)

test_basicTimeNoMillis(org.joda.time.format.TestISODateTimeFormatParsing)  Time elapsed: 0.001 sec  <<< FAILURE!
junit.framework.AssertionFailedError: expected:<1970-01-01T10:20:30.000Z> but was:<1969-12-31T10:20:30.000Z>
	at junit.framework.Assert.fail(Assert.java:47)
	at junit.framework.Assert.failNotEquals(Assert.java:280)
	at junit.framework.Assert.assertEquals(Assert.java:64)
	at junit.framework.Assert.assertEquals(Assert.java:71)
	at org.joda.time.format.TestISODateTimeFormatParsing.assertParse(TestISODateTimeFormatParsing.java:841)
	at org.joda.time.format.TestISODateTimeFormatParsing.test_basicTimeNoMillis(TestISODateTimeFormatParsing.java:597)

test_basicTTime(org.joda.time.format.TestISODateTimeFormatParsing)  Time elapsed: 0 sec  <<< FAILURE!
junit.framework.AssertionFailedError: expected:<1970-01-01T10:20:30.400Z> but was:<1969-12-31T10:20:30.400Z>
	at junit.framework.Assert.fail(Assert.java:47)
	at junit.framework.Assert.failNotEquals(Assert.java:280)
	at junit.framework.Assert.assertEquals(Assert.java:64)
	at junit.framework.Assert.assertEquals(Assert.java:71)
	at org.joda.time.format.TestISODateTimeFormatParsing.assertParse(TestISODateTimeFormatParsing.java:841)
	at org.joda.time.format.TestISODateTimeFormatParsing.test_basicTTime(TestISODateTimeFormatParsing.java:609)

test_basicTTimeNoMillis(org.joda.time.format.TestISODateTimeFormatParsing)  Time elapsed: 0.001 sec  <<< FAILURE!
junit.framework.AssertionFailedError: expected:<1970-01-01T10:20:30.000Z> but was:<1969-12-31T10:20:30.000Z>
	at junit.framework.Assert.fail(Assert.java:47)
	at junit.framework.Assert.failNotEquals(Assert.java:280)
	at junit.framework.Assert.assertEquals(Assert.java:64)
	at junit.framework.Assert.assertEquals(Assert.java:71)
	at org.joda.time.format.TestISODateTimeFormatParsing.assertParse(TestISODateTimeFormatParsing.java:841)
	at org.joda.time.format.TestISODateTimeFormatParsing.test_basicTTimeNoMillis(TestISODateTimeFormatParsing.java:624)

test_hourMinute(org.joda.time.format.TestISODateTimeFormatParsing)  Time elapsed: 0 sec  <<< FAILURE!
junit.framework.AssertionFailedError: expected:<1970-01-01T10:20:00.000Z> but was:<1969-12-31T10:20:00.000Z>
	at junit.framework.Assert.fail(Assert.java:47)
	at junit.framework.Assert.failNotEquals(Assert.java:280)
	at junit.framework.Assert.assertEquals(Assert.java:64)
	at junit.framework.Assert.assertEquals(Assert.java:71)
	at org.joda.time.format.TestISODateTimeFormatParsing.assertParse(TestISODateTimeFormatParsing.java:841)
	at org.joda.time.format.TestISODateTimeFormatParsing.test_hourMinute(TestISODateTimeFormatParsing.java:767)

test_hourMinuteSecond(org.joda.time.format.TestISODateTimeFormatParsing)  Time elapsed: 0.001 sec  <<< FAILURE!
junit.framework.AssertionFailedError: expected:<1970-01-01T10:20:30.000Z> but was:<1969-12-31T10:20:30.000Z>
	at junit.framework.Assert.fail(Assert.java:47)
	at junit.framework.Assert.failNotEquals(Assert.java:280)
	at junit.framework.Assert.assertEquals(Assert.java:64)
	at junit.framework.Assert.assertEquals(Assert.java:71)
	at org.joda.time.format.TestISODateTimeFormatParsing.assertParse(TestISODateTimeFormatParsing.java:841)
	at org.joda.time.format.TestISODateTimeFormatParsing.test_hourMinuteSecond(TestISODateTimeFormatParsing.java:782)

test_hourMinuteSecondMillis(org.joda.time.format.TestISODateTimeFormatParsing)  Time elapsed: 0 sec  <<< FAILURE!
junit.framework.AssertionFailedError: expected:<1970-01-01T10:20:30.400Z> but was:<1969-12-31T10:20:30.400Z>
	at junit.framework.Assert.fail(Assert.java:47)
	at junit.framework.Assert.failNotEquals(Assert.java:280)
	at junit.framework.Assert.assertEquals(Assert.java:64)
	at junit.framework.Assert.assertEquals(Assert.java:71)
	at org.joda.time.format.TestISODateTimeFormatParsing.assertParse(TestISODateTimeFormatParsing.java:841)
	at org.joda.time.format.TestISODateTimeFormatParsing.test_hourMinuteSecondMillis(TestISODateTimeFormatParsing.java:797)

test_hourMinuteSecondFraction(org.joda.time.format.TestISODateTimeFormatParsing)  Time elapsed: 0.001 sec  <<< FAILURE!
junit.framework.AssertionFailedError: expected:<1970-01-01T10:20:30.400Z> but was:<1969-12-31T10:20:30.400Z>
	at junit.framework.Assert.fail(Assert.java:47)
	at junit.framework.Assert.failNotEquals(Assert.java:280)
	at junit.framework.Assert.assertEquals(Assert.java:64)
	at junit.framework.Assert.assertEquals(Assert.java:71)
	at org.joda.time.format.TestISODateTimeFormatParsing.assertParse(TestISODateTimeFormatParsing.java:841)
	at org.joda.time.format.TestISODateTimeFormatParsing.test_hourMinuteSecondFraction(TestISODateTimeFormatParsing.java:812)

test_timeParser(org.joda.time.format.TestISODateTimeFormatParsing)  Time elapsed: 0.001 sec  <<< FAILURE!
junit.framework.AssertionFailedError: expected:<1970-01-01T10:20:30.040Z> but was:<1969-12-31T10:20:30.040Z>
	at junit.framework.Assert.fail(Assert.java:47)
	at junit.framework.Assert.failNotEquals(Assert.java:280)
	at junit.framework.Assert.assertEquals(Assert.java:64)
	at junit.framework.Assert.assertEquals(Assert.java:71)
	at org.joda.time.format.TestISODateTimeFormatParsing.assertParse(TestISODateTimeFormatParsing.java:841)
	at org.joda.time.format.TestISODateTimeFormatParsing.test_timeParser(TestISODateTimeFormatParsing.java:180)

test_time(org.joda.time.format.TestISODateTimeFormatParsing)  Time elapsed: 0 sec  <<< FAILURE!
junit.framework.AssertionFailedError: expected:<1970-01-01T10:20:30.400Z> but was:<1969-12-31T10:20:30.400Z>
	at junit.framework.Assert.fail(Assert.java:47)
	at junit.framework.Assert.failNotEquals(Assert.java:280)
	at junit.framework.Assert.assertEquals(Assert.java:64)
	at junit.framework.Assert.assertEquals(Assert.java:71)
	at org.joda.time.format.TestISODateTimeFormatParsing.assertParse(TestISODateTimeFormatParsing.java:841)
	at org.joda.time.format.TestISODateTimeFormatParsing.test_time(TestISODateTimeFormatParsing.java:375)

test_timeNoMillis(org.joda.time.format.TestISODateTimeFormatParsing)  Time elapsed: 0 sec  <<< FAILURE!
junit.framework.AssertionFailedError: expected:<1970-01-01T10:20:30.000Z> but was:<1969-12-31T10:20:30.000Z>
	at junit.framework.Assert.fail(Assert.java:47)
	at junit.framework.Assert.failNotEquals(Assert.java:280)
	at junit.framework.Assert.assertEquals(Assert.java:64)
	at junit.framework.Assert.assertEquals(Assert.java:71)
	at org.joda.time.format.TestISODateTimeFormatParsing.assertParse(TestISODateTimeFormatParsing.java:841)
	at org.joda.time.format.TestISODateTimeFormatParsing.test_timeNoMillis(TestISODateTimeFormatParsing.java:390)

test_tTime(org.joda.time.format.TestISODateTimeFormatParsing)  Time elapsed: 0 sec  <<< FAILURE!
junit.framework.AssertionFailedError: expected:<1970-01-01T10:20:30.400Z> but was:<1969-12-31T10:20:30.400Z>
	at junit.framework.Assert.fail(Assert.java:47)
	at junit.framework.Assert.failNotEquals(Assert.java:280)
	at junit.framework.Assert.assertEquals(Assert.java:64)
	at junit.framework.Assert.assertEquals(Assert.java:71)
	at org.joda.time.format.TestISODateTimeFormatParsing.assertParse(TestISODateTimeFormatParsing.java:841)
	at org.joda.time.format.TestISODateTimeFormatParsing.test_tTime(TestISODateTimeFormatParsing.java:402)

test_tTimeNoMillis(org.joda.time.format.TestISODateTimeFormatParsing)  Time elapsed: 0 sec  <<< FAILURE!
junit.framework.AssertionFailedError: expected:<1970-01-01T10:20:30.000Z> but was:<1969-12-31T10:20:30.000Z>
	at junit.framework.Assert.fail(Assert.java:47)
	at junit.framework.Assert.failNotEquals(Assert.java:280)
	at junit.framework.Assert.assertEquals(Assert.java:64)
	at junit.framework.Assert.assertEquals(Assert.java:71)
	at org.joda.time.format.TestISODateTimeFormatParsing.assertParse(TestISODateTimeFormatParsing.java:841)
	at org.joda.time.format.TestISODateTimeFormatParsing.test_tTimeNoMillis(TestISODateTimeFormatParsing.java:417)

testSerialization(org.joda.time.tz.TestBuilder)  Time elapsed: 0.008 sec  <<< FAILURE!
junit.framework.AssertionFailedError: expected:<-1633183200000> but was:<-1601820000000>
	at junit.framework.Assert.fail(Assert.java:47)
	at junit.framework.Assert.failNotEquals(Assert.java:280)
	at junit.framework.Assert.assertEquals(Assert.java:64)
	at junit.framework.Assert.assertEquals(Assert.java:133)
	at junit.framework.Assert.assertEquals(Assert.java:139)
	at org.joda.time.tz.TestBuilder.testForwardTransitions(TestBuilder.java:234)
	at org.joda.time.tz.TestBuilder.testSerialization(TestBuilder.java:282)

testForwardTransitions(org.joda.time.tz.TestBuilder)  Time elapsed: 0.004 sec  <<< FAILURE!
junit.framework.AssertionFailedError: expected:<-1633183200000> but was:<-1601820000000>
	at junit.framework.Assert.fail(Assert.java:47)
	at junit.framework.Assert.failNotEquals(Assert.java:280)
	at junit.framework.Assert.assertEquals(Assert.java:64)
	at junit.framework.Assert.assertEquals(Assert.java:133)
	at junit.framework.Assert.assertEquals(Assert.java:139)
	at org.joda.time.tz.TestBuilder.testForwardTransitions(TestBuilder.java:234)
	at org.joda.time.tz.TestBuilder.testForwardTransitions(TestBuilder.java:217)

testReverseTransitions(org.joda.time.tz.TestBuilder)  Time elapsed: 0.006 sec  <<< FAILURE!
junit.framework.AssertionFailedError: expected:<941446799999> but was:<941360399999>
	at junit.framework.Assert.fail(Assert.java:47)
	at junit.framework.Assert.failNotEquals(Assert.java:280)
	at junit.framework.Assert.assertEquals(Assert.java:64)
	at junit.framework.Assert.assertEquals(Assert.java:133)
	at junit.framework.Assert.assertEquals(Assert.java:139)
	at org.joda.time.tz.TestBuilder.testReverseTransitions(TestBuilder.java:270)
	at org.joda.time.tz.TestBuilder.testReverseTransitions(TestBuilder.java:255)

testCompile(org.joda.time.tz.TestCompiler)  Time elapsed: 0.021 sec  <<< FAILURE!
junit.framework.AssertionFailedError: expected:<-1633183200000> but was:<-1601820000000>
	at junit.framework.Assert.fail(Assert.java:47)
	at junit.framework.Assert.failNotEquals(Assert.java:280)
	at junit.framework.Assert.assertEquals(Assert.java:64)
	at junit.framework.Assert.assertEquals(Assert.java:133)
	at junit.framework.Assert.assertEquals(Assert.java:139)
	at org.joda.time.tz.TestBuilder.testForwardTransitions(TestBuilder.java:234)
	at org.joda.time.tz.TestCompiler.testCompile(TestCompiler.java:117)

test_Amman_2004(org.joda.time.tz.TestCompiler)  Time elapsed: 0.001 sec  <<< FAILURE!
junit.framework.AssertionFailedError: expected:<1161900000000> but was:<1080252000000>
	at junit.framework.Assert.fail(Assert.java:47)
	at junit.framework.Assert.failNotEquals(Assert.java:280)
	at junit.framework.Assert.assertEquals(Assert.java:64)
	at junit.framework.Assert.assertEquals(Assert.java:133)
	at junit.framework.Assert.assertEquals(Assert.java:139)
	at org.joda.time.tz.TestCompiler.test_Amman_2004(TestCompiler.java:217)

test_Amman_2005(org.joda.time.tz.TestCompiler)  Time elapsed: 0 sec  <<< FAILURE!
junit.framework.AssertionFailedError: expected:<1161900000000> but was:<1112306400000>
	at junit.framework.Assert.fail(Assert.java:47)
	at junit.framework.Assert.failNotEquals(Assert.java:280)
	at junit.framework.Assert.assertEquals(Assert.java:64)
	at junit.framework.Assert.assertEquals(Assert.java:133)
	at junit.framework.Assert.assertEquals(Assert.java:139)
	at org.joda.time.tz.TestCompiler.test_Amman_2005(TestCompiler.java:224)

test_Amman_2006(org.joda.time.tz.TestCompiler)  Time elapsed: 0.002 sec  <<< FAILURE!
junit.framework.AssertionFailedError: expected:<1161900000000> but was:<1143756000000>
	at junit.framework.Assert.fail(Assert.java:47)
	at junit.framework.Assert.failNotEquals(Assert.java:280)
	at junit.framework.Assert.assertEquals(Assert.java:64)
	at junit.framework.Assert.assertEquals(Assert.java:133)
	at junit.framework.Assert.assertEquals(Assert.java:139)
	at org.joda.time.tz.TestCompiler.test_Amman_2006(TestCompiler.java:231)


Results :

Failed tests: 
  org.joda.time.TestDateMidnight_Basics#testWithers AssertionFailedError expecte...
  org.joda.time.TestDateTimeUtils#test_julianDay AssertionFailedError expected:<...
  org.joda.time.TestDateTimeZone#testIsLocalDateTimeGap_NewYork AssertionFailedError
  org.joda.time.TestDateTimeZone#testPatchedNameKeysGazaHistoric AssertionFailedError
  org.joda.time.TestDateTimeZone#testPatchedNameKeysSydney AssertionFailedError ...
  org.joda.time.TestDateTimeZone#testPatchedNameKeysSydneyHistoric AssertionFailedError
  org.joda.time.TestDateTimeZoneCutover#testBug2182444_ausNSW AssertionFailedError
  org.joda.time.TestDateTimeZoneCutover#testBug3476684_adjustOffset AssertionFailedError
  org.joda.time.TestDateTimeZoneCutover#testWithMillisOfSecondInDstChange_NewYork_summer ComparisonFailure
  org.joda.time.TestDateTimeZoneCutover#test_DateTime_constructor_NewYork_Autumn ComparisonFailure
  org.joda.time.TestDateTimeZoneCutover#test_DateTime_minusHour_Guatemata_Autumn ComparisonFailure
  org.joda.time.TestDateTimeZoneCutover#test_DateTime_minusHour_NewYork_Autumn ComparisonFailure
  org.joda.time.TestDateTimeZoneCutover#test_DateTime_plusHour_Guatemata_Autumn ComparisonFailure
  org.joda.time.TestDateTimeZoneCutover#test_DateTime_plusHour_NewYork_Autumn ComparisonFailure
  org.joda.time.TestDateTimeZoneCutover#test_DateTime_roundCeiling_day_NewYork_Autumn_postCutover ComparisonFailure
  org.joda.time.TestDateTimeZoneCutover#test_DateTime_roundCeiling_day_NewYork_Autumn_preCutover ComparisonFailure
  org.joda.time.TestDateTimeZoneCutover#test_DateTime_roundCeiling_day_NewYork_Spring_postCutover ComparisonFailure
  org.joda.time.TestDateTimeZoneCutover#test_DateTime_roundCeiling_day_NewYork_Spring_preCutover ComparisonFailure
  org.joda.time.TestDateTimeZoneCutover#test_DateTime_roundCeiling_hourOfDay_NewYork_Autumn_postCutover ComparisonFailure
  org.joda.time.TestDateTimeZoneCutover#test_DateTime_roundCeiling_hourOfDay_NewYork_Autumn_preCutover ComparisonFailure
  org.joda.time.TestDateTimeZoneCutover#test_DateTime_roundCeiling_hour_NewYork_Spring_postCutover ComparisonFailure
  org.joda.time.TestDateTimeZoneCutover#test_DateTime_roundCeiling_hour_NewYork_Spring_preCutover ComparisonFailure
  org.joda.time.TestDateTimeZoneCutover#test_DateTime_roundCeiling_minuteOfHour_NewYork_Autumn_postCutover ComparisonFailure
  org.joda.time.TestDateTimeZoneCutover#test_DateTime_roundCeiling_minuteOfHour_NewYork_Autumn_preCutover ComparisonFailure
  org.joda.time.TestDateTimeZoneCutover#test_DateTime_roundCeiling_minute_NewYork_Spring_postCutover ComparisonFailure
  org.joda.time.TestDateTimeZoneCutover#test_DateTime_roundCeiling_secondOfMinute_NewYork_Autumn_postCutover ComparisonFailure
  org.joda.time.TestDateTimeZoneCutover#test_DateTime_roundCeiling_secondOfMinute_NewYork_Autumn_preCutover ComparisonFailure
  org.joda.time.TestDateTimeZoneCutover#test_DateTime_roundFloor_day_NewYork_Autumn_postCutover ComparisonFailure
  org.joda.time.TestDateTimeZoneCutover#test_DateTime_roundFloor_day_NewYork_Autumn_preCutover ComparisonFailure
  org.joda.time.TestDateTimeZoneCutover#test_DateTime_roundFloor_day_NewYork_Spring_postCutover ComparisonFailure
  org.joda.time.TestDateTimeZoneCutover#test_DateTime_roundFloor_hourOfDay_NewYork_Autumn_postCutover ComparisonFailure
  org.joda.time.TestDateTimeZoneCutover#test_DateTime_roundFloor_hourOfDay_NewYork_Autumn_preCutover ComparisonFailure
  org.joda.time.TestDateTimeZoneCutover#test_DateTime_roundFloor_hour_NewYork_Spring_postCutover ComparisonFailure
  org.joda.time.TestDateTimeZoneCutover#test_DateTime_roundFloor_minuteOfHour_NewYork_Autumn_postCutover ComparisonFailure
  org.joda.time.TestDateTimeZoneCutover#test_DateTime_roundFloor_minuteOfHour_NewYork_Autumn_preCutover ComparisonFailure
  org.joda.time.TestDateTimeZoneCutover#test_DateTime_roundFloor_minute_NewYork_Spring_postCutover ComparisonFailure
  org.joda.time.TestDateTimeZoneCutover#test_DateTime_roundFloor_secondOfMinute_NewYork_Autumn_postCutover ComparisonFailure
  org.joda.time.TestDateTimeZoneCutover#test_DateTime_roundFloor_secondOfMinute_NewYork_Autumn_preCutover ComparisonFailure
  org.joda.time.TestDateTimeZoneCutover#test_DateTime_setHourAcross_NewYork_Spring ComparisonFailure
  org.joda.time.TestDateTimeZoneCutover#test_DateTime_setHourBack_NewYork_Spring ComparisonFailure
  org.joda.time.TestDateTimeZoneCutover#test_DateTime_setHourForward_NewYork_Spring AssertionFailedError
  org.joda.time.TestDateTimeZoneCutover#test_GuatemataIsCorrect_Autumn ComparisonFailure
  org.joda.time.TestDateTimeZoneCutover#test_NewYorkIsCorrect_Autumn ComparisonFailure
  org.joda.time.TestDateTimeZoneCutover#test_NewYorkIsCorrect_Spring ComparisonFailure
  org.joda.time.TestDateTimeZoneCutover#test_getOffsetFromLocal_Guatemata_Autumn AssertionFailedError
  org.joda.time.TestDateTimeZoneCutover#test_getOffsetFromLocal_NewYork_Autumn AssertionFailedError
  org.joda.time.TestDateTimeZoneCutover#test_getOffsetFromLocal_NewYork_Spring ComparisonFailure
  org.joda.time.TestDateTime_Basics#testWithers AssertionFailedError expected:<1...
  org.joda.time.TestDateTime_Constructors#testConstructor_ObjectString5 AssertionFailedError
  org.joda.time.TestDateTime_Constructors#testConstructor_ObjectString6 AssertionFailedError
  org.joda.time.TestDateTime_Properties#testPropertySetTextYear ComparisonFailure
  org.joda.time.TestDateTime_Properties#testPropertySetYear ComparisonFailure ex...
  org.joda.time.TestDateTime_Properties#testPropertyWithMaximumValueMillisOfDayDSTGap ComparisonFailure
  org.joda.time.TestIllegalFieldValueException#testGJCutover AssertionFailedError
  org.joda.time.TestLocalDateTime_Basics#testGetValue_int AssertionFailedError e...
  org.joda.time.TestLocalDateTime_Basics#testGetValues AssertionFailedError expe...
  org.joda.time.TestLocalDateTime_Basics#testGet_DateTimeFieldType AssertionFailedError
  org.joda.time.TestLocalDateTime_Basics#testGetters AssertionFailedError expect...
  org.joda.time.TestLocalDateTime_Basics#testToString_String_Locale ComparisonFailure
  org.joda.time.TestLocalDateTime_Basics#testWithers AssertionFailedError expect...
  org.joda.time.TestLocalDateTime_Constructors#testConstructor AssertionFailedError
  org.joda.time.TestLocalDateTime_Constructors#testConstructor_Chronology AssertionFailedError
  org.joda.time.TestLocalDateTime_Constructors#testConstructor_Object1 AssertionFailedError
  org.joda.time.TestLocalDateTime_Constructors#testConstructor_Object_Chronology AssertionFailedError
  org.joda.time.TestLocalDateTime_Constructors#testConstructor_Object_DateTimeZone AssertionFailedError
  org.joda.time.TestLocalDateTime_Constructors#testConstructor_Object_nullChronology AssertionFailedError
  org.joda.time.TestLocalDateTime_Constructors#testConstructor_Object_nullDateTimeZone AssertionFailedError
  org.joda.time.TestLocalDateTime_Constructors#testConstructor_long1 AssertionFailedError
  org.joda.time.TestLocalDateTime_Constructors#testConstructor_long1_Chronology AssertionFailedError
  org.joda.time.TestLocalDateTime_Constructors#testConstructor_long1_DateTimeZone AssertionFailedError
  org.joda.time.TestLocalDateTime_Constructors#testConstructor_long2 AssertionFailedError
  org.joda.time.TestLocalDateTime_Constructors#testConstructor_long2_Chronology AssertionFailedError
  org.joda.time.TestLocalDateTime_Constructors#testConstructor_long2_DateTimeZone AssertionFailedError
  org.joda.time.TestLocalDateTime_Constructors#testConstructor_long_nullChronology AssertionFailedError
  org.joda.time.TestLocalDateTime_Constructors#testConstructor_long_nullDateTimeZone AssertionFailedError
  org.joda.time.TestLocalDateTime_Constructors#testConstructor_nullChronology AssertionFailedError
  org.joda.time.TestLocalDateTime_Constructors#testConstructor_nullDateTimeZone AssertionFailedError
  org.joda.time.TestLocalDateTime_Constructors#testConstructor_nullObject AssertionFailedError
  org.joda.time.TestLocalDateTime_Constructors#testConstructor_nullObject_Chronology AssertionFailedError
  org.joda.time.TestLocalDateTime_Constructors#testConstructor_nullObject_DateTimeZone AssertionFailedError
  org.joda.time.TestLocalDateTime_Constructors#testConstructor_nullObject_nullChronology AssertionFailedError
  org.joda.time.TestLocalDateTime_Constructors#testConstructor_nullObject_nullDateTimeZone AssertionFailedError
  org.joda.time.TestLocalDate_Basics#testGetValue_int AssertionFailedError expec...
  org.joda.time.TestLocalDate_Basics#testGetValues AssertionFailedError expected...
  org.joda.time.TestLocalDate_Basics#testGet_DateTimeFieldType AssertionFailedError
  org.joda.time.TestLocalDate_Basics#testGetters AssertionFailedError expected:<...
  org.joda.time.TestLocalDate_Basics#testToInterval_Zone_noMidnight AssertionFailedError
  org.joda.time.TestLocalDate_Basics#testToString_String_Locale ComparisonFailure
  org.joda.time.TestLocalDate_Basics#testWithers AssertionFailedError expected:<...
  org.joda.time.TestLocalDate_Constructors#testConstructor AssertionFailedError ...
  org.joda.time.TestLocalDate_Constructors#testConstructor_Chronology AssertionFailedError
  org.joda.time.TestLocalDate_Constructors#testConstructor_Object1 AssertionFailedError
  org.joda.time.TestLocalDate_Constructors#testConstructor_Object_Chronology AssertionFailedError
  org.joda.time.TestLocalDate_Constructors#testConstructor_Object_DateTimeZone AssertionFailedError
  org.joda.time.TestLocalDate_Constructors#testConstructor_Object_nullChronology AssertionFailedError
  org.joda.time.TestLocalDate_Constructors#testConstructor_Object_nullDateTimeZone AssertionFailedError
  org.joda.time.TestLocalDate_Constructors#testConstructor_long1 AssertionFailedError
  org.joda.time.TestLocalDate_Constructors#testConstructor_long1_Chronology AssertionFailedError
  org.joda.time.TestLocalDate_Constructors#testConstructor_long1_DateTimeZone AssertionFailedError
  org.joda.time.TestLocalDate_Constructors#testConstructor_long2 AssertionFailedError
  org.joda.time.TestLocalDate_Constructors#testConstructor_long2_Chronology AssertionFailedError
  org.joda.time.TestLocalDate_Constructors#testConstructor_long2_DateTimeZone AssertionFailedError
  org.joda.time.TestLocalDate_Constructors#testConstructor_long_nullChronology AssertionFailedError
  org.joda.time.TestLocalDate_Constructors#testConstructor_long_nullDateTimeZone AssertionFailedError
  org.joda.time.TestLocalDate_Constructors#testConstructor_nullChronology AssertionFailedError
  org.joda.time.TestLocalDate_Constructors#testConstructor_nullObject AssertionFailedError
  org.joda.time.TestLocalDate_Constructors#testConstructor_nullObject_Chronology AssertionFailedError
  org.joda.time.TestLocalDate_Constructors#testConstructor_nullObject_DateTimeZone AssertionFailedError
  org.joda.time.TestLocalDate_Constructors#testConstructor_nullObject_nullChronology AssertionFailedError
  org.joda.time.TestLocalDate_Constructors#testConstructor_nullObject_nullDateTimeZone AssertionFailedError
  org.joda.time.TestLocalTime_Basics#testToDateTime_RI ComparisonFailure expecte...
  org.joda.time.TestLocalTime_Basics#testToDateTime_nullRI ComparisonFailure exp...
  org.joda.time.TestLocalTime_Constructors#testConstructor_long_DateTimeZone_2 AssertionFailedError
  org.joda.time.TestMonthDay_Basics#testGet AssertionFailedError expected:<9> bu...
  org.joda.time.TestMonthDay_Basics#testGetValue AssertionFailedError expected:<...
  org.joda.time.TestMonthDay_Basics#testGetValues AssertionFailedError expected:...
  org.joda.time.TestMonthDay_Constructors#testConstructor AssertionFailedError e...
  org.joda.time.TestMonthDay_Constructors#testConstructor_Chronology AssertionFailedError
  org.joda.time.TestMonthDay_Constructors#testConstructor_Object AssertionFailedError
  org.joda.time.TestMonthDay_Constructors#testConstructor_Object_Chronology AssertionFailedError
  org.joda.time.TestMonthDay_Constructors#testConstructor_Object_nullChronology AssertionFailedError
  org.joda.time.TestMonthDay_Constructors#testConstructor_long1 AssertionFailedError
  org.joda.time.TestMonthDay_Constructors#testConstructor_long1_Chronology AssertionFailedError
  org.joda.time.TestMonthDay_Constructors#testConstructor_long2 AssertionFailedError
  org.joda.time.TestMonthDay_Constructors#testConstructor_long2_Chronology AssertionFailedError
  org.joda.time.TestMonthDay_Constructors#testConstructor_long_nullChronology AssertionFailedError
  org.joda.time.TestMonthDay_Constructors#testConstructor_nullChronology AssertionFailedError
  org.joda.time.TestMonthDay_Constructors#testConstructor_nullObject AssertionFailedError
  org.joda.time.TestMonthDay_Constructors#testConstructor_nullObject_Chronology AssertionFailedError
  org.joda.time.TestMonthDay_Constructors#testConstructor_nullObject_nullChronology AssertionFailedError
  org.joda.time.TestMutableDateTime_Properties#testPropertySetTextYear ComparisonFailure
  org.joda.time.TestMutableDateTime_Properties#testPropertySetYear ComparisonFailure
  org.joda.time.TestPartial_Basics#testToDateTime_RI ComparisonFailure expected:...
  org.joda.time.TestPartial_Basics#testToDateTime_nullRI ComparisonFailure expec...
  org.joda.time.TestTimeOfDay_Basics#testToDateTime_RI ComparisonFailure expecte...
  org.joda.time.TestTimeOfDay_Basics#testToDateTime_nullRI ComparisonFailure exp...
  org.joda.time.TestYearMonthDay_Basics#testGet AssertionFailedError expected:<9...
  org.joda.time.TestYearMonthDay_Basics#testGetValue AssertionFailedError expect...
  org.joda.time.TestYearMonthDay_Basics#testGetValues AssertionFailedError expec...
  org.joda.time.TestYearMonthDay_Constructors#testConstructor AssertionFailedError
  org.joda.time.TestYearMonthDay_Constructors#testConstructor_Chronology AssertionFailedError
  org.joda.time.TestYearMonthDay_Constructors#testConstructor_Object AssertionFailedError
  org.joda.time.TestYearMonthDay_Constructors#testConstructor_Object_Chronology AssertionFailedError
  org.joda.time.TestYearMonthDay_Constructors#testConstructor_Object_nullChronology AssertionFailedError
  org.joda.time.TestYearMonthDay_Constructors#testConstructor_long1 AssertionFailedError
  org.joda.time.TestYearMonthDay_Constructors#testConstructor_long1_Chronology AssertionFailedError
  org.joda.time.TestYearMonthDay_Constructors#testConstructor_long2 AssertionFailedError
  org.joda.time.TestYearMonthDay_Constructors#testConstructor_long2_Chronology AssertionFailedError
  org.joda.time.TestYearMonthDay_Constructors#testConstructor_long_nullChronology AssertionFailedError
  org.joda.time.TestYearMonthDay_Constructors#testConstructor_nullChronology AssertionFailedError
  org.joda.time.TestYearMonthDay_Constructors#testConstructor_nullObject AssertionFailedError
  org.joda.time.TestYearMonthDay_Constructors#testConstructor_nullObject_Chronology AssertionFailedError
  org.joda.time.TestYearMonthDay_Constructors#testConstructor_nullObject_nullChronology AssertionFailedError
  org.joda.time.chrono.TestGJChronology#testCutoverAddDays AssertionFailedError ...
  org.joda.time.chrono.TestGJChronology#testCutoverAddWeeks AssertionFailedError
  org.joda.time.chrono.TestGJChronology#testFactory_Zone_RI AssertionFailedError
  org.joda.time.chrono.TestGJChronology#testFactory_Zone_RI_int AssertionFailedError
  org.joda.time.chrono.TestGJChronology#testIllegalDates AssertionFailedError Co...
  org.joda.time.chrono.TestGJChronology#testToString ComparisonFailure expected:...
  org.joda.time.chrono.TestIslamicChronology#testFieldConstructor AssertionFailedError
  org.joda.time.chrono.TestIslamicChronology#testSampleDate1 AssertionFailedError
  org.joda.time.chrono.TestLenientChronology#test_isoChrononolgy_Chicago AssertionFailedError
  org.joda.time.chrono.TestLenientChronology#test_lenientChrononolgy_Chicago ComparisonFailure
  org.joda.time.chrono.TestLenientChronology#test_strictChrononolgy_Chicago AssertionFailedError
org.joda.time.chrono.gj.MainTest.testChronology(org.joda.time.chrono.gj.MainTest)
  Run 1: org.joda.time.chrono.gj.MainTest#testChronology AssertionFailedError
  Run 2: PASS

  org.joda.time.format.TestDateTimeFormat#testFormat_weekyearOfEra_twoDigit AssertionFailedError
  org.joda.time.format.TestISODateTimeFormatParsing#test_basicTTime AssertionFailedError
  org.joda.time.format.TestISODateTimeFormatParsing#test_basicTTimeNoMillis AssertionFailedError
  org.joda.time.format.TestISODateTimeFormatParsing#test_basicTime AssertionFailedError
  org.joda.time.format.TestISODateTimeFormatParsing#test_basicTimeNoMillis AssertionFailedError
  org.joda.time.format.TestISODateTimeFormatParsing#test_hourMinute AssertionFailedError
  org.joda.time.format.TestISODateTimeFormatParsing#test_hourMinuteSecond AssertionFailedError
  org.joda.time.format.TestISODateTimeFormatParsing#test_hourMinuteSecondFraction AssertionFailedError
  org.joda.time.format.TestISODateTimeFormatParsing#test_hourMinuteSecondMillis AssertionFailedError
  org.joda.time.format.TestISODateTimeFormatParsing#test_tTime AssertionFailedError
  org.joda.time.format.TestISODateTimeFormatParsing#test_tTimeNoMillis AssertionFailedError
  org.joda.time.format.TestISODateTimeFormatParsing#test_time AssertionFailedError
  org.joda.time.format.TestISODateTimeFormatParsing#test_timeNoMillis AssertionFailedError
  org.joda.time.format.TestISODateTimeFormatParsing#test_timeParser AssertionFailedError
  org.joda.time.tz.TestBuilder#testForwardTransitions AssertionFailedError expec...
  org.joda.time.tz.TestBuilder#testReverseTransitions AssertionFailedError expec...
  org.joda.time.tz.TestBuilder#testSerialization AssertionFailedError expected:<...
  org.joda.time.tz.TestCompiler#testCompile AssertionFailedError expected:<-1633...
  org.joda.time.tz.TestCompiler#test_Amman_2004 AssertionFailedError expected:<1...
  org.joda.time.tz.TestCompiler#test_Amman_2005 AssertionFailedError expected:<1...
  org.joda.time.tz.TestCompiler#test_Amman_2006 AssertionFailedError expected:<1...
Tests in error: 
  org.joda.time.TestDays#testFactory_daysBetween_RPartial_MonthDay IllegalFieldValueException
  org.joda.time.TestMonthDay_Constructors#testParse_noFormatter IllegalFieldValueException
  org.joda.time.TestMonths#testFactory_monthsBetween_RPartial_MonthDay IllegalFieldValueException
  org.joda.time.TestStringConvert#testMonthDay_leapDay IllegalFieldValueException
  org.joda.time.chrono.TestGJChronology#testCutoverAddWeekyears IllegalFieldValueException
  org.joda.time.format.TestDateTimeFormatter#testParseLocalDateTime_monthDay_feb29 IllegalFieldValueException
  org.joda.time.format.TestDateTimeFormatter#testParseLocalDate_monthDay_feb29 IllegalFieldValueException

Tests run: 4156, Failures: 186, Errors: 7, Skipped: 0

[INFO] ------------------------------------------------------------------------
[INFO] BUILD FAILURE
[INFO] ------------------------------------------------------------------------
[INFO] Total time: 14.995s
[INFO] Finished at: Thu Aug 06 01:12:37 BST 2015
[INFO] Final Memory: 9M/213M
[INFO] ------------------------------------------------------------------------
[ERROR] Failed to execute goal org.apache.maven.plugins:maven-surefire-plugin:2.18.1:test (default-test) on project joda-time: There are test failures.
[ERROR] 
[ERROR] Please refer to /home/perham/Study/LittleDarwin/Cases/joda-time-2.8.1/target/surefire-reports for the individual test results.
[ERROR] -> [Help 1]
[ERROR] 
[ERROR] To see the full stack trace of the errors, re-run Maven with the -e switch.
[ERROR] Re-run Maven using the -X switch to enable full debug logging.
[ERROR] 
[ERROR] For more information about the errors and possible solutions, please read the following articles:
[ERROR] [Help 1] http://cwiki.apache.org/confluence/display/MAVEN/MojoFailureException
