[INFO] Scanning for projects...
[INFO]                                                                         
[INFO] ------------------------------------------------------------------------
[INFO] Building Joda-Time 2.8.1
[INFO] ------------------------------------------------------------------------
[INFO] 
[INFO] --- maven-resources-plugin:2.7:resources (default-resources) @ joda-time ---
[INFO] Using 'UTF-8' encoding to copy filtered resources.
[INFO] Copying 2 resources to META-INF
[INFO] Copying 10 resources
[INFO] 
[INFO] --- maven-compiler-plugin:3.3:compile (default-compile) @ joda-time ---
[INFO] Changes detected - recompiling the module!
[INFO] Compiling 166 source files to /home/perham/Study/LittleDarwin/Cases/joda-time-2.8.1/target/classes
[INFO] 
[INFO] --- exec-maven-plugin:1.4.0:java (compile-tzdb) @ joda-time ---
Writing zoneinfo files
Writing ZoneInfoMap
[INFO] 
[INFO] --- maven-resources-plugin:2.7:testResources (default-testResources) @ joda-time ---
[INFO] Using 'UTF-8' encoding to copy filtered resources.
[INFO] Copying 34 resources
[INFO] 
[INFO] --- maven-compiler-plugin:3.3:testCompile (default-testCompile) @ joda-time ---
[INFO] Nothing to compile - all classes are up to date
[INFO] 
[INFO] --- maven-surefire-plugin:2.18.1:test (default-test) @ joda-time ---
[INFO] Surefire report directory: /home/perham/Study/LittleDarwin/Cases/joda-time-2.8.1/target/surefire-reports

-------------------------------------------------------
 T E S T S
-------------------------------------------------------
Running org.joda.time.TestAllPackages

TestBuddhistChronology.testCalendar

TestCopticChronology.testCalendar

TestEthiopicChronology.testCalendar

TestIslamicChronology.testCalendar

Testing Gregorian chronology over 1000 iterations
100% complete (i=1000)

Testing Julian chronology over 1000 iterations
100% complete (i=1000)
Writing zoneinfo files
Writing ZoneInfoMap
Tests run: 4157, Failures: 118, Errors: 23, Skipped: 0, Time elapsed: 5.309 sec <<< FAILURE! - in org.joda.time.TestAllPackages
testParse_noFormatter(org.joda.time.TestInstant_Constructors)  Time elapsed: 0.007 sec  <<< FAILURE!
junit.framework.AssertionFailedError: expected:<2010-06-29T23:20:00.000Z> but was:<2010-06-29T22:00:00.000Z>
	at junit.framework.Assert.fail(Assert.java:47)
	at junit.framework.Assert.failNotEquals(Assert.java:280)
	at junit.framework.Assert.assertEquals(Assert.java:64)
	at junit.framework.Assert.assertEquals(Assert.java:71)
	at org.joda.time.TestInstant_Constructors.testParse_noFormatter(TestInstant_Constructors.java:100)

testParse_formatter(org.joda.time.TestInstant_Constructors)  Time elapsed: 0.003 sec  <<< FAILURE!
junit.framework.AssertionFailedError: expected:<2010-06-30T11:00:00.000Z> but was:<2010-06-29T22:00:00.000Z>
	at junit.framework.Assert.fail(Assert.java:47)
	at junit.framework.Assert.failNotEquals(Assert.java:280)
	at junit.framework.Assert.assertEquals(Assert.java:64)
	at junit.framework.Assert.assertEquals(Assert.java:71)
	at org.joda.time.TestInstant_Constructors.testParse_formatter(TestInstant_Constructors.java:106)

testParse_noFormatter(org.joda.time.TestDateTime_Constructors)  Time elapsed: 0.002 sec  <<< FAILURE!
junit.framework.AssertionFailedError: expected:<2010-06-30T01:20:00.000+02:00> but was:<2010-06-30T00:00:00.000+02:00>
	at junit.framework.Assert.fail(Assert.java:47)
	at junit.framework.Assert.failNotEquals(Assert.java:280)
	at junit.framework.Assert.assertEquals(Assert.java:64)
	at junit.framework.Assert.assertEquals(Assert.java:71)
	at org.joda.time.TestDateTime_Constructors.testParse_noFormatter(TestDateTime_Constructors.java:157)

testParse_formatter(org.joda.time.TestDateTime_Constructors)  Time elapsed: 0.001 sec  <<< FAILURE!
junit.framework.AssertionFailedError: expected:<2010-06-30T13:00:00.000+02:00> but was:<2010-06-30T00:00:00.000+02:00>
	at junit.framework.Assert.fail(Assert.java:47)
	at junit.framework.Assert.failNotEquals(Assert.java:280)
	at junit.framework.Assert.assertEquals(Assert.java:64)
	at junit.framework.Assert.assertEquals(Assert.java:71)
	at org.joda.time.TestDateTime_Constructors.testParse_formatter(TestDateTime_Constructors.java:178)

testConstructor_ObjectString3(org.joda.time.TestDateTime_Constructors)  Time elapsed: 0.001 sec  <<< FAILURE!
junit.framework.AssertionFailedError: expected:<10> but was:<0>
	at junit.framework.Assert.fail(Assert.java:47)
	at junit.framework.Assert.failNotEquals(Assert.java:280)
	at junit.framework.Assert.assertEquals(Assert.java:64)
	at junit.framework.Assert.assertEquals(Assert.java:198)
	at junit.framework.Assert.assertEquals(Assert.java:204)
	at org.joda.time.TestDateTime_Constructors.testConstructor_ObjectString3(TestDateTime_Constructors.java:404)

testConstructor_ObjectString4(org.joda.time.TestDateTime_Constructors)  Time elapsed: 0.001 sec  <<< FAILURE!
junit.framework.AssertionFailedError: expected:<21> but was:<11>
	at junit.framework.Assert.fail(Assert.java:47)
	at junit.framework.Assert.failNotEquals(Assert.java:280)
	at junit.framework.Assert.assertEquals(Assert.java:64)
	at junit.framework.Assert.assertEquals(Assert.java:198)
	at junit.framework.Assert.assertEquals(Assert.java:204)
	at org.joda.time.TestDateTime_Constructors.testConstructor_ObjectString4(TestDateTime_Constructors.java:416)

testPropertyAddWrapFieldMonthOfYear(org.joda.time.TestDateTime_Properties)  Time elapsed: 0.001 sec  <<< FAILURE!
junit.framework.ComparisonFailure: expected:<2004-02-0[9T00]:00:00.000Z> but was:<2004-02-0[8T23]:00:00.000Z>
	at junit.framework.Assert.assertEquals(Assert.java:81)
	at junit.framework.Assert.assertEquals(Assert.java:87)
	at org.joda.time.TestDateTime_Properties.testPropertyAddWrapFieldMonthOfYear(TestDateTime_Properties.java:435)

testPropertyAddMonthOfYear(org.joda.time.TestDateTime_Properties)  Time elapsed: 0.001 sec  <<< FAILURE!
junit.framework.ComparisonFailure: expected:<2004-12-0[9T00]:00:00.000Z> but was:<2004-12-0[8T23]:00:00.000Z>
	at junit.framework.Assert.assertEquals(Assert.java:81)
	at junit.framework.Assert.assertEquals(Assert.java:87)
	at org.joda.time.TestDateTime_Properties.testPropertyAddMonthOfYear(TestDateTime_Properties.java:401)

testParse_noFormatter(org.joda.time.TestMutableDateTime_Constructors)  Time elapsed: 0.001 sec  <<< FAILURE!
junit.framework.AssertionFailedError: expected:<2010-06-30T01:20:00.000+02:00> but was:<2010-06-30T00:00:00.000+02:00>
	at junit.framework.Assert.fail(Assert.java:47)
	at junit.framework.Assert.failNotEquals(Assert.java:280)
	at junit.framework.Assert.assertEquals(Assert.java:64)
	at junit.framework.Assert.assertEquals(Assert.java:71)
	at org.joda.time.TestMutableDateTime_Constructors.testParse_noFormatter(TestMutableDateTime_Constructors.java:157)

testParse_formatter(org.joda.time.TestMutableDateTime_Constructors)  Time elapsed: 0 sec  <<< FAILURE!
junit.framework.AssertionFailedError: expected:<2010-06-30T13:00:00.000+02:00> but was:<2010-06-30T00:00:00.000+02:00>
	at junit.framework.Assert.fail(Assert.java:47)
	at junit.framework.Assert.failNotEquals(Assert.java:280)
	at junit.framework.Assert.assertEquals(Assert.java:64)
	at junit.framework.Assert.assertEquals(Assert.java:71)
	at org.joda.time.TestMutableDateTime_Constructors.testParse_formatter(TestMutableDateTime_Constructors.java:163)

testAddMonths_int1(org.joda.time.TestMutableDateTime_Adds)  Time elapsed: 0.001 sec  <<< FAILURE!
junit.framework.ComparisonFailure: expected:<2002-12-09T0[5]:06:07.008Z> but was:<2002-12-09T0[4]:06:07.008Z>
	at junit.framework.Assert.assertEquals(Assert.java:81)
	at junit.framework.Assert.assertEquals(Assert.java:87)
	at org.joda.time.TestMutableDateTime_Adds.testAddMonths_int1(TestMutableDateTime_Adds.java:234)

testPropertyAddWrapFieldMonthOfYear(org.joda.time.TestMutableDateTime_Properties)  Time elapsed: 0 sec  <<< FAILURE!
junit.framework.ComparisonFailure: expected:<2004-02-0[9T00]:00:00.000Z> but was:<2004-02-0[8T23]:00:00.000Z>
	at junit.framework.Assert.assertEquals(Assert.java:81)
	at junit.framework.Assert.assertEquals(Assert.java:87)
	at org.joda.time.TestMutableDateTime_Properties.testPropertyAddWrapFieldMonthOfYear(TestMutableDateTime_Properties.java:268)

testPropertyAddMonthOfYear(org.joda.time.TestMutableDateTime_Properties)  Time elapsed: 0 sec  <<< FAILURE!
junit.framework.ComparisonFailure: expected:<2004-12-0[9T00]:00:00.000Z> but was:<2004-12-0[8T23]:00:00.000Z>
	at junit.framework.Assert.assertEquals(Assert.java:81)
	at junit.framework.Assert.assertEquals(Assert.java:87)
	at org.joda.time.TestMutableDateTime_Properties.testPropertyAddMonthOfYear(TestMutableDateTime_Properties.java:262)

testPropertyAddWrapFieldMonthOfYear(org.joda.time.TestDateMidnight_Properties)  Time elapsed: 0 sec  <<< FAILURE!
junit.framework.AssertionFailedError: expected:<9> but was:<8>
	at junit.framework.Assert.fail(Assert.java:47)
	at junit.framework.Assert.failNotEquals(Assert.java:280)
	at junit.framework.Assert.assertEquals(Assert.java:64)
	at junit.framework.Assert.assertEquals(Assert.java:198)
	at junit.framework.Assert.assertEquals(Assert.java:204)
	at org.joda.time.TestDateMidnight_Properties.testPropertyAddWrapFieldMonthOfYear(TestDateMidnight_Properties.java:295)

testPropertyAddLongMonthOfYear(org.joda.time.TestDateMidnight_Properties)  Time elapsed: 0.001 sec  <<< FAILURE!
junit.framework.AssertionFailedError: expected:<9> but was:<8>
	at junit.framework.Assert.fail(Assert.java:47)
	at junit.framework.Assert.failNotEquals(Assert.java:280)
	at junit.framework.Assert.assertEquals(Assert.java:64)
	at junit.framework.Assert.assertEquals(Assert.java:198)
	at junit.framework.Assert.assertEquals(Assert.java:204)
	at org.joda.time.TestDateMidnight_Properties.testPropertyAddLongMonthOfYear(TestDateMidnight_Properties.java:287)

testPropertyAddMonthOfYear(org.joda.time.TestDateMidnight_Properties)  Time elapsed: 0.001 sec  <<< FAILURE!
junit.framework.AssertionFailedError: expected:<9> but was:<8>
	at junit.framework.Assert.fail(Assert.java:47)
	at junit.framework.Assert.failNotEquals(Assert.java:280)
	at junit.framework.Assert.assertEquals(Assert.java:64)
	at junit.framework.Assert.assertEquals(Assert.java:198)
	at junit.framework.Assert.assertEquals(Assert.java:204)
	at org.joda.time.TestDateMidnight_Properties.testPropertyAddMonthOfYear(TestDateMidnight_Properties.java:279)

testParse_noFormatter(org.joda.time.TestInterval_Constructors)  Time elapsed: 0.002 sec  <<< FAILURE!
junit.framework.AssertionFailedError: expected:<2010-06-30T12:30:00.000+02:00/2010-07-01T14:30:00.000+02:00> but was:<2010-06-30T00:00:00.000+02:00/2010-07-01T00:00:00.000+02:00>
	at junit.framework.Assert.fail(Assert.java:47)
	at junit.framework.Assert.failNotEquals(Assert.java:280)
	at junit.framework.Assert.assertEquals(Assert.java:64)
	at junit.framework.Assert.assertEquals(Assert.java:71)
	at org.joda.time.TestInterval_Constructors.testParse_noFormatter(TestInterval_Constructors.java:108)

testConstructor_Object1(org.joda.time.TestInterval_Constructors)  Time elapsed: 0.001 sec  <<< FAILURE!
junit.framework.AssertionFailedError: expected:<1120950061001> but was:<1120946400000>
	at junit.framework.Assert.fail(Assert.java:47)
	at junit.framework.Assert.failNotEquals(Assert.java:280)
	at junit.framework.Assert.assertEquals(Assert.java:64)
	at junit.framework.Assert.assertEquals(Assert.java:133)
	at junit.framework.Assert.assertEquals(Assert.java:139)
	at org.joda.time.TestInterval_Constructors.testConstructor_Object1(TestInterval_Constructors.java:537)

testToString_reparse(org.joda.time.TestInterval_Basics)  Time elapsed: 0.001 sec  <<< FAILURE!
junit.framework.AssertionFailedError: expected:<2004-06-09T07:08:09.010+02:00/2005-08-13T12:14:16.018+02:00> but was:<2004-06-09T00:00:00.000+02:00/2005-08-13T00:00:00.000+02:00>
	at junit.framework.Assert.fail(Assert.java:47)
	at junit.framework.Assert.failNotEquals(Assert.java:280)
	at junit.framework.Assert.assertEquals(Assert.java:64)
	at junit.framework.Assert.assertEquals(Assert.java:71)
	at org.joda.time.TestInterval_Basics.testToString_reparse(TestInterval_Basics.java:1053)

testParse_noFormatter(org.joda.time.TestLocalDateTime_Constructors)  Time elapsed: 0.002 sec  <<< FAILURE!
junit.framework.AssertionFailedError: expected:<2010-06-30T01:20:00.000> but was:<2010-06-30T00:00:00.000>
	at junit.framework.Assert.fail(Assert.java:47)
	at junit.framework.Assert.failNotEquals(Assert.java:280)
	at junit.framework.Assert.assertEquals(Assert.java:64)
	at junit.framework.Assert.assertEquals(Assert.java:71)
	at org.joda.time.TestLocalDateTime_Constructors.testParse_noFormatter(TestLocalDateTime_Constructors.java:95)

testParse_formatter(org.joda.time.TestLocalDateTime_Constructors)  Time elapsed: 0 sec  <<< FAILURE!
junit.framework.AssertionFailedError: expected:<2010-06-30T13:00:00.000> but was:<2010-06-30T00:00:00.000>
	at junit.framework.Assert.fail(Assert.java:47)
	at junit.framework.Assert.failNotEquals(Assert.java:280)
	at junit.framework.Assert.assertEquals(Assert.java:64)
	at junit.framework.Assert.assertEquals(Assert.java:71)
	at org.joda.time.TestLocalDateTime_Constructors.testParse_formatter(TestLocalDateTime_Constructors.java:101)

testConstructor_ObjectString3(org.joda.time.TestLocalDateTime_Constructors)  Time elapsed: 0.001 sec  <<< FAILURE!
junit.framework.AssertionFailedError: expected:<10> but was:<0>
	at junit.framework.Assert.fail(Assert.java:47)
	at junit.framework.Assert.failNotEquals(Assert.java:280)
	at junit.framework.Assert.assertEquals(Assert.java:64)
	at junit.framework.Assert.assertEquals(Assert.java:198)
	at junit.framework.Assert.assertEquals(Assert.java:204)
	at org.joda.time.TestLocalDateTime_Constructors.testConstructor_ObjectString3(TestLocalDateTime_Constructors.java:409)

testConstructor_ObjectString4(org.joda.time.TestLocalDateTime_Constructors)  Time elapsed: 0 sec  <<< FAILURE!
junit.framework.AssertionFailedError: expected:<10> but was:<0>
	at junit.framework.Assert.fail(Assert.java:47)
	at junit.framework.Assert.failNotEquals(Assert.java:280)
	at junit.framework.Assert.assertEquals(Assert.java:64)
	at junit.framework.Assert.assertEquals(Assert.java:198)
	at junit.framework.Assert.assertEquals(Assert.java:204)
	at org.joda.time.TestLocalDateTime_Constructors.testConstructor_ObjectString4(TestLocalDateTime_Constructors.java:421)

testConstructor_Object_ChronologyMoscow(org.joda.time.TestLocalDateTime_Constructors)  Time elapsed: 0.001 sec  <<< FAILURE!
junit.framework.AssertionFailedError: expected:<12> but was:<0>
	at junit.framework.Assert.fail(Assert.java:47)
	at junit.framework.Assert.failNotEquals(Assert.java:280)
	at junit.framework.Assert.assertEquals(Assert.java:64)
	at junit.framework.Assert.assertEquals(Assert.java:198)
	at junit.framework.Assert.assertEquals(Assert.java:204)
	at org.joda.time.TestLocalDateTime_Constructors.testConstructor_Object_ChronologyMoscow(TestLocalDateTime_Constructors.java:610)

testConstructor_Object_ChronologyMoscowBadDateTime(org.joda.time.TestLocalDateTime_Constructors)  Time elapsed: 0 sec  <<< FAILURE!
junit.framework.AssertionFailedError: expected:<30> but was:<0>
	at junit.framework.Assert.fail(Assert.java:47)
	at junit.framework.Assert.failNotEquals(Assert.java:280)
	at junit.framework.Assert.assertEquals(Assert.java:64)
	at junit.framework.Assert.assertEquals(Assert.java:198)
	at junit.framework.Assert.assertEquals(Assert.java:204)
	at org.joda.time.TestLocalDateTime_Constructors.testConstructor_Object_ChronologyMoscowBadDateTime(TestLocalDateTime_Constructors.java:627)

testConstructor_Object_DateTimeZoneMoscow(org.joda.time.TestLocalDateTime_Constructors)  Time elapsed: 0.001 sec  <<< FAILURE!
junit.framework.AssertionFailedError: expected:<12> but was:<0>
	at junit.framework.Assert.fail(Assert.java:47)
	at junit.framework.Assert.failNotEquals(Assert.java:280)
	at junit.framework.Assert.assertEquals(Assert.java:64)
	at junit.framework.Assert.assertEquals(Assert.java:198)
	at junit.framework.Assert.assertEquals(Assert.java:204)
	at org.joda.time.TestLocalDateTime_Constructors.testConstructor_Object_DateTimeZoneMoscow(TestLocalDateTime_Constructors.java:518)

testConstructor_Object_DateTimeZoneMoscowBadDateTime(org.joda.time.TestLocalDateTime_Constructors)  Time elapsed: 0 sec  <<< FAILURE!
junit.framework.AssertionFailedError: expected:<30> but was:<0>
	at junit.framework.Assert.fail(Assert.java:47)
	at junit.framework.Assert.failNotEquals(Assert.java:280)
	at junit.framework.Assert.assertEquals(Assert.java:64)
	at junit.framework.Assert.assertEquals(Assert.java:198)
	at junit.framework.Assert.assertEquals(Assert.java:204)
	at org.joda.time.TestLocalDateTime_Constructors.testConstructor_Object_DateTimeZoneMoscowBadDateTime(TestLocalDateTime_Constructors.java:535)

testCompareTo(org.joda.time.TestLocalDateTime_Basics)  Time elapsed: 0.002 sec  <<< ERROR!
java.lang.IllegalArgumentException: Types array must be in order largest-smallest: monthOfYear < dayOfMonth
	at org.joda.time.Partial.<init>(Partial.java:232)
	at org.joda.time.Partial.<init>(Partial.java:177)
	at org.joda.time.TestLocalDateTime_Basics.testCompareTo(TestLocalDateTime_Basics.java:355)

testCompareTo(org.joda.time.TestLocalDate_Basics)  Time elapsed: 0 sec  <<< ERROR!
java.lang.IllegalArgumentException: Types array must be in order largest-smallest: monthOfYear < dayOfMonth
	at org.joda.time.Partial.<init>(Partial.java:232)
	at org.joda.time.Partial.<init>(Partial.java:177)
	at org.joda.time.TestLocalDate_Basics.testCompareTo(TestLocalDate_Basics.java:348)

testParse_noFormatter(org.joda.time.TestMutableInterval_Constructors)  Time elapsed: 0.001 sec  <<< FAILURE!
junit.framework.AssertionFailedError: expected:<2010-06-30T12:30:00.000+02:00/2010-07-01T14:30:00.000+02:00> but was:<2010-06-30T00:00:00.000+02:00/2010-07-01T00:00:00.000+02:00>
	at junit.framework.Assert.fail(Assert.java:47)
	at junit.framework.Assert.failNotEquals(Assert.java:280)
	at junit.framework.Assert.assertEquals(Assert.java:64)
	at junit.framework.Assert.assertEquals(Assert.java:71)
	at org.joda.time.TestMutableInterval_Constructors.testParse_noFormatter(TestMutableInterval_Constructors.java:114)

testConstructor_Object1(org.joda.time.TestMutableInterval_Constructors)  Time elapsed: 0 sec  <<< FAILURE!
junit.framework.AssertionFailedError: expected:<1120950061001> but was:<1120946400000>
	at junit.framework.Assert.fail(Assert.java:47)
	at junit.framework.Assert.failNotEquals(Assert.java:280)
	at junit.framework.Assert.assertEquals(Assert.java:64)
	at junit.framework.Assert.assertEquals(Assert.java:133)
	at junit.framework.Assert.assertEquals(Assert.java:139)
	at org.joda.time.TestMutableInterval_Constructors.testConstructor_Object1(TestMutableInterval_Constructors.java:513)

testFactoryFieldDifference1(org.joda.time.TestPeriod_Constructors)  Time elapsed: 0 sec  <<< ERROR!
java.lang.IllegalArgumentException: Types array must be in order largest-smallest: monthOfYear < dayOfMonth
	at org.joda.time.Partial.<init>(Partial.java:232)
	at org.joda.time.Partial.<init>(Partial.java:177)
	at org.joda.time.TestPeriod_Constructors.testFactoryFieldDifference1(TestPeriod_Constructors.java:1497)

testFactoryFieldDifference4(org.joda.time.TestPeriod_Constructors)  Time elapsed: 0 sec  <<< ERROR!
java.lang.IllegalArgumentException: Types array must be in order largest-smallest: monthOfYear < dayOfWeek
	at org.joda.time.Partial.<init>(Partial.java:232)
	at org.joda.time.Partial.<init>(Partial.java:177)
	at org.joda.time.TestPeriod_Constructors.testFactoryFieldDifference4(TestPeriod_Constructors.java:1541)

testFactoryFieldDifference5(org.joda.time.TestPeriod_Constructors)  Time elapsed: 0 sec  <<< ERROR!
java.lang.IllegalArgumentException: Types array must be in order largest-smallest: dayOfMonth < dayOfWeek
	at org.joda.time.Partial.<init>(Partial.java:251)
	at org.joda.time.Partial.<init>(Partial.java:177)
	at org.joda.time.TestPeriod_Constructors.testFactoryFieldDifference5(TestPeriod_Constructors.java:1554)

testAdd_RInterval2(org.joda.time.TestMutablePeriod_Updates)  Time elapsed: 0.001 sec  <<< FAILURE!
junit.framework.AssertionFailedError: expected:<0> but was:<1>
	at junit.framework.Assert.fail(Assert.java:47)
	at junit.framework.Assert.failNotEquals(Assert.java:280)
	at junit.framework.Assert.assertEquals(Assert.java:64)
	at junit.framework.Assert.assertEquals(Assert.java:198)
	at junit.framework.Assert.assertEquals(Assert.java:204)
	at org.joda.time.TestMutablePeriod_Updates.testAdd_RInterval2(TestMutablePeriod_Updates.java:1339)

testCompareTo(org.joda.time.TestYearMonthDay_Basics)  Time elapsed: 0 sec  <<< ERROR!
java.lang.IllegalArgumentException: Types array must be in order largest-smallest: monthOfYear < dayOfMonth
	at org.joda.time.Partial.<init>(Partial.java:232)
	at org.joda.time.Partial.<init>(Partial.java:177)
	at org.joda.time.TestYearMonthDay_Basics.testCompareTo(TestYearMonthDay_Basics.java:242)

testCompareTo(org.joda.time.TestMonthDay_Basics)  Time elapsed: 0.001 sec  <<< ERROR!
java.lang.IllegalArgumentException: Types array must be in order largest-smallest: monthOfYear < dayOfMonth
	at org.joda.time.Partial.<init>(Partial.java:232)
	at org.joda.time.Partial.<init>(Partial.java:177)
	at org.joda.time.TestMonthDay_Basics.testCompareTo(TestMonthDay_Basics.java:245)

testParse_noFormatter(org.joda.time.TestMonthDay_Constructors)  Time elapsed: 0.001 sec  <<< ERROR!
org.joda.time.IllegalFieldValueException: Cannot parse "--02-29": Value 29 for dayOfMonth must be in the range [1,28]
	at org.joda.time.field.FieldUtils.verifyValueBounds(FieldUtils.java:234)
	at org.joda.time.field.PreciseDurationDateTimeField.set(PreciseDurationDateTimeField.java:79)
	at org.joda.time.format.DateTimeParserBucket$SavedField.set(DateTimeParserBucket.java:568)
	at org.joda.time.format.DateTimeParserBucket.computeMillis(DateTimeParserBucket.java:447)
	at org.joda.time.format.DateTimeParserBucket.computeMillis(DateTimeParserBucket.java:411)
	at org.joda.time.format.DateTimeFormatter.parseLocalDateTime(DateTimeFormatter.java:841)
	at org.joda.time.format.DateTimeFormatter.parseLocalDate(DateTimeFormatter.java:798)
	at org.joda.time.MonthDay.parse(MonthDay.java:160)
	at org.joda.time.MonthDay.parse(MonthDay.java:149)
	at org.joda.time.TestMonthDay_Constructors.testParse_noFormatter(TestMonthDay_Constructors.java:83)

testToString4(org.joda.time.TestPartial_Basics)  Time elapsed: 0.001 sec  <<< FAILURE!
junit.framework.ComparisonFailure: expected:<[dayOf[Month=13, dayOfWeek=5]]> but was:<[dayOf[Week=5, dayOfMonth=13]]>
	at junit.framework.Assert.assertEquals(Assert.java:81)
	at junit.framework.Assert.assertEquals(Assert.java:87)
	at org.joda.time.TestPartial_Basics.testToString4(TestPartial_Basics.java:863)

testConstructorEx7_TypeArray_intArray_inOrder(org.joda.time.TestPartial_Constructors)  Time elapsed: 0 sec  <<< FAILURE!
junit.framework.AssertionFailedError
	at junit.framework.Assert.fail(Assert.java:47)
	at junit.framework.Assert.fail(Assert.java:53)
	at org.joda.time.TestPartial_Constructors.testConstructorEx7_TypeArray_intArray_inOrder(TestPartial_Constructors.java:297)

testConstructorEx9_TypeArray_intArray(org.joda.time.TestPartial_Constructors)  Time elapsed: 0 sec  <<< FAILURE!
junit.framework.AssertionFailedError: Types array must be in order largest-smallest: dayOfMonth < dayOfWeek: Value 0 expected:<true> but was:<false>
	at junit.framework.Assert.fail(Assert.java:47)
	at junit.framework.Assert.failNotEquals(Assert.java:280)
	at junit.framework.Assert.assertEquals(Assert.java:64)
	at junit.framework.Assert.assertEquals(Assert.java:146)
	at org.joda.time.TestPartial_Constructors.assertMessageContains(TestPartial_Constructors.java:478)
	at org.joda.time.TestPartial_Constructors.testConstructorEx9_TypeArray_intArray(TestPartial_Constructors.java:410)

testIsMatch_Instant(org.joda.time.TestPartial_Match)  Time elapsed: 0.001 sec  <<< ERROR!
java.lang.IllegalArgumentException: Types array must be in order largest-smallest: monthOfYear < dayOfWeek
	at org.joda.time.Partial.<init>(Partial.java:232)
	at org.joda.time.TestPartial_Match.createYMDwPartial(TestPartial_Match.java:165)
	at org.joda.time.TestPartial_Match.testIsMatch_Instant(TestPartial_Match.java:97)

testIsMatch_Partial(org.joda.time.TestPartial_Match)  Time elapsed: 0 sec  <<< ERROR!
java.lang.IllegalArgumentException: Types array must be in order largest-smallest: monthOfYear < dayOfWeek
	at org.joda.time.Partial.<init>(Partial.java:232)
	at org.joda.time.TestPartial_Match.createYMDwPartial(TestPartial_Match.java:165)
	at org.joda.time.TestPartial_Match.testIsMatch_Partial(TestPartial_Match.java:129)

testSecond(org.joda.time.TestDateTimeComparator)  Time elapsed: 0.001 sec  <<< FAILURE!
junit.framework.AssertionFailedError: SecondM1a expected:<-1> but was:<0>
	at junit.framework.Assert.fail(Assert.java:47)
	at junit.framework.Assert.failNotEquals(Assert.java:280)
	at junit.framework.Assert.assertEquals(Assert.java:64)
	at junit.framework.Assert.assertEquals(Assert.java:198)
	at org.joda.time.TestDateTimeComparator.testSecond(TestDateTimeComparator.java:436)

testMinute(org.joda.time.TestDateTimeComparator)  Time elapsed: 0.001 sec  <<< FAILURE!
junit.framework.AssertionFailedError: MinuteM1a expected:<-1> but was:<0>
	at junit.framework.Assert.fail(Assert.java:47)
	at junit.framework.Assert.failNotEquals(Assert.java:280)
	at junit.framework.Assert.assertEquals(Assert.java:64)
	at junit.framework.Assert.assertEquals(Assert.java:198)
	at org.joda.time.TestDateTimeComparator.testMinute(TestDateTimeComparator.java:450)

testHour(org.joda.time.TestDateTimeComparator)  Time elapsed: 0 sec  <<< FAILURE!
junit.framework.AssertionFailedError: HourM1a expected:<-1> but was:<0>
	at junit.framework.Assert.fail(Assert.java:47)
	at junit.framework.Assert.failNotEquals(Assert.java:280)
	at junit.framework.Assert.assertEquals(Assert.java:64)
	at junit.framework.Assert.assertEquals(Assert.java:198)
	at org.joda.time.TestDateTimeComparator.testHour(TestDateTimeComparator.java:464)

testListSecond(org.joda.time.TestDateTimeComparator)  Time elapsed: 0.001 sec  <<< FAILURE!
junit.framework.AssertionFailedError: ListSecond expected:<false> but was:<true>
	at junit.framework.Assert.fail(Assert.java:47)
	at junit.framework.Assert.failNotEquals(Assert.java:280)
	at junit.framework.Assert.assertEquals(Assert.java:64)
	at junit.framework.Assert.assertEquals(Assert.java:146)
	at org.joda.time.TestDateTimeComparator.testListSecond(TestDateTimeComparator.java:642)

testListMinute(org.joda.time.TestDateTimeComparator)  Time elapsed: 0.001 sec  <<< FAILURE!
junit.framework.AssertionFailedError: ListMinute expected:<false> but was:<true>
	at junit.framework.Assert.fail(Assert.java:47)
	at junit.framework.Assert.failNotEquals(Assert.java:280)
	at junit.framework.Assert.assertEquals(Assert.java:64)
	at junit.framework.Assert.assertEquals(Assert.java:146)
	at org.joda.time.TestDateTimeComparator.testListMinute(TestDateTimeComparator.java:663)

testListHour(org.joda.time.TestDateTimeComparator)  Time elapsed: 0.002 sec  <<< FAILURE!
junit.framework.AssertionFailedError: ListHour expected:<false> but was:<true>
	at junit.framework.Assert.fail(Assert.java:47)
	at junit.framework.Assert.failNotEquals(Assert.java:280)
	at junit.framework.Assert.assertEquals(Assert.java:64)
	at junit.framework.Assert.assertEquals(Assert.java:146)
	at org.joda.time.TestDateTimeComparator.testListHour(TestDateTimeComparator.java:684)

testListTime(org.joda.time.TestDateTimeComparator)  Time elapsed: 0.001 sec  <<< FAILURE!
junit.framework.AssertionFailedError: ListTime expected:<false> but was:<true>
	at junit.framework.Assert.fail(Assert.java:47)
	at junit.framework.Assert.failNotEquals(Assert.java:280)
	at junit.framework.Assert.assertEquals(Assert.java:64)
	at junit.framework.Assert.assertEquals(Assert.java:146)
	at org.joda.time.TestDateTimeComparator.testListTime(TestDateTimeComparator.java:873)

testIsContiguous_RP(org.joda.time.TestDateTimeUtils)  Time elapsed: 0 sec  <<< ERROR!
java.lang.IllegalArgumentException: Types array must be in order largest-smallest: monthOfYear < dayOfMonth
	at org.joda.time.Partial.<init>(Partial.java:232)
	at org.joda.time.Partial.with(Partial.java:495)
	at org.joda.time.TestDateTimeUtils.testIsContiguous_RP(TestDateTimeUtils.java:440)

testIsContiguous_RP_GJChronology(org.joda.time.TestDateTimeUtils)  Time elapsed: 0.002 sec  <<< ERROR!
java.lang.IllegalArgumentException: Types array must be in order largest-smallest: monthOfYear < dayOfMonth
	at org.joda.time.Partial.<init>(Partial.java:232)
	at org.joda.time.Partial.with(Partial.java:495)
	at org.joda.time.TestDateTimeUtils.testIsContiguous_RP_GJChronology(TestDateTimeUtils.java:464)

testWithHourOfDayInDstChange(org.joda.time.TestDateTimeZoneCutover)  Time elapsed: 0.001 sec  <<< FAILURE!
junit.framework.ComparisonFailure: expected:<2010-10-31T0[2:30:10.123]+02:00> but was:<2010-10-31T0[0:00:00.000]+02:00>
	at junit.framework.Assert.assertEquals(Assert.java:81)
	at junit.framework.Assert.assertEquals(Assert.java:87)
	at org.joda.time.TestDateTimeZoneCutover.testWithHourOfDayInDstChange(TestDateTimeZoneCutover.java:1140)

testWithMinuteOfHourInDstChange(org.joda.time.TestDateTimeZoneCutover)  Time elapsed: 0.001 sec  <<< FAILURE!
junit.framework.ComparisonFailure: expected:<2010-10-31T0[2:30:10.123]+02:00> but was:<2010-10-31T0[0:00:00.000]+02:00>
	at junit.framework.Assert.assertEquals(Assert.java:81)
	at junit.framework.Assert.assertEquals(Assert.java:87)
	at org.joda.time.TestDateTimeZoneCutover.testWithMinuteOfHourInDstChange(TestDateTimeZoneCutover.java:1147)

testWithSecondOfMinuteInDstChange(org.joda.time.TestDateTimeZoneCutover)  Time elapsed: 0.001 sec  <<< FAILURE!
junit.framework.ComparisonFailure: expected:<2010-10-31T0[2:30:10.123]+02:00> but was:<2010-10-31T0[0:00:00.000]+02:00>
	at junit.framework.Assert.assertEquals(Assert.java:81)
	at junit.framework.Assert.assertEquals(Assert.java:87)
	at org.joda.time.TestDateTimeZoneCutover.testWithSecondOfMinuteInDstChange(TestDateTimeZoneCutover.java:1154)

testWithMillisOfSecondInDstChange_Paris_summer(org.joda.time.TestDateTimeZoneCutover)  Time elapsed: 0.001 sec  <<< FAILURE!
junit.framework.ComparisonFailure: expected:<2010-10-31T0[2:30:10.123]+02:00> but was:<2010-10-31T0[0:00:00.000]+02:00>
	at junit.framework.Assert.assertEquals(Assert.java:81)
	at junit.framework.Assert.assertEquals(Assert.java:87)
	at org.joda.time.TestDateTimeZoneCutover.testWithMillisOfSecondInDstChange_Paris_summer(TestDateTimeZoneCutover.java:1161)

testWithMillisOfSecondInDstChange_Paris_winter(org.joda.time.TestDateTimeZoneCutover)  Time elapsed: 0.001 sec  <<< FAILURE!
junit.framework.ComparisonFailure: expected:<2010-10-31T0[2:30:10.123+01]:00> but was:<2010-10-31T0[1:00:00.000+02]:00>
	at junit.framework.Assert.assertEquals(Assert.java:81)
	at junit.framework.Assert.assertEquals(Assert.java:87)
	at org.joda.time.TestDateTimeZoneCutover.testWithMillisOfSecondInDstChange_Paris_winter(TestDateTimeZoneCutover.java:1168)

testWithMillisOfSecondInDstChange_NewYork_summer(org.joda.time.TestDateTimeZoneCutover)  Time elapsed: 0 sec  <<< FAILURE!
junit.framework.ComparisonFailure: expected:<2007-11-04T0[1:30:00.123]-04:00> but was:<2007-11-04T0[0:00:00.000]-04:00>
	at junit.framework.Assert.assertEquals(Assert.java:81)
	at junit.framework.Assert.assertEquals(Assert.java:87)
	at org.joda.time.TestDateTimeZoneCutover.testWithMillisOfSecondInDstChange_NewYork_summer(TestDateTimeZoneCutover.java:1175)

testWithMillisOfSecondInDstChange_NewYork_winter(org.joda.time.TestDateTimeZoneCutover)  Time elapsed: 0.001 sec  <<< FAILURE!
junit.framework.ComparisonFailure: expected:<2007-11-04T01:[30:00.123-05]:00> but was:<2007-11-04T01:[00:00.000-04]:00>
	at junit.framework.Assert.assertEquals(Assert.java:81)
	at junit.framework.Assert.assertEquals(Assert.java:87)
	at org.joda.time.TestDateTimeZoneCutover.testWithMillisOfSecondInDstChange_NewYork_winter(TestDateTimeZoneCutover.java:1182)

testPlusMinutesInDstChange(org.joda.time.TestDateTimeZoneCutover)  Time elapsed: 0.001 sec  <<< FAILURE!
junit.framework.ComparisonFailure: expected:<2010-10-31T0[2:30:10.123]+02:00> but was:<2010-10-31T0[0:00:00.000]+02:00>
	at junit.framework.Assert.assertEquals(Assert.java:81)
	at junit.framework.Assert.assertEquals(Assert.java:87)
	at org.joda.time.TestDateTimeZoneCutover.testPlusMinutesInDstChange(TestDateTimeZoneCutover.java:1189)

testPlusSecondsInDstChange(org.joda.time.TestDateTimeZoneCutover)  Time elapsed: 0.001 sec  <<< FAILURE!
junit.framework.ComparisonFailure: expected:<2010-10-31T0[2:30:10.123]+02:00> but was:<2010-10-31T0[0:00:00.000]+02:00>
	at junit.framework.Assert.assertEquals(Assert.java:81)
	at junit.framework.Assert.assertEquals(Assert.java:87)
	at org.joda.time.TestDateTimeZoneCutover.testPlusSecondsInDstChange(TestDateTimeZoneCutover.java:1196)

testPlusMillisInDstChange(org.joda.time.TestDateTimeZoneCutover)  Time elapsed: 0.001 sec  <<< FAILURE!
junit.framework.ComparisonFailure: expected:<2010-10-31T0[2:30:10.123]+02:00> but was:<2010-10-31T0[0:00:00.000]+02:00>
	at junit.framework.Assert.assertEquals(Assert.java:81)
	at junit.framework.Assert.assertEquals(Assert.java:87)
	at org.joda.time.TestDateTimeZoneCutover.testPlusMillisInDstChange(TestDateTimeZoneCutover.java:1203)

testPeriod(org.joda.time.TestDateTimeZoneCutover)  Time elapsed: 0.001 sec  <<< FAILURE!
junit.framework.ComparisonFailure: expected:<PT[1M]> but was:<PT[0S]>
	at junit.framework.Assert.assertEquals(Assert.java:81)
	at junit.framework.Assert.assertEquals(Assert.java:87)
	at org.joda.time.TestDateTimeZoneCutover.testPeriod(TestDateTimeZoneCutover.java:1250)

testMutableDateTime(org.joda.time.TestStringConvert)  Time elapsed: 0.03 sec  <<< FAILURE!
junit.framework.AssertionFailedError: expected:<2010-06-30T02:30:50.678+02:00> but was:<2010-06-30T00:00:00.000+02:00>
	at junit.framework.Assert.fail(Assert.java:47)
	at junit.framework.Assert.failNotEquals(Assert.java:280)
	at junit.framework.Assert.assertEquals(Assert.java:64)
	at junit.framework.Assert.assertEquals(Assert.java:71)
	at org.joda.time.TestStringConvert.testMutableDateTime(TestStringConvert.java:71)

testLocalDateTime(org.joda.time.TestStringConvert)  Time elapsed: 0.001 sec  <<< FAILURE!
junit.framework.AssertionFailedError: expected:<2010-06-30T02:30:00.000> but was:<2010-06-30T00:00:00.000>
	at junit.framework.Assert.fail(Assert.java:47)
	at junit.framework.Assert.failNotEquals(Assert.java:280)
	at junit.framework.Assert.assertEquals(Assert.java:64)
	at junit.framework.Assert.assertEquals(Assert.java:71)
	at org.joda.time.TestStringConvert.testLocalDateTime(TestStringConvert.java:78)

testDateTime(org.joda.time.TestStringConvert)  Time elapsed: 0.002 sec  <<< FAILURE!
junit.framework.AssertionFailedError: expected:<2010-06-30T02:30:50.678+02:00> but was:<2010-06-30T00:00:00.000+02:00>
	at junit.framework.Assert.fail(Assert.java:47)
	at junit.framework.Assert.failNotEquals(Assert.java:280)
	at junit.framework.Assert.assertEquals(Assert.java:64)
	at junit.framework.Assert.assertEquals(Assert.java:71)
	at org.joda.time.TestStringConvert.testDateTime(TestStringConvert.java:64)

testMonthDay_leapDay(org.joda.time.TestStringConvert)  Time elapsed: 0.001 sec  <<< ERROR!
org.joda.time.IllegalFieldValueException: Cannot parse "--02-29": Value 29 for dayOfMonth must be in the range [1,28]
	at org.joda.time.field.FieldUtils.verifyValueBounds(FieldUtils.java:234)
	at org.joda.time.field.PreciseDurationDateTimeField.set(PreciseDurationDateTimeField.java:79)
	at org.joda.time.format.DateTimeParserBucket$SavedField.set(DateTimeParserBucket.java:568)
	at org.joda.time.format.DateTimeParserBucket.computeMillis(DateTimeParserBucket.java:447)
	at org.joda.time.format.DateTimeParserBucket.computeMillis(DateTimeParserBucket.java:411)
	at org.joda.time.format.DateTimeFormatter.parseLocalDateTime(DateTimeFormatter.java:841)
	at org.joda.time.format.DateTimeFormatter.parseLocalDate(DateTimeFormatter.java:798)
	at org.joda.time.MonthDay.parse(MonthDay.java:160)
	at org.joda.time.MonthDay.parse(MonthDay.java:149)
	at sun.reflect.NativeMethodAccessorImpl.invoke0(Native Method)
	at sun.reflect.NativeMethodAccessorImpl.invoke(NativeMethodAccessorImpl.java:57)
	at sun.reflect.DelegatingMethodAccessorImpl.invoke(DelegatingMethodAccessorImpl.java:43)
	at java.lang.reflect.Method.invoke(Method.java:606)
	at org.joda.convert.MethodsStringConverter.convertFromString(MethodsStringConverter.java:70)
	at org.joda.convert.StringConvert.convertFromString(StringConvert.java:163)
	at org.joda.time.TestStringConvert.testMonthDay_leapDay(TestStringConvert.java:113)

testParseEquivalence(org.joda.time.chrono.TestGJChronology)  Time elapsed: 0.001 sec  <<< FAILURE!
junit.framework.AssertionFailedError: expected:<1581-01-01T00:00:00.000Z> but was:<1581-01-01T01:23:45.678Z>
	at junit.framework.Assert.fail(Assert.java:47)
	at junit.framework.Assert.failNotEquals(Assert.java:280)
	at junit.framework.Assert.assertEquals(Assert.java:64)
	at junit.framework.Assert.assertEquals(Assert.java:71)
	at org.joda.time.chrono.TestGJChronology.testParse(TestGJChronology.java:375)
	at org.joda.time.chrono.TestGJChronology.testParseEquivalence(TestGJChronology.java:362)

testMaxYear(org.joda.time.chrono.TestISOChronology)  Time elapsed: 0.001 sec  <<< FAILURE!
junit.framework.AssertionFailedError: expected:<292278993-12-31T23:59:59.999Z> but was:<292278993-12-31T00:00:00.000Z>
	at junit.framework.Assert.fail(Assert.java:47)
	at junit.framework.Assert.failNotEquals(Assert.java:280)
	at junit.framework.Assert.assertEquals(Assert.java:64)
	at junit.framework.Assert.assertEquals(Assert.java:71)
	at org.joda.time.chrono.TestISOChronology.testMaxYear(TestISOChronology.java:325)

testMinYear(org.joda.time.chrono.TestISOChronology)  Time elapsed: 0.001 sec  <<< FAILURE!
junit.framework.AssertionFailedError: expected:<-292275054-12-31T23:59:59.999Z> but was:<-292275054-12-31T00:00:00.000Z>
	at junit.framework.Assert.fail(Assert.java:47)
	at junit.framework.Assert.failNotEquals(Assert.java:280)
	at junit.framework.Assert.assertEquals(Assert.java:64)
	at junit.framework.Assert.assertEquals(Assert.java:71)
	at org.joda.time.chrono.TestISOChronology.testMinYear(TestISOChronology.java:358)

testGetInstantMillis_Object_Zone(org.joda.time.convert.TestStringConverter)  Time elapsed: 0.001 sec  <<< FAILURE!
junit.framework.AssertionFailedError: expected:<1086776688501> but was:<1086732000000>
	at junit.framework.Assert.fail(Assert.java:47)
	at junit.framework.Assert.failNotEquals(Assert.java:280)
	at junit.framework.Assert.assertEquals(Assert.java:64)
	at junit.framework.Assert.assertEquals(Assert.java:133)
	at junit.framework.Assert.assertEquals(Assert.java:139)
	at org.joda.time.convert.TestStringConverter.testGetInstantMillis_Object_Zone(TestStringConverter.java:158)

testGetInstantMillis_Object(org.joda.time.convert.TestStringConverter)  Time elapsed: 0 sec  <<< FAILURE!
junit.framework.AssertionFailedError: expected:<1086755088501> but was:<1086710400000>
	at junit.framework.Assert.fail(Assert.java:47)
	at junit.framework.Assert.failNotEquals(Assert.java:280)
	at junit.framework.Assert.assertEquals(Assert.java:64)
	at junit.framework.Assert.assertEquals(Assert.java:133)
	at junit.framework.Assert.assertEquals(Assert.java:139)
	at org.joda.time.convert.TestStringConverter.testGetInstantMillis_Object(TestStringConverter.java:114)

testGetDateTime(org.joda.time.convert.TestStringConverter)  Time elapsed: 0 sec  <<< FAILURE!
junit.framework.AssertionFailedError: expected:<2004-06-09T12:24:48.501+02:00> but was:<2004-06-09T00:00:00.000+02:00>
	at junit.framework.Assert.fail(Assert.java:47)
	at junit.framework.Assert.failNotEquals(Assert.java:280)
	at junit.framework.Assert.assertEquals(Assert.java:64)
	at junit.framework.Assert.assertEquals(Assert.java:71)
	at org.joda.time.convert.TestStringConverter.testGetDateTime(TestStringConverter.java:213)

testGetDateTime1(org.joda.time.convert.TestStringConverter)  Time elapsed: 0.001 sec  <<< FAILURE!
junit.framework.AssertionFailedError: expected:<12> but was:<0>
	at junit.framework.Assert.fail(Assert.java:47)
	at junit.framework.Assert.failNotEquals(Assert.java:280)
	at junit.framework.Assert.assertEquals(Assert.java:64)
	at junit.framework.Assert.assertEquals(Assert.java:198)
	at junit.framework.Assert.assertEquals(Assert.java:204)
	at org.joda.time.convert.TestStringConverter.testGetDateTime1(TestStringConverter.java:221)

testGetDateTime2(org.joda.time.convert.TestStringConverter)  Time elapsed: 0.001 sec  <<< FAILURE!
junit.framework.AssertionFailedError: expected:<12> but was:<0>
	at junit.framework.Assert.fail(Assert.java:47)
	at junit.framework.Assert.failNotEquals(Assert.java:280)
	at junit.framework.Assert.assertEquals(Assert.java:64)
	at junit.framework.Assert.assertEquals(Assert.java:198)
	at junit.framework.Assert.assertEquals(Assert.java:204)
	at org.joda.time.convert.TestStringConverter.testGetDateTime2(TestStringConverter.java:233)

testGetDateTime3(org.joda.time.convert.TestStringConverter)  Time elapsed: 0 sec  <<< FAILURE!
junit.framework.AssertionFailedError: expected:<12> but was:<0>
	at junit.framework.Assert.fail(Assert.java:47)
	at junit.framework.Assert.failNotEquals(Assert.java:280)
	at junit.framework.Assert.assertEquals(Assert.java:64)
	at junit.framework.Assert.assertEquals(Assert.java:198)
	at junit.framework.Assert.assertEquals(Assert.java:204)
	at org.joda.time.convert.TestStringConverter.testGetDateTime3(TestStringConverter.java:245)

testGetDateTime4(org.joda.time.convert.TestStringConverter)  Time elapsed: 0.001 sec  <<< FAILURE!
junit.framework.AssertionFailedError: expected:<12> but was:<0>
	at junit.framework.Assert.fail(Assert.java:47)
	at junit.framework.Assert.failNotEquals(Assert.java:280)
	at junit.framework.Assert.assertEquals(Assert.java:64)
	at junit.framework.Assert.assertEquals(Assert.java:198)
	at junit.framework.Assert.assertEquals(Assert.java:204)
	at org.joda.time.convert.TestStringConverter.testGetDateTime4(TestStringConverter.java:257)

testParseLocalDate_weekyear_month_week_2011(org.joda.time.format.TestDateTimeFormatter)  Time elapsed: 0 sec  <<< FAILURE!
junit.framework.AssertionFailedError: expected:<2011-01-03> but was:<2011-01-01>
	at junit.framework.Assert.fail(Assert.java:47)
	at junit.framework.Assert.failNotEquals(Assert.java:280)
	at junit.framework.Assert.assertEquals(Assert.java:64)
	at junit.framework.Assert.assertEquals(Assert.java:71)
	at org.joda.time.format.TestDateTimeFormatter.testParseLocalDate_weekyear_month_week_2011(TestDateTimeFormatter.java:434)

testParseLocalDate_weekyear_month_week_2012(org.joda.time.format.TestDateTimeFormatter)  Time elapsed: 0 sec  <<< FAILURE!
junit.framework.AssertionFailedError: expected:<2012-01-02> but was:<2012-01-01>
	at junit.framework.Assert.fail(Assert.java:47)
	at junit.framework.Assert.failNotEquals(Assert.java:280)
	at junit.framework.Assert.assertEquals(Assert.java:64)
	at junit.framework.Assert.assertEquals(Assert.java:71)
	at org.joda.time.format.TestDateTimeFormatter.testParseLocalDate_weekyear_month_week_2012(TestDateTimeFormatter.java:440)

testParseLocalDate_year_month_week_2010(org.joda.time.format.TestDateTimeFormatter)  Time elapsed: 0 sec  <<< FAILURE!
junit.framework.AssertionFailedError: expected:<2010-01-04> but was:<2009-01-01>
	at junit.framework.Assert.fail(Assert.java:47)
	at junit.framework.Assert.failNotEquals(Assert.java:280)
	at junit.framework.Assert.assertEquals(Assert.java:64)
	at junit.framework.Assert.assertEquals(Assert.java:71)
	at org.joda.time.format.TestDateTimeFormatter.testParseLocalDate_year_month_week_2010(TestDateTimeFormatter.java:454)

testParseLocalDate_year_month_week_2011(org.joda.time.format.TestDateTimeFormatter)  Time elapsed: 0.001 sec  <<< FAILURE!
junit.framework.AssertionFailedError: expected:<2011-01-03> but was:<2010-01-01>
	at junit.framework.Assert.fail(Assert.java:47)
	at junit.framework.Assert.failNotEquals(Assert.java:280)
	at junit.framework.Assert.assertEquals(Assert.java:64)
	at junit.framework.Assert.assertEquals(Assert.java:71)
	at org.joda.time.format.TestDateTimeFormatter.testParseLocalDate_year_month_week_2011(TestDateTimeFormatter.java:460)

testParseLocalDate_year_month_week_2012(org.joda.time.format.TestDateTimeFormatter)  Time elapsed: 0.001 sec  <<< FAILURE!
junit.framework.AssertionFailedError: expected:<2012-01-02> but was:<2011-01-01>
	at junit.framework.Assert.fail(Assert.java:47)
	at junit.framework.Assert.failNotEquals(Assert.java:280)
	at junit.framework.Assert.assertEquals(Assert.java:64)
	at junit.framework.Assert.assertEquals(Assert.java:71)
	at org.joda.time.format.TestDateTimeFormatter.testParseLocalDate_year_month_week_2012(TestDateTimeFormatter.java:466)

testParseLocalDate_year_month_week_2013(org.joda.time.format.TestDateTimeFormatter)  Time elapsed: 0.001 sec  <<< FAILURE!
junit.framework.AssertionFailedError: expected:<2012-12-31> but was:<2013-01-01>
	at junit.framework.Assert.fail(Assert.java:47)
	at junit.framework.Assert.failNotEquals(Assert.java:280)
	at junit.framework.Assert.assertEquals(Assert.java:64)
	at junit.framework.Assert.assertEquals(Assert.java:71)
	at org.joda.time.format.TestDateTimeFormatter.testParseLocalDate_year_month_week_2013(TestDateTimeFormatter.java:472)

testParseLocalDate_year_month_week_2014(org.joda.time.format.TestDateTimeFormatter)  Time elapsed: 0.001 sec  <<< FAILURE!
junit.framework.AssertionFailedError: expected:<2013-12-30> but was:<2014-01-01>
	at junit.framework.Assert.fail(Assert.java:47)
	at junit.framework.Assert.failNotEquals(Assert.java:280)
	at junit.framework.Assert.assertEquals(Assert.java:64)
	at junit.framework.Assert.assertEquals(Assert.java:71)
	at org.joda.time.format.TestDateTimeFormatter.testParseLocalDate_year_month_week_2014(TestDateTimeFormatter.java:478)

testParseLocalDate_year_month_week_2015(org.joda.time.format.TestDateTimeFormatter)  Time elapsed: 0.001 sec  <<< FAILURE!
junit.framework.AssertionFailedError: expected:<2014-12-29> but was:<2015-01-01>
	at junit.framework.Assert.fail(Assert.java:47)
	at junit.framework.Assert.failNotEquals(Assert.java:280)
	at junit.framework.Assert.assertEquals(Assert.java:64)
	at junit.framework.Assert.assertEquals(Assert.java:71)
	at org.joda.time.format.TestDateTimeFormatter.testParseLocalDate_year_month_week_2015(TestDateTimeFormatter.java:484)

testParseLocalDate_year_month_week_2016(org.joda.time.format.TestDateTimeFormatter)  Time elapsed: 0.001 sec  <<< FAILURE!
junit.framework.AssertionFailedError: expected:<2016-01-04> but was:<2015-01-01>
	at junit.framework.Assert.fail(Assert.java:47)
	at junit.framework.Assert.failNotEquals(Assert.java:280)
	at junit.framework.Assert.assertEquals(Assert.java:64)
	at junit.framework.Assert.assertEquals(Assert.java:71)
	at org.joda.time.format.TestDateTimeFormatter.testParseLocalDate_year_month_week_2016(TestDateTimeFormatter.java:490)

testParseLocalTime_simple(org.joda.time.format.TestDateTimeFormatter)  Time elapsed: 0.001 sec  <<< FAILURE!
junit.framework.AssertionFailedError: expected:<10:20:30.000> but was:<00:00:00.000>
	at junit.framework.Assert.fail(Assert.java:47)
	at junit.framework.Assert.failNotEquals(Assert.java:280)
	at junit.framework.Assert.assertEquals(Assert.java:64)
	at junit.framework.Assert.assertEquals(Assert.java:71)
	at org.joda.time.format.TestDateTimeFormatter.testParseLocalTime_simple(TestDateTimeFormatter.java:495)

testParseLocalDate_monthDay_feb29(org.joda.time.format.TestDateTimeFormatter)  Time elapsed: 0.001 sec  <<< ERROR!
org.joda.time.IllegalFieldValueException: Cannot parse "2 29": Value 29 for dayOfMonth must be in the range [1,28]
	at org.joda.time.field.FieldUtils.verifyValueBounds(FieldUtils.java:234)
	at org.joda.time.field.PreciseDurationDateTimeField.set(PreciseDurationDateTimeField.java:79)
	at org.joda.time.chrono.GJChronology$CutoverField.set(GJChronology.java:727)
	at org.joda.time.format.DateTimeParserBucket$SavedField.set(DateTimeParserBucket.java:568)
	at org.joda.time.format.DateTimeParserBucket.computeMillis(DateTimeParserBucket.java:447)
	at org.joda.time.format.DateTimeParserBucket.computeMillis(DateTimeParserBucket.java:411)
	at org.joda.time.format.DateTimeFormatter.parseLocalDateTime(DateTimeFormatter.java:841)
	at org.joda.time.format.DateTimeFormatter.parseLocalDate(DateTimeFormatter.java:798)
	at org.joda.time.format.TestDateTimeFormatter.testParseLocalDate_monthDay_feb29(TestDateTimeFormatter.java:411)

testParseLocalDate_monthDay_withDefaultYear_feb29(org.joda.time.format.TestDateTimeFormatter)  Time elapsed: 0.001 sec  <<< ERROR!
org.joda.time.IllegalFieldValueException: Cannot parse "2 29": Value 29 for dayOfMonth must be in the range [1,28]
	at org.joda.time.field.FieldUtils.verifyValueBounds(FieldUtils.java:234)
	at org.joda.time.field.PreciseDurationDateTimeField.set(PreciseDurationDateTimeField.java:79)
	at org.joda.time.chrono.GJChronology$CutoverField.set(GJChronology.java:727)
	at org.joda.time.format.DateTimeParserBucket$SavedField.set(DateTimeParserBucket.java:568)
	at org.joda.time.format.DateTimeParserBucket.computeMillis(DateTimeParserBucket.java:447)
	at org.joda.time.format.DateTimeParserBucket.computeMillis(DateTimeParserBucket.java:411)
	at org.joda.time.format.DateTimeFormatter.parseLocalDateTime(DateTimeFormatter.java:841)
	at org.joda.time.format.DateTimeFormatter.parseLocalDate(DateTimeFormatter.java:798)
	at org.joda.time.format.TestDateTimeFormatter.testParseLocalDate_monthDay_withDefaultYear_feb29(TestDateTimeFormatter.java:422)

testParseLocalDate_weekyear_month_week_2010(org.joda.time.format.TestDateTimeFormatter)  Time elapsed: 0.001 sec  <<< FAILURE!
junit.framework.AssertionFailedError: expected:<2010-01-04> but was:<2010-01-01>
	at junit.framework.Assert.fail(Assert.java:47)
	at junit.framework.Assert.failNotEquals(Assert.java:280)
	at junit.framework.Assert.assertEquals(Assert.java:64)
	at junit.framework.Assert.assertEquals(Assert.java:71)
	at org.joda.time.format.TestDateTimeFormatter.testParseLocalDate_weekyear_month_week_2010(TestDateTimeFormatter.java:428)

testParseLocalDateTime_simple(org.joda.time.format.TestDateTimeFormatter)  Time elapsed: 0 sec  <<< FAILURE!
junit.framework.AssertionFailedError: expected:<2004-06-09T10:20:30.000> but was:<2004-06-09T00:00:00.000>
	at junit.framework.Assert.fail(Assert.java:47)
	at junit.framework.Assert.failNotEquals(Assert.java:280)
	at junit.framework.Assert.assertEquals(Assert.java:64)
	at junit.framework.Assert.assertEquals(Assert.java:71)
	at org.joda.time.format.TestDateTimeFormatter.testParseLocalDateTime_simple(TestDateTimeFormatter.java:508)

testParseLocalDateTime_monthDay_feb29(org.joda.time.format.TestDateTimeFormatter)  Time elapsed: 0.001 sec  <<< ERROR!
org.joda.time.IllegalFieldValueException: Cannot parse "2 29 13 40": Value 29 for dayOfMonth must be in the range [1,28]
	at org.joda.time.field.FieldUtils.verifyValueBounds(FieldUtils.java:234)
	at org.joda.time.field.PreciseDurationDateTimeField.set(PreciseDurationDateTimeField.java:79)
	at org.joda.time.chrono.GJChronology$CutoverField.set(GJChronology.java:727)
	at org.joda.time.format.DateTimeParserBucket$SavedField.set(DateTimeParserBucket.java:568)
	at org.joda.time.format.DateTimeParserBucket.computeMillis(DateTimeParserBucket.java:447)
	at org.joda.time.format.DateTimeParserBucket.computeMillis(DateTimeParserBucket.java:411)
	at org.joda.time.format.DateTimeFormatter.parseLocalDateTime(DateTimeFormatter.java:841)
	at org.joda.time.format.TestDateTimeFormatter.testParseLocalDateTime_monthDay_feb29(TestDateTimeFormatter.java:526)

testParseLocalDateTime_monthDay_withDefaultYear_feb29(org.joda.time.format.TestDateTimeFormatter)  Time elapsed: 0.011 sec  <<< ERROR!
org.joda.time.IllegalFieldValueException: Cannot parse "2 29 13 40": Value 29 for dayOfMonth must be in the range [1,28]
	at org.joda.time.field.FieldUtils.verifyValueBounds(FieldUtils.java:234)
	at org.joda.time.field.PreciseDurationDateTimeField.set(PreciseDurationDateTimeField.java:79)
	at org.joda.time.chrono.GJChronology$CutoverField.set(GJChronology.java:727)
	at org.joda.time.format.DateTimeParserBucket$SavedField.set(DateTimeParserBucket.java:568)
	at org.joda.time.format.DateTimeParserBucket.computeMillis(DateTimeParserBucket.java:447)
	at org.joda.time.format.DateTimeParserBucket.computeMillis(DateTimeParserBucket.java:411)
	at org.joda.time.format.DateTimeFormatter.parseLocalDateTime(DateTimeFormatter.java:841)
	at org.joda.time.format.TestDateTimeFormatter.testParseLocalDateTime_monthDay_withDefaultYear_feb29(TestDateTimeFormatter.java:537)

testParseDateTime_simple(org.joda.time.format.TestDateTimeFormatter)  Time elapsed: 0 sec  <<< FAILURE!
junit.framework.AssertionFailedError: expected:<2004-06-09T11:20:30.000+01:00> but was:<2004-06-09T01:00:00.000+01:00>
	at junit.framework.Assert.fail(Assert.java:47)
	at junit.framework.Assert.failNotEquals(Assert.java:280)
	at junit.framework.Assert.assertEquals(Assert.java:64)
	at junit.framework.Assert.assertEquals(Assert.java:71)
	at org.joda.time.format.TestDateTimeFormatter.testParseDateTime_simple(TestDateTimeFormatter.java:544)

testParseDateTime_zone(org.joda.time.format.TestDateTimeFormatter)  Time elapsed: 0 sec  <<< FAILURE!
junit.framework.AssertionFailedError: expected:<2004-06-09T11:20:30.000+01:00> but was:<2004-06-09T01:00:00.000+01:00>
	at junit.framework.Assert.fail(Assert.java:47)
	at junit.framework.Assert.failNotEquals(Assert.java:280)
	at junit.framework.Assert.assertEquals(Assert.java:64)
	at junit.framework.Assert.assertEquals(Assert.java:71)
	at org.joda.time.format.TestDateTimeFormatter.testParseDateTime_zone(TestDateTimeFormatter.java:555)

testParseDateTime_zone2(org.joda.time.format.TestDateTimeFormatter)  Time elapsed: 0 sec  <<< FAILURE!
junit.framework.AssertionFailedError: expected:<2004-06-09T11:20:30.000+01:00> but was:<2004-06-09T05:00:00.000+01:00>
	at junit.framework.Assert.fail(Assert.java:47)
	at junit.framework.Assert.failNotEquals(Assert.java:280)
	at junit.framework.Assert.assertEquals(Assert.java:64)
	at junit.framework.Assert.assertEquals(Assert.java:71)
	at org.joda.time.format.TestDateTimeFormatter.testParseDateTime_zone2(TestDateTimeFormatter.java:567)

testParseDateTime_zone3(org.joda.time.format.TestDateTimeFormatter)  Time elapsed: 0 sec  <<< FAILURE!
junit.framework.AssertionFailedError: expected:<2004-06-09T10:20:30.000+01:00> but was:<2004-06-09T00:00:00.000+01:00>
	at junit.framework.Assert.fail(Assert.java:47)
	at junit.framework.Assert.failNotEquals(Assert.java:280)
	at junit.framework.Assert.assertEquals(Assert.java:64)
	at junit.framework.Assert.assertEquals(Assert.java:71)
	at org.joda.time.format.TestDateTimeFormatter.testParseDateTime_zone3(TestDateTimeFormatter.java:585)

testParseDateTime_simple_precedence(org.joda.time.format.TestDateTimeFormatter)  Time elapsed: 0 sec  <<< FAILURE!
junit.framework.AssertionFailedError: expected:<2004-06-09T11:20:30.000+01:00> but was:<2004-06-09T01:00:00.000+01:00>
	at junit.framework.Assert.fail(Assert.java:47)
	at junit.framework.Assert.failNotEquals(Assert.java:280)
	at junit.framework.Assert.assertEquals(Assert.java:64)
	at junit.framework.Assert.assertEquals(Assert.java:71)
	at org.joda.time.format.TestDateTimeFormatter.testParseDateTime_simple_precedence(TestDateTimeFormatter.java:598)

testParseDateTime_offsetParsed(org.joda.time.format.TestDateTimeFormatter)  Time elapsed: 0 sec  <<< FAILURE!
junit.framework.AssertionFailedError: expected:<2004-06-09T10:20:30.000Z> but was:<2004-06-09T00:00:00.000Z>
	at junit.framework.Assert.fail(Assert.java:47)
	at junit.framework.Assert.failNotEquals(Assert.java:280)
	at junit.framework.Assert.assertEquals(Assert.java:64)
	at junit.framework.Assert.assertEquals(Assert.java:71)
	at org.joda.time.format.TestDateTimeFormatter.testParseDateTime_offsetParsed(TestDateTimeFormatter.java:609)

testParseDateTime_chrono(org.joda.time.format.TestDateTimeFormatter)  Time elapsed: 0 sec  <<< FAILURE!
junit.framework.AssertionFailedError: expected:<2004-06-09T12:20:30.000+02:00> but was:<2004-06-09T02:00:00.000+02:00>
	at junit.framework.Assert.fail(Assert.java:47)
	at junit.framework.Assert.failNotEquals(Assert.java:280)
	at junit.framework.Assert.assertEquals(Assert.java:64)
	at junit.framework.Assert.assertEquals(Assert.java:71)
	at org.joda.time.format.TestDateTimeFormatter.testParseDateTime_chrono(TestDateTimeFormatter.java:623)

testParseMutableDateTime_simple(org.joda.time.format.TestDateTimeFormatter)  Time elapsed: 0 sec  <<< FAILURE!
junit.framework.AssertionFailedError: expected:<2004-06-09T11:20:30.000+01:00> but was:<2004-06-09T01:00:00.000+01:00>
	at junit.framework.Assert.fail(Assert.java:47)
	at junit.framework.Assert.failNotEquals(Assert.java:280)
	at junit.framework.Assert.assertEquals(Assert.java:64)
	at junit.framework.Assert.assertEquals(Assert.java:71)
	at org.joda.time.format.TestDateTimeFormatter.testParseMutableDateTime_simple(TestDateTimeFormatter.java:639)

testParseMutableDateTime_zone(org.joda.time.format.TestDateTimeFormatter)  Time elapsed: 0 sec  <<< FAILURE!
junit.framework.AssertionFailedError: expected:<2004-06-09T11:20:30.000+01:00> but was:<2004-06-09T01:00:00.000+01:00>
	at junit.framework.Assert.fail(Assert.java:47)
	at junit.framework.Assert.failNotEquals(Assert.java:280)
	at junit.framework.Assert.assertEquals(Assert.java:64)
	at junit.framework.Assert.assertEquals(Assert.java:71)
	at org.joda.time.format.TestDateTimeFormatter.testParseMutableDateTime_zone(TestDateTimeFormatter.java:650)

testParseMutableDateTime_zone2(org.joda.time.format.TestDateTimeFormatter)  Time elapsed: 0 sec  <<< FAILURE!
junit.framework.AssertionFailedError: expected:<2004-06-09T11:20:30.000+01:00> but was:<2004-06-09T05:00:00.000+01:00>
	at junit.framework.Assert.fail(Assert.java:47)
	at junit.framework.Assert.failNotEquals(Assert.java:280)
	at junit.framework.Assert.assertEquals(Assert.java:64)
	at junit.framework.Assert.assertEquals(Assert.java:71)
	at org.joda.time.format.TestDateTimeFormatter.testParseMutableDateTime_zone2(TestDateTimeFormatter.java:662)

testParseMutableDateTime_zone3(org.joda.time.format.TestDateTimeFormatter)  Time elapsed: 0.002 sec  <<< FAILURE!
junit.framework.AssertionFailedError: expected:<2004-06-09T10:20:30.000+01:00> but was:<2004-06-09T00:00:00.000+01:00>
	at junit.framework.Assert.fail(Assert.java:47)
	at junit.framework.Assert.failNotEquals(Assert.java:280)
	at junit.framework.Assert.assertEquals(Assert.java:64)
	at junit.framework.Assert.assertEquals(Assert.java:71)
	at org.joda.time.format.TestDateTimeFormatter.testParseMutableDateTime_zone3(TestDateTimeFormatter.java:680)

testParseMutableDateTime_simple_precedence(org.joda.time.format.TestDateTimeFormatter)  Time elapsed: 0 sec  <<< FAILURE!
junit.framework.AssertionFailedError: expected:<2004-06-09T11:20:30.000+01:00> but was:<2004-06-09T01:00:00.000+01:00>
	at junit.framework.Assert.fail(Assert.java:47)
	at junit.framework.Assert.failNotEquals(Assert.java:280)
	at junit.framework.Assert.assertEquals(Assert.java:64)
	at junit.framework.Assert.assertEquals(Assert.java:71)
	at org.joda.time.format.TestDateTimeFormatter.testParseMutableDateTime_simple_precedence(TestDateTimeFormatter.java:693)

testParseMutableDateTime_offsetParsed(org.joda.time.format.TestDateTimeFormatter)  Time elapsed: 0 sec  <<< FAILURE!
junit.framework.AssertionFailedError: expected:<2004-06-09T10:20:30.000Z> but was:<2004-06-09T00:00:00.000Z>
	at junit.framework.Assert.fail(Assert.java:47)
	at junit.framework.Assert.failNotEquals(Assert.java:280)
	at junit.framework.Assert.assertEquals(Assert.java:64)
	at junit.framework.Assert.assertEquals(Assert.java:71)
	at org.joda.time.format.TestDateTimeFormatter.testParseMutableDateTime_offsetParsed(TestDateTimeFormatter.java:704)

testParseMutableDateTime_chrono(org.joda.time.format.TestDateTimeFormatter)  Time elapsed: 0 sec  <<< FAILURE!
junit.framework.AssertionFailedError: expected:<2004-06-09T12:20:30.000+02:00> but was:<2004-06-09T02:00:00.000+02:00>
	at junit.framework.Assert.fail(Assert.java:47)
	at junit.framework.Assert.failNotEquals(Assert.java:280)
	at junit.framework.Assert.assertEquals(Assert.java:64)
	at junit.framework.Assert.assertEquals(Assert.java:71)
	at org.joda.time.format.TestDateTimeFormatter.testParseMutableDateTime_chrono(TestDateTimeFormatter.java:718)

testParseInto_simple_precedence(org.joda.time.format.TestDateTimeFormatter)  Time elapsed: 0 sec  <<< FAILURE!
junit.framework.AssertionFailedError: expected:<2004-06-07T11:20:30.000+01:00> but was:<2004-05-09T11:20:30.000+01:00>
	at junit.framework.Assert.fail(Assert.java:47)
	at junit.framework.Assert.failNotEquals(Assert.java:280)
	at junit.framework.Assert.assertEquals(Assert.java:64)
	at junit.framework.Assert.assertEquals(Assert.java:71)
	at org.joda.time.format.TestDateTimeFormatter.testParseInto_simple_precedence(TestDateTimeFormatter.java:816)

testFormatParse_textMonthAtEnd_France(org.joda.time.format.TestDateTimeFormat)  Time elapsed: 0.001 sec  <<< FAILURE!
junit.framework.AssertionFailedError: expected:<2000> but was:<1970>
	at junit.framework.Assert.fail(Assert.java:47)
	at junit.framework.Assert.failNotEquals(Assert.java:280)
	at junit.framework.Assert.assertEquals(Assert.java:64)
	at junit.framework.Assert.assertEquals(Assert.java:198)
	at junit.framework.Assert.assertEquals(Assert.java:204)
	at org.joda.time.format.TestDateTimeFormat.check(TestDateTimeFormat.java:1173)
	at org.joda.time.format.TestDateTimeFormat.testFormatParse_textMonthAtEnd_France(TestDateTimeFormat.java:974)

testFormatParse_textMonthAtEnd_France_withSpecifiedDefault(org.joda.time.format.TestDateTimeFormat)  Time elapsed: 0 sec  <<< FAILURE!
junit.framework.AssertionFailedError: expected:<1980> but was:<1970>
	at junit.framework.Assert.fail(Assert.java:47)
	at junit.framework.Assert.failNotEquals(Assert.java:280)
	at junit.framework.Assert.assertEquals(Assert.java:64)
	at junit.framework.Assert.assertEquals(Assert.java:198)
	at junit.framework.Assert.assertEquals(Assert.java:204)
	at org.joda.time.format.TestDateTimeFormat.check(TestDateTimeFormat.java:1173)
	at org.joda.time.format.TestDateTimeFormat.testFormatParse_textMonthAtEnd_France_withSpecifiedDefault(TestDateTimeFormat.java:984)

testFormatParse_textMonthApr_Korean(org.joda.time.format.TestDateTimeFormat)  Time elapsed: 0.006 sec  <<< FAILURE!
junit.framework.AssertionFailedError: expected:<2007-03-08T22:00:00.000Z> but was:<2007-03-08T00:00:00.000Z>
	at junit.framework.Assert.fail(Assert.java:47)
	at junit.framework.Assert.failNotEquals(Assert.java:280)
	at junit.framework.Assert.assertEquals(Assert.java:64)
	at junit.framework.Assert.assertEquals(Assert.java:71)
	at org.joda.time.format.TestDateTimeFormat.testFormatParse_textMonthApr_Korean(TestDateTimeFormat.java:993)

testForStyle_shortDateTime(org.joda.time.format.TestDateTimeFormatStyle)  Time elapsed: 0.003 sec  <<< FAILURE!
junit.framework.AssertionFailedError: expected:<2004-06-09T10:20:00.000+01:00> but was:<2004-06-09T00:00:00.000+01:00>
	at junit.framework.Assert.fail(Assert.java:47)
	at junit.framework.Assert.failNotEquals(Assert.java:280)
	at junit.framework.Assert.assertEquals(Assert.java:64)
	at junit.framework.Assert.assertEquals(Assert.java:71)
	at org.joda.time.format.TestDateTimeFormatStyle.testForStyle_shortDateTime(TestDateTimeFormatStyle.java:179)

testFormat_date_partial(org.joda.time.format.TestISODateTimeFormat)  Time elapsed: 0.001 sec  <<< ERROR!
java.lang.IllegalArgumentException: Types array must be in order largest-smallest: monthOfYear < dayOfMonth
	at org.joda.time.Partial.<init>(Partial.java:232)
	at org.joda.time.Partial.<init>(Partial.java:177)
	at org.joda.time.format.TestISODateTimeFormat.testFormat_date_partial(TestISODateTimeFormat.java:108)

testForFields_calBased_YMD(org.joda.time.format.TestISODateTimeFormat_Fields)  Time elapsed: 0.001 sec  <<< ERROR!
java.lang.IllegalArgumentException: Types array must be in order largest-smallest: monthOfYear < dayOfMonth
	at org.joda.time.Partial.<init>(Partial.java:232)
	at org.joda.time.Partial.<init>(Partial.java:177)
	at org.joda.time.format.TestISODateTimeFormat_Fields.testForFields_calBased_YMD(TestISODateTimeFormat_Fields.java:83)

testForFields_calBased_YMD_unmodifiable(org.joda.time.format.TestISODateTimeFormat_Fields)  Time elapsed: 0 sec  <<< ERROR!
java.lang.IllegalArgumentException: Types array must be in order largest-smallest: monthOfYear < dayOfMonth
	at org.joda.time.Partial.<init>(Partial.java:232)
	at org.joda.time.Partial.<init>(Partial.java:177)
	at org.joda.time.format.TestISODateTimeFormat_Fields.testForFields_calBased_YMD_unmodifiable(TestISODateTimeFormat_Fields.java:112)

testForFields_calBased_YMD_duplicates(org.joda.time.format.TestISODateTimeFormat_Fields)  Time elapsed: 0.001 sec  <<< ERROR!
java.lang.IllegalArgumentException: Types array must be in order largest-smallest: monthOfYear < dayOfMonth
	at org.joda.time.Partial.<init>(Partial.java:232)
	at org.joda.time.Partial.<init>(Partial.java:177)
	at org.joda.time.format.TestISODateTimeFormat_Fields.testForFields_calBased_YMD_duplicates(TestISODateTimeFormat_Fields.java:137)

testForFields_calBased_MD(org.joda.time.format.TestISODateTimeFormat_Fields)  Time elapsed: 0.001 sec  <<< ERROR!
java.lang.IllegalArgumentException: Types array must be in order largest-smallest: monthOfYear < dayOfMonth
	at org.joda.time.Partial.<init>(Partial.java:232)
	at org.joda.time.Partial.<init>(Partial.java:177)
	at org.joda.time.format.TestISODateTimeFormat_Fields.testForFields_calBased_MD(TestISODateTimeFormat_Fields.java:264)

testForFields_datetime_YMDH(org.joda.time.format.TestISODateTimeFormat_Fields)  Time elapsed: 0 sec  <<< ERROR!
java.lang.IllegalArgumentException: Types array must be in order largest-smallest: monthOfYear < dayOfMonth
	at org.joda.time.Partial.<init>(Partial.java:232)
	at org.joda.time.Partial.<init>(Partial.java:177)
	at org.joda.time.format.TestISODateTimeFormat_Fields.testForFields_datetime_YMDH(TestISODateTimeFormat_Fields.java:1044)

test_dateTime(org.joda.time.format.TestISODateTimeFormatParsing)  Time elapsed: 0.001 sec  <<< FAILURE!
junit.framework.AssertionFailedError: expected:<2006-02-04T10:20:30.400Z> but was:<2006-02-04T00:00:00.000Z>
	at junit.framework.Assert.fail(Assert.java:47)
	at junit.framework.Assert.failNotEquals(Assert.java:280)
	at junit.framework.Assert.assertEquals(Assert.java:64)
	at junit.framework.Assert.assertEquals(Assert.java:71)
	at org.joda.time.format.TestISODateTimeFormatParsing.assertParse(TestISODateTimeFormatParsing.java:841)
	at org.joda.time.format.TestISODateTimeFormatParsing.test_dateTime(TestISODateTimeFormatParsing.java:429)

test_dateTimeNoMillis(org.joda.time.format.TestISODateTimeFormatParsing)  Time elapsed: 0.001 sec  <<< FAILURE!
junit.framework.AssertionFailedError: expected:<2006-02-04T10:20:30.000Z> but was:<2006-02-04T00:00:00.000Z>
	at junit.framework.Assert.fail(Assert.java:47)
	at junit.framework.Assert.failNotEquals(Assert.java:280)
	at junit.framework.Assert.assertEquals(Assert.java:64)
	at junit.framework.Assert.assertEquals(Assert.java:71)
	at org.joda.time.format.TestISODateTimeFormatParsing.assertParse(TestISODateTimeFormatParsing.java:841)
	at org.joda.time.format.TestISODateTimeFormatParsing.test_dateTimeNoMillis(TestISODateTimeFormatParsing.java:454)

test_basicDateTime(org.joda.time.format.TestISODateTimeFormatParsing)  Time elapsed: 0 sec  <<< FAILURE!
junit.framework.AssertionFailedError: expected:<2006-12-04T10:20:30.400Z> but was:<2006-12-04T00:00:00.000Z>
	at junit.framework.Assert.fail(Assert.java:47)
	at junit.framework.Assert.failNotEquals(Assert.java:280)
	at junit.framework.Assert.assertEquals(Assert.java:64)
	at junit.framework.Assert.assertEquals(Assert.java:71)
	at org.joda.time.format.TestISODateTimeFormatParsing.assertParse(TestISODateTimeFormatParsing.java:841)
	at org.joda.time.format.TestISODateTimeFormatParsing.test_basicDateTime(TestISODateTimeFormatParsing.java:636)

test_basicDateTimeNoMillis(org.joda.time.format.TestISODateTimeFormatParsing)  Time elapsed: 0.001 sec  <<< FAILURE!
junit.framework.AssertionFailedError: expected:<2006-12-04T10:20:30.000Z> but was:<2006-12-04T00:00:00.000Z>
	at junit.framework.Assert.fail(Assert.java:47)
	at junit.framework.Assert.failNotEquals(Assert.java:280)
	at junit.framework.Assert.assertEquals(Assert.java:64)
	at junit.framework.Assert.assertEquals(Assert.java:71)
	at org.joda.time.format.TestISODateTimeFormatParsing.assertParse(TestISODateTimeFormatParsing.java:841)
	at org.joda.time.format.TestISODateTimeFormatParsing.test_basicDateTimeNoMillis(TestISODateTimeFormatParsing.java:658)

test_printParseZoneTokyo(org.joda.time.format.TestDateTimeFormatterBuilder)  Time elapsed: 0.001 sec  <<< FAILURE!
junit.framework.AssertionFailedError: expected:<2007-03-04T12:30:00.000+09:00> but was:<2007-03-04T00:00:00.000+09:00>
	at junit.framework.Assert.fail(Assert.java:47)
	at junit.framework.Assert.failNotEquals(Assert.java:280)
	at junit.framework.Assert.assertEquals(Assert.java:64)
	at junit.framework.Assert.assertEquals(Assert.java:71)
	at org.joda.time.format.TestDateTimeFormatterBuilder.test_printParseZoneTokyo(TestDateTimeFormatterBuilder.java:414)

test_printParseZoneParis(org.joda.time.format.TestDateTimeFormatterBuilder)  Time elapsed: 0.001 sec  <<< FAILURE!
junit.framework.AssertionFailedError: expected:<2007-03-04T12:30:00.000+01:00> but was:<2007-03-04T00:00:00.000+01:00>
	at junit.framework.Assert.fail(Assert.java:47)
	at junit.framework.Assert.failNotEquals(Assert.java:280)
	at junit.framework.Assert.assertEquals(Assert.java:64)
	at junit.framework.Assert.assertEquals(Assert.java:71)
	at org.joda.time.format.TestDateTimeFormatterBuilder.test_printParseZoneParis(TestDateTimeFormatterBuilder.java:424)

test_printParseZoneDawsonCreek(org.joda.time.format.TestDateTimeFormatterBuilder)  Time elapsed: 0.002 sec  <<< FAILURE!
junit.framework.AssertionFailedError: expected:<2007-03-04T12:30:00.000-07:00> but was:<2007-03-04T00:00:00.000-07:00>
	at junit.framework.Assert.fail(Assert.java:47)
	at junit.framework.Assert.failNotEquals(Assert.java:280)
	at junit.framework.Assert.assertEquals(Assert.java:64)
	at junit.framework.Assert.assertEquals(Assert.java:71)
	at org.joda.time.format.TestDateTimeFormatterBuilder.test_printParseZoneDawsonCreek(TestDateTimeFormatterBuilder.java:435)

test_printParseZoneBahiaBanderas(org.joda.time.format.TestDateTimeFormatterBuilder)  Time elapsed: 0.002 sec  <<< FAILURE!
junit.framework.AssertionFailedError: expected:<2007-03-04T12:30:00.000-07:00> but was:<2007-03-04T00:00:00.000-07:00>
	at junit.framework.Assert.fail(Assert.java:47)
	at junit.framework.Assert.failNotEquals(Assert.java:280)
	at junit.framework.Assert.assertEquals(Assert.java:64)
	at junit.framework.Assert.assertEquals(Assert.java:71)
	at org.joda.time.format.TestDateTimeFormatterBuilder.test_printParseZoneBahiaBanderas(TestDateTimeFormatterBuilder.java:445)

test_printParseOffset(org.joda.time.format.TestDateTimeFormatterBuilder)  Time elapsed: 0.001 sec  <<< FAILURE!
junit.framework.AssertionFailedError: expected:<2007-03-04T03:30:00.000Z> but was:<2007-03-03T15:00:00.000Z>
	at junit.framework.Assert.fail(Assert.java:47)
	at junit.framework.Assert.failNotEquals(Assert.java:280)
	at junit.framework.Assert.assertEquals(Assert.java:64)
	at junit.framework.Assert.assertEquals(Assert.java:71)
	at org.joda.time.format.TestDateTimeFormatterBuilder.test_printParseOffset(TestDateTimeFormatterBuilder.java:455)

test_printParseOffsetAndZone(org.joda.time.format.TestDateTimeFormatterBuilder)  Time elapsed: 0.001 sec  <<< FAILURE!
junit.framework.AssertionFailedError: expected:<2007-03-04T12:30:00.000+09:00> but was:<2007-03-04T00:00:00.000+09:00>
	at junit.framework.Assert.fail(Assert.java:47)
	at junit.framework.Assert.failNotEquals(Assert.java:280)
	at junit.framework.Assert.assertEquals(Assert.java:64)
	at junit.framework.Assert.assertEquals(Assert.java:71)
	at org.joda.time.format.TestDateTimeFormatterBuilder.test_printParseOffsetAndZone(TestDateTimeFormatterBuilder.java:467)

test_parseWrongOffset(org.joda.time.format.TestDateTimeFormatterBuilder)  Time elapsed: 0.001 sec  <<< FAILURE!
junit.framework.AssertionFailedError: expected:<2007-03-04T14:30:00.000+09:00> but was:<2007-03-04T02:00:00.000+09:00>
	at junit.framework.Assert.fail(Assert.java:47)
	at junit.framework.Assert.failNotEquals(Assert.java:280)
	at junit.framework.Assert.assertEquals(Assert.java:64)
	at junit.framework.Assert.assertEquals(Assert.java:71)
	at org.joda.time.format.TestDateTimeFormatterBuilder.test_parseWrongOffset(TestDateTimeFormatterBuilder.java:479)

test_parseWrongOffsetAndZone(org.joda.time.format.TestDateTimeFormatterBuilder)  Time elapsed: 0.001 sec  <<< FAILURE!
junit.framework.AssertionFailedError: expected:<2007-03-04T14:30:00.000+09:00> but was:<2007-03-04T02:00:00.000+09:00>
	at junit.framework.Assert.fail(Assert.java:47)
	at junit.framework.Assert.failNotEquals(Assert.java:280)
	at junit.framework.Assert.assertEquals(Assert.java:64)
	at junit.framework.Assert.assertEquals(Assert.java:71)
	at org.joda.time.format.TestDateTimeFormatterBuilder.test_parseWrongOffsetAndZone(TestDateTimeFormatterBuilder.java:493)

test_localPrintParseZoneTokyo(org.joda.time.format.TestDateTimeFormatterBuilder)  Time elapsed: 0.002 sec  <<< FAILURE!
junit.framework.AssertionFailedError: expected:<2007-03-04T12:30:00.000> but was:<2007-03-04T00:00:00.000>
	at junit.framework.Assert.fail(Assert.java:47)
	at junit.framework.Assert.failNotEquals(Assert.java:280)
	at junit.framework.Assert.assertEquals(Assert.java:64)
	at junit.framework.Assert.assertEquals(Assert.java:71)
	at org.joda.time.format.TestDateTimeFormatterBuilder.test_localPrintParseZoneTokyo(TestDateTimeFormatterBuilder.java:510)

test_localPrintParseOffset(org.joda.time.format.TestDateTimeFormatterBuilder)  Time elapsed: 0.01 sec  <<< FAILURE!
junit.framework.AssertionFailedError: expected:<2007-03-04T12:30:00.000> but was:<2007-03-04T00:00:00.000>
	at junit.framework.Assert.fail(Assert.java:47)
	at junit.framework.Assert.failNotEquals(Assert.java:280)
	at junit.framework.Assert.assertEquals(Assert.java:64)
	at junit.framework.Assert.assertEquals(Assert.java:71)
	at org.joda.time.format.TestDateTimeFormatterBuilder.test_localPrintParseOffset(TestDateTimeFormatterBuilder.java:522)

test_localPrintParseOffsetAndZone(org.joda.time.format.TestDateTimeFormatterBuilder)  Time elapsed: 0 sec  <<< FAILURE!
junit.framework.AssertionFailedError: expected:<2007-03-04T12:30:00.000> but was:<2007-03-04T00:00:00.000>
	at junit.framework.Assert.fail(Assert.java:47)
	at junit.framework.Assert.failNotEquals(Assert.java:280)
	at junit.framework.Assert.assertEquals(Assert.java:64)
	at junit.framework.Assert.assertEquals(Assert.java:71)
	at org.joda.time.format.TestDateTimeFormatterBuilder.test_localPrintParseOffsetAndZone(TestDateTimeFormatterBuilder.java:536)

test_localParseWrongOffsetAndZone(org.joda.time.format.TestDateTimeFormatterBuilder)  Time elapsed: 0 sec  <<< FAILURE!
junit.framework.AssertionFailedError: expected:<2007-03-04T12:30:00.000> but was:<2007-03-04T00:00:00.000>
	at junit.framework.Assert.fail(Assert.java:47)
	at junit.framework.Assert.failNotEquals(Assert.java:280)
	at junit.framework.Assert.assertEquals(Assert.java:64)
	at junit.framework.Assert.assertEquals(Assert.java:71)
	at org.joda.time.format.TestDateTimeFormatterBuilder.test_localParseWrongOffsetAndZone(TestDateTimeFormatterBuilder.java:547)

test_printParseShortNameWithLookup(org.joda.time.format.TestDateTimeFormatterBuilder)  Time elapsed: 0.003 sec  <<< FAILURE!
junit.framework.AssertionFailedError: expected:<2011-01-04T12:30:00.000Z> but was:<2011-01-04T00:00:00.000Z>
	at junit.framework.Assert.fail(Assert.java:47)
	at junit.framework.Assert.failNotEquals(Assert.java:280)
	at junit.framework.Assert.assertEquals(Assert.java:64)
	at junit.framework.Assert.assertEquals(Assert.java:71)
	at org.joda.time.format.TestDateTimeFormatterBuilder.test_printParseShortNameWithLookup(TestDateTimeFormatterBuilder.java:588)

test_printParseShortNameWithAutoLookup(org.joda.time.format.TestDateTimeFormatterBuilder)  Time elapsed: 0.001 sec  <<< FAILURE!
junit.framework.AssertionFailedError: America/New_York America/New_York expected:<2011-01-04T12:30:00.000-05:00> but was:<2011-01-04T00:00:00.000-05:00>
	at junit.framework.Assert.fail(Assert.java:47)
	at junit.framework.Assert.failNotEquals(Assert.java:280)
	at junit.framework.Assert.assertEquals(Assert.java:64)
	at org.joda.time.format.TestDateTimeFormatterBuilder.test_printParseShortNameWithAutoLookup(TestDateTimeFormatterBuilder.java:615)

test_printParseLongNameWithLookup(org.joda.time.format.TestDateTimeFormatterBuilder)  Time elapsed: 0.001 sec  <<< FAILURE!
junit.framework.AssertionFailedError: expected:<2011-01-04T12:30:00.000Z> but was:<2011-01-04T00:00:00.000Z>
	at junit.framework.Assert.fail(Assert.java:47)
	at junit.framework.Assert.failNotEquals(Assert.java:280)
	at junit.framework.Assert.assertEquals(Assert.java:64)
	at junit.framework.Assert.assertEquals(Assert.java:71)
	at org.joda.time.format.TestDateTimeFormatterBuilder.test_printParseLongNameWithLookup(TestDateTimeFormatterBuilder.java:662)

testSerialization(org.joda.time.tz.TestBuilder)  Time elapsed: 0.01 sec  <<< FAILURE!
junit.framework.AssertionFailedError: expected:<-2717712000000> but was:<-2717640422000>
	at junit.framework.Assert.fail(Assert.java:47)
	at junit.framework.Assert.failNotEquals(Assert.java:280)
	at junit.framework.Assert.assertEquals(Assert.java:64)
	at junit.framework.Assert.assertEquals(Assert.java:133)
	at junit.framework.Assert.assertEquals(Assert.java:139)
	at org.joda.time.tz.TestBuilder.testForwardTransitions(TestBuilder.java:234)
	at org.joda.time.tz.TestBuilder.testSerialization(TestBuilder.java:282)

testForwardTransitions(org.joda.time.tz.TestBuilder)  Time elapsed: 0.006 sec  <<< FAILURE!
junit.framework.AssertionFailedError: expected:<-2717712000000> but was:<-2717640422000>
	at junit.framework.Assert.fail(Assert.java:47)
	at junit.framework.Assert.failNotEquals(Assert.java:280)
	at junit.framework.Assert.assertEquals(Assert.java:64)
	at junit.framework.Assert.assertEquals(Assert.java:133)
	at junit.framework.Assert.assertEquals(Assert.java:139)
	at org.joda.time.tz.TestBuilder.testForwardTransitions(TestBuilder.java:234)
	at org.joda.time.tz.TestBuilder.testForwardTransitions(TestBuilder.java:217)

testReverseTransitions(org.joda.time.tz.TestBuilder)  Time elapsed: 0.007 sec  <<< FAILURE!
junit.framework.AssertionFailedError: expected:<972802799999> but was:<954669599999>
	at junit.framework.Assert.fail(Assert.java:47)
	at junit.framework.Assert.failNotEquals(Assert.java:280)
	at junit.framework.Assert.assertEquals(Assert.java:64)
	at junit.framework.Assert.assertEquals(Assert.java:133)
	at junit.framework.Assert.assertEquals(Assert.java:139)
	at org.joda.time.tz.TestBuilder.testReverseTransitions(TestBuilder.java:270)
	at org.joda.time.tz.TestBuilder.testReverseTransitions(TestBuilder.java:255)

testCompile(org.joda.time.tz.TestCompiler)  Time elapsed: 0.024 sec  <<< FAILURE!
junit.framework.AssertionFailedError: expected:<-2717712000000> but was:<-2717640422000>
	at junit.framework.Assert.fail(Assert.java:47)
	at junit.framework.Assert.failNotEquals(Assert.java:280)
	at junit.framework.Assert.assertEquals(Assert.java:64)
	at junit.framework.Assert.assertEquals(Assert.java:133)
	at junit.framework.Assert.assertEquals(Assert.java:139)
	at org.joda.time.tz.TestBuilder.testForwardTransitions(TestBuilder.java:234)
	at org.joda.time.tz.TestCompiler.testCompile(TestCompiler.java:117)


Results :

Failed tests: 
  org.joda.time.TestDateMidnight_Properties#testPropertyAddLongMonthOfYear AssertionFailedError
  org.joda.time.TestDateMidnight_Properties#testPropertyAddMonthOfYear AssertionFailedError
  org.joda.time.TestDateMidnight_Properties#testPropertyAddWrapFieldMonthOfYear AssertionFailedError
  org.joda.time.TestDateTimeComparator#testHour AssertionFailedError HourM1a exp...
  org.joda.time.TestDateTimeComparator#testListHour AssertionFailedError ListHou...
  org.joda.time.TestDateTimeComparator#testListMinute AssertionFailedError ListM...
  org.joda.time.TestDateTimeComparator#testListSecond AssertionFailedError ListS...
  org.joda.time.TestDateTimeComparator#testListTime AssertionFailedError ListTim...
  org.joda.time.TestDateTimeComparator#testMinute AssertionFailedError MinuteM1a...
  org.joda.time.TestDateTimeComparator#testSecond AssertionFailedError SecondM1a...
  org.joda.time.TestDateTimeZoneCutover#testPeriod ComparisonFailure expected:<P...
  org.joda.time.TestDateTimeZoneCutover#testPlusMillisInDstChange ComparisonFailure
  org.joda.time.TestDateTimeZoneCutover#testPlusMinutesInDstChange ComparisonFailure
  org.joda.time.TestDateTimeZoneCutover#testPlusSecondsInDstChange ComparisonFailure
  org.joda.time.TestDateTimeZoneCutover#testWithHourOfDayInDstChange ComparisonFailure
  org.joda.time.TestDateTimeZoneCutover#testWithMillisOfSecondInDstChange_NewYork_summer ComparisonFailure
  org.joda.time.TestDateTimeZoneCutover#testWithMillisOfSecondInDstChange_NewYork_winter ComparisonFailure
  org.joda.time.TestDateTimeZoneCutover#testWithMillisOfSecondInDstChange_Paris_summer ComparisonFailure
  org.joda.time.TestDateTimeZoneCutover#testWithMillisOfSecondInDstChange_Paris_winter ComparisonFailure
  org.joda.time.TestDateTimeZoneCutover#testWithMinuteOfHourInDstChange ComparisonFailure
  org.joda.time.TestDateTimeZoneCutover#testWithSecondOfMinuteInDstChange ComparisonFailure
  org.joda.time.TestDateTime_Constructors#testConstructor_ObjectString3 AssertionFailedError
  org.joda.time.TestDateTime_Constructors#testConstructor_ObjectString4 AssertionFailedError
  org.joda.time.TestDateTime_Constructors#testParse_formatter AssertionFailedError
  org.joda.time.TestDateTime_Constructors#testParse_noFormatter AssertionFailedError
  org.joda.time.TestDateTime_Properties#testPropertyAddMonthOfYear ComparisonFailure
  org.joda.time.TestDateTime_Properties#testPropertyAddWrapFieldMonthOfYear ComparisonFailure
  org.joda.time.TestInstant_Constructors#testParse_formatter AssertionFailedError
  org.joda.time.TestInstant_Constructors#testParse_noFormatter AssertionFailedError
  org.joda.time.TestInterval_Basics#testToString_reparse AssertionFailedError ex...
  org.joda.time.TestInterval_Constructors#testConstructor_Object1 AssertionFailedError
  org.joda.time.TestInterval_Constructors#testParse_noFormatter AssertionFailedError
  org.joda.time.TestLocalDateTime_Constructors#testConstructor_ObjectString3 AssertionFailedError
  org.joda.time.TestLocalDateTime_Constructors#testConstructor_ObjectString4 AssertionFailedError
  org.joda.time.TestLocalDateTime_Constructors#testConstructor_Object_ChronologyMoscow AssertionFailedError
  org.joda.time.TestLocalDateTime_Constructors#testConstructor_Object_ChronologyMoscowBadDateTime AssertionFailedError
  org.joda.time.TestLocalDateTime_Constructors#testConstructor_Object_DateTimeZoneMoscow AssertionFailedError
  org.joda.time.TestLocalDateTime_Constructors#testConstructor_Object_DateTimeZoneMoscowBadDateTime AssertionFailedError
  org.joda.time.TestLocalDateTime_Constructors#testParse_formatter AssertionFailedError
  org.joda.time.TestLocalDateTime_Constructors#testParse_noFormatter AssertionFailedError
  org.joda.time.TestMutableDateTime_Adds#testAddMonths_int1 ComparisonFailure ex...
  org.joda.time.TestMutableDateTime_Constructors#testParse_formatter AssertionFailedError
  org.joda.time.TestMutableDateTime_Constructors#testParse_noFormatter AssertionFailedError
  org.joda.time.TestMutableDateTime_Properties#testPropertyAddMonthOfYear ComparisonFailure
  org.joda.time.TestMutableDateTime_Properties#testPropertyAddWrapFieldMonthOfYear ComparisonFailure
  org.joda.time.TestMutableInterval_Constructors#testConstructor_Object1 AssertionFailedError
  org.joda.time.TestMutableInterval_Constructors#testParse_noFormatter AssertionFailedError
  org.joda.time.TestMutablePeriod_Updates#testAdd_RInterval2 AssertionFailedError
  org.joda.time.TestPartial_Basics#testToString4 ComparisonFailure expected:<[da...
  org.joda.time.TestPartial_Constructors#testConstructorEx7_TypeArray_intArray_inOrder AssertionFailedError
  org.joda.time.TestPartial_Constructors#testConstructorEx9_TypeArray_intArray AssertionFailedError
  org.joda.time.TestStringConvert#testDateTime AssertionFailedError expected:<20...
  org.joda.time.TestStringConvert#testLocalDateTime AssertionFailedError expecte...
  org.joda.time.TestStringConvert#testMutableDateTime AssertionFailedError expec...
  org.joda.time.chrono.TestGJChronology#testParseEquivalence AssertionFailedError
  org.joda.time.chrono.TestISOChronology#testMaxYear AssertionFailedError expect...
  org.joda.time.chrono.TestISOChronology#testMinYear AssertionFailedError expect...
  org.joda.time.convert.TestStringConverter#testGetDateTime AssertionFailedError
  org.joda.time.convert.TestStringConverter#testGetDateTime1 AssertionFailedError
  org.joda.time.convert.TestStringConverter#testGetDateTime2 AssertionFailedError
  org.joda.time.convert.TestStringConverter#testGetDateTime3 AssertionFailedError
  org.joda.time.convert.TestStringConverter#testGetDateTime4 AssertionFailedError
  org.joda.time.convert.TestStringConverter#testGetInstantMillis_Object AssertionFailedError
  org.joda.time.convert.TestStringConverter#testGetInstantMillis_Object_Zone AssertionFailedError
  org.joda.time.format.TestDateTimeFormat#testFormatParse_textMonthApr_Korean AssertionFailedError
  org.joda.time.format.TestDateTimeFormat#testFormatParse_textMonthAtEnd_France AssertionFailedError
  org.joda.time.format.TestDateTimeFormat#testFormatParse_textMonthAtEnd_France_withSpecifiedDefault AssertionFailedError
  org.joda.time.format.TestDateTimeFormatStyle#testForStyle_shortDateTime AssertionFailedError
  org.joda.time.format.TestDateTimeFormatter#testParseDateTime_chrono AssertionFailedError
  org.joda.time.format.TestDateTimeFormatter#testParseDateTime_offsetParsed AssertionFailedError
  org.joda.time.format.TestDateTimeFormatter#testParseDateTime_simple AssertionFailedError
  org.joda.time.format.TestDateTimeFormatter#testParseDateTime_simple_precedence AssertionFailedError
  org.joda.time.format.TestDateTimeFormatter#testParseDateTime_zone AssertionFailedError
  org.joda.time.format.TestDateTimeFormatter#testParseDateTime_zone2 AssertionFailedError
  org.joda.time.format.TestDateTimeFormatter#testParseDateTime_zone3 AssertionFailedError
  org.joda.time.format.TestDateTimeFormatter#testParseInto_simple_precedence AssertionFailedError
  org.joda.time.format.TestDateTimeFormatter#testParseLocalDateTime_simple AssertionFailedError
  org.joda.time.format.TestDateTimeFormatter#testParseLocalDate_weekyear_month_week_2010 AssertionFailedError
  org.joda.time.format.TestDateTimeFormatter#testParseLocalDate_weekyear_month_week_2011 AssertionFailedError
  org.joda.time.format.TestDateTimeFormatter#testParseLocalDate_weekyear_month_week_2012 AssertionFailedError
  org.joda.time.format.TestDateTimeFormatter#testParseLocalDate_year_month_week_2010 AssertionFailedError
  org.joda.time.format.TestDateTimeFormatter#testParseLocalDate_year_month_week_2011 AssertionFailedError
  org.joda.time.format.TestDateTimeFormatter#testParseLocalDate_year_month_week_2012 AssertionFailedError
  org.joda.time.format.TestDateTimeFormatter#testParseLocalDate_year_month_week_2013 AssertionFailedError
  org.joda.time.format.TestDateTimeFormatter#testParseLocalDate_year_month_week_2014 AssertionFailedError
  org.joda.time.format.TestDateTimeFormatter#testParseLocalDate_year_month_week_2015 AssertionFailedError
  org.joda.time.format.TestDateTimeFormatter#testParseLocalDate_year_month_week_2016 AssertionFailedError
  org.joda.time.format.TestDateTimeFormatter#testParseLocalTime_simple AssertionFailedError
  org.joda.time.format.TestDateTimeFormatter#testParseMutableDateTime_chrono AssertionFailedError
  org.joda.time.format.TestDateTimeFormatter#testParseMutableDateTime_offsetParsed AssertionFailedError
  org.joda.time.format.TestDateTimeFormatter#testParseMutableDateTime_simple AssertionFailedError
  org.joda.time.format.TestDateTimeFormatter#testParseMutableDateTime_simple_precedence AssertionFailedError
  org.joda.time.format.TestDateTimeFormatter#testParseMutableDateTime_zone AssertionFailedError
  org.joda.time.format.TestDateTimeFormatter#testParseMutableDateTime_zone2 AssertionFailedError
  org.joda.time.format.TestDateTimeFormatter#testParseMutableDateTime_zone3 AssertionFailedError
  org.joda.time.format.TestDateTimeFormatterBuilder#test_localParseWrongOffsetAndZone AssertionFailedError
  org.joda.time.format.TestDateTimeFormatterBuilder#test_localPrintParseOffset AssertionFailedError
  org.joda.time.format.TestDateTimeFormatterBuilder#test_localPrintParseOffsetAndZone AssertionFailedError
  org.joda.time.format.TestDateTimeFormatterBuilder#test_localPrintParseZoneTokyo AssertionFailedError
  org.joda.time.format.TestDateTimeFormatterBuilder#test_parseWrongOffset AssertionFailedError
  org.joda.time.format.TestDateTimeFormatterBuilder#test_parseWrongOffsetAndZone AssertionFailedError
  org.joda.time.format.TestDateTimeFormatterBuilder#test_printParseLongNameWithLookup AssertionFailedError
  org.joda.time.format.TestDateTimeFormatterBuilder#test_printParseOffset AssertionFailedError
  org.joda.time.format.TestDateTimeFormatterBuilder#test_printParseOffsetAndZone AssertionFailedError
  org.joda.time.format.TestDateTimeFormatterBuilder#test_printParseShortNameWithAutoLookup AssertionFailedError
  org.joda.time.format.TestDateTimeFormatterBuilder#test_printParseShortNameWithLookup AssertionFailedError
  org.joda.time.format.TestDateTimeFormatterBuilder#test_printParseZoneBahiaBanderas AssertionFailedError
  org.joda.time.format.TestDateTimeFormatterBuilder#test_printParseZoneDawsonCreek AssertionFailedError
  org.joda.time.format.TestDateTimeFormatterBuilder#test_printParseZoneParis AssertionFailedError
  org.joda.time.format.TestDateTimeFormatterBuilder#test_printParseZoneTokyo AssertionFailedError
  org.joda.time.format.TestISODateTimeFormatParsing#test_basicDateTime AssertionFailedError
  org.joda.time.format.TestISODateTimeFormatParsing#test_basicDateTimeNoMillis AssertionFailedError
  org.joda.time.format.TestISODateTimeFormatParsing#test_dateTime AssertionFailedError
  org.joda.time.format.TestISODateTimeFormatParsing#test_dateTimeNoMillis AssertionFailedError
  org.joda.time.tz.TestBuilder#testForwardTransitions AssertionFailedError expec...
  org.joda.time.tz.TestBuilder#testReverseTransitions AssertionFailedError expec...
  org.joda.time.tz.TestBuilder#testSerialization AssertionFailedError expected:<...
  org.joda.time.tz.TestCompiler#testCompile AssertionFailedError expected:<-2717...
Tests in error: 
  org.joda.time.TestDateTimeUtils#testIsContiguous_RP IllegalArgumentException T...
  org.joda.time.TestDateTimeUtils#testIsContiguous_RP_GJChronology IllegalArgumentException
  org.joda.time.TestLocalDateTime_Basics#testCompareTo IllegalArgumentException ...
  org.joda.time.TestLocalDate_Basics#testCompareTo IllegalArgumentException Type...
  org.joda.time.TestMonthDay_Basics#testCompareTo IllegalArgumentException Types...
  org.joda.time.TestMonthDay_Constructors#testParse_noFormatter IllegalFieldValueException
  org.joda.time.TestPartial_Match#testIsMatch_Instant IllegalArgumentException T...
  org.joda.time.TestPartial_Match#testIsMatch_Partial IllegalArgumentException T...
  org.joda.time.TestPeriod_Constructors#testFactoryFieldDifference1 IllegalArgumentException
  org.joda.time.TestPeriod_Constructors#testFactoryFieldDifference4 IllegalArgumentException
  org.joda.time.TestPeriod_Constructors#testFactoryFieldDifference5 IllegalArgumentException
  org.joda.time.TestStringConvert#testMonthDay_leapDay IllegalFieldValueException
  org.joda.time.TestYearMonthDay_Basics#testCompareTo IllegalArgumentException T...
  org.joda.time.format.TestDateTimeFormatter#testParseLocalDateTime_monthDay_feb29 IllegalFieldValueException
  org.joda.time.format.TestDateTimeFormatter#testParseLocalDateTime_monthDay_withDefaultYear_feb29 IllegalFieldValueException
  org.joda.time.format.TestDateTimeFormatter#testParseLocalDate_monthDay_feb29 IllegalFieldValueException
  org.joda.time.format.TestDateTimeFormatter#testParseLocalDate_monthDay_withDefaultYear_feb29 IllegalFieldValueException
  org.joda.time.format.TestISODateTimeFormat#testFormat_date_partial IllegalArgumentException
  org.joda.time.format.TestISODateTimeFormat_Fields#testForFields_calBased_MD IllegalArgumentException
  org.joda.time.format.TestISODateTimeFormat_Fields#testForFields_calBased_YMD IllegalArgumentException
  org.joda.time.format.TestISODateTimeFormat_Fields#testForFields_calBased_YMD_duplicates IllegalArgumentException
  org.joda.time.format.TestISODateTimeFormat_Fields#testForFields_calBased_YMD_unmodifiable IllegalArgumentException
  org.joda.time.format.TestISODateTimeFormat_Fields#testForFields_datetime_YMDH IllegalArgumentException

Tests run: 4157, Failures: 118, Errors: 23, Skipped: 0

[INFO] ------------------------------------------------------------------------
[INFO] BUILD FAILURE
[INFO] ------------------------------------------------------------------------
[INFO] Total time: 16.011s
[INFO] Finished at: Thu Aug 06 01:09:06 BST 2015
[INFO] Final Memory: 8M/213M
[INFO] ------------------------------------------------------------------------
[ERROR] Failed to execute goal org.apache.maven.plugins:maven-surefire-plugin:2.18.1:test (default-test) on project joda-time: There are test failures.
[ERROR] 
[ERROR] Please refer to /home/perham/Study/LittleDarwin/Cases/joda-time-2.8.1/target/surefire-reports for the individual test results.
[ERROR] -> [Help 1]
[ERROR] 
[ERROR] To see the full stack trace of the errors, re-run Maven with the -e switch.
[ERROR] Re-run Maven using the -X switch to enable full debug logging.
[ERROR] 
[ERROR] For more information about the errors and possible solutions, please read the following articles:
[ERROR] [Help 1] http://cwiki.apache.org/confluence/display/MAVEN/MojoFailureException
