[INFO] Scanning for projects...
[INFO]                                                                         
[INFO] ------------------------------------------------------------------------
[INFO] Building Joda-Time 2.8.1
[INFO] ------------------------------------------------------------------------
[INFO] 
[INFO] --- maven-resources-plugin:2.7:resources (default-resources) @ joda-time ---
[INFO] Using 'UTF-8' encoding to copy filtered resources.
[INFO] Copying 2 resources to META-INF
[INFO] Copying 10 resources
[INFO] 
[INFO] --- maven-compiler-plugin:3.3:compile (default-compile) @ joda-time ---
[INFO] Changes detected - recompiling the module!
[INFO] Compiling 166 source files to /home/perham/Study/LittleDarwin/Cases/joda-time-2.8.1/target/classes
[INFO] 
[INFO] --- exec-maven-plugin:1.4.0:java (compile-tzdb) @ joda-time ---
Writing zoneinfo files
Writing ZoneInfoMap
[INFO] 
[INFO] --- maven-resources-plugin:2.7:testResources (default-testResources) @ joda-time ---
[INFO] Using 'UTF-8' encoding to copy filtered resources.
[INFO] Copying 34 resources
[INFO] 
[INFO] --- maven-compiler-plugin:3.3:testCompile (default-testCompile) @ joda-time ---
[INFO] Nothing to compile - all classes are up to date
[INFO] 
[INFO] --- maven-surefire-plugin:2.18.1:test (default-test) @ joda-time ---
[INFO] Surefire report directory: /home/perham/Study/LittleDarwin/Cases/joda-time-2.8.1/target/surefire-reports

-------------------------------------------------------
 T E S T S
-------------------------------------------------------
Running org.joda.time.TestAllPackages

TestBuddhistChronology.testCalendar

TestCopticChronology.testCalendar

TestEthiopicChronology.testCalendar

TestIslamicChronology.testCalendar

Testing Gregorian chronology over 1000 iterations
100% complete (i=1000)

Testing Julian chronology over 1000 iterations
100% complete (i=1000)
Writing zoneinfo files
Writing ZoneInfoMap
Tests run: 4157, Failures: 26, Errors: 6, Skipped: 0, Time elapsed: 3.931 sec <<< FAILURE! - in org.joda.time.TestAllPackages
testGet_DateTimeFieldType(org.joda.time.TestInstant_Basics)  Time elapsed: 0.004 sec  <<< FAILURE!
junit.framework.AssertionFailedError: expected:<2002> but was:<-2001>
	at junit.framework.Assert.fail(Assert.java:47)
	at junit.framework.Assert.failNotEquals(Assert.java:280)
	at junit.framework.Assert.assertEquals(Assert.java:64)
	at junit.framework.Assert.assertEquals(Assert.java:198)
	at junit.framework.Assert.assertEquals(Assert.java:204)
	at org.joda.time.TestInstant_Basics.testGet_DateTimeFieldType(TestInstant_Basics.java:120)

testGet_DateTimeField(org.joda.time.TestInstant_Basics)  Time elapsed: 0.001 sec  <<< FAILURE!
junit.framework.AssertionFailedError: expected:<2002> but was:<-2001>
	at junit.framework.Assert.fail(Assert.java:47)
	at junit.framework.Assert.failNotEquals(Assert.java:280)
	at junit.framework.Assert.assertEquals(Assert.java:64)
	at junit.framework.Assert.assertEquals(Assert.java:198)
	at junit.framework.Assert.assertEquals(Assert.java:204)
	at org.joda.time.TestInstant_Basics.testGet_DateTimeField(TestInstant_Basics.java:150)

testGetters(org.joda.time.TestDateTime_Basics)  Time elapsed: 0.001 sec  <<< FAILURE!
junit.framework.AssertionFailedError: expected:<2002> but was:<-2001>
	at junit.framework.Assert.fail(Assert.java:47)
	at junit.framework.Assert.failNotEquals(Assert.java:280)
	at junit.framework.Assert.assertEquals(Assert.java:64)
	at junit.framework.Assert.assertEquals(Assert.java:198)
	at junit.framework.Assert.assertEquals(Assert.java:204)
	at org.joda.time.TestDateTime_Basics.testGetters(TestDateTime_Basics.java:235)

testWithers(org.joda.time.TestDateTime_Basics)  Time elapsed: 0.001 sec  <<< ERROR!
org.joda.time.IllegalFieldValueException: Value -1841 for yearOfEra must be in the range [100,292279092]
	at org.joda.time.field.FieldUtils.verifyValueBounds(FieldUtils.java:234)
	at org.joda.time.field.OffsetDateTimeField.set(OffsetDateTimeField.java:153)
	at org.joda.time.field.RemainderDateTimeField.set(RemainderDateTimeField.java:168)
	at org.joda.time.field.DecoratedDateTimeField.set(DecoratedDateTimeField.java:83)
	at org.joda.time.field.OffsetDateTimeField.set(OffsetDateTimeField.java:154)
	at org.joda.time.chrono.GJChronology$CutoverField.set(GJChronology.java:727)
	at org.joda.time.chrono.ZonedChronology$ZonedDateTimeField.set(ZonedChronology.java:482)
	at org.joda.time.DateTime.withYearOfCentury(DateTime.java:1675)
	at org.joda.time.TestDateTime_Basics.testWithers(TestDateTime_Basics.java:261)

testGet_DateTimeFieldType(org.joda.time.TestDateTime_Basics)  Time elapsed: 0.001 sec  <<< FAILURE!
junit.framework.AssertionFailedError: expected:<2002> but was:<-2001>
	at junit.framework.Assert.fail(Assert.java:47)
	at junit.framework.Assert.failNotEquals(Assert.java:280)
	at junit.framework.Assert.assertEquals(Assert.java:64)
	at junit.framework.Assert.assertEquals(Assert.java:198)
	at junit.framework.Assert.assertEquals(Assert.java:204)
	at org.joda.time.TestDateTime_Basics.testGet_DateTimeFieldType(TestDateTime_Basics.java:172)

testGet_DateTimeField(org.joda.time.TestDateTime_Basics)  Time elapsed: 0 sec  <<< FAILURE!
junit.framework.AssertionFailedError: expected:<2002> but was:<-2001>
	at junit.framework.Assert.fail(Assert.java:47)
	at junit.framework.Assert.failNotEquals(Assert.java:280)
	at junit.framework.Assert.assertEquals(Assert.java:64)
	at junit.framework.Assert.assertEquals(Assert.java:198)
	at junit.framework.Assert.assertEquals(Assert.java:204)
	at org.joda.time.TestDateTime_Basics.testGet_DateTimeField(TestDateTime_Basics.java:142)

testPropertyGetYearOfEra(org.joda.time.TestDateTime_Properties)  Time elapsed: 0 sec  <<< FAILURE!
junit.framework.AssertionFailedError: expected:<2004> but was:<-2003>
	at junit.framework.Assert.fail(Assert.java:47)
	at junit.framework.Assert.failNotEquals(Assert.java:280)
	at junit.framework.Assert.assertEquals(Assert.java:64)
	at junit.framework.Assert.assertEquals(Assert.java:198)
	at junit.framework.Assert.assertEquals(Assert.java:204)
	at org.joda.time.TestDateTime_Properties.testPropertyGetYearOfEra(TestDateTime_Properties.java:137)

testGet_DateTimeFieldType(org.joda.time.TestMutableDateTime_Basics)  Time elapsed: 0.001 sec  <<< FAILURE!
junit.framework.AssertionFailedError: expected:<2002> but was:<-2001>
	at junit.framework.Assert.fail(Assert.java:47)
	at junit.framework.Assert.failNotEquals(Assert.java:280)
	at junit.framework.Assert.assertEquals(Assert.java:64)
	at junit.framework.Assert.assertEquals(Assert.java:198)
	at junit.framework.Assert.assertEquals(Assert.java:204)
	at org.joda.time.TestMutableDateTime_Basics.testGet_DateTimeFieldType(TestMutableDateTime_Basics.java:156)

testGet_DateTimeField(org.joda.time.TestMutableDateTime_Basics)  Time elapsed: 0.001 sec  <<< FAILURE!
junit.framework.AssertionFailedError: expected:<2002> but was:<-2001>
	at junit.framework.Assert.fail(Assert.java:47)
	at junit.framework.Assert.failNotEquals(Assert.java:280)
	at junit.framework.Assert.assertEquals(Assert.java:64)
	at junit.framework.Assert.assertEquals(Assert.java:198)
	at junit.framework.Assert.assertEquals(Assert.java:204)
	at org.joda.time.TestMutableDateTime_Basics.testGet_DateTimeField(TestMutableDateTime_Basics.java:126)

testGetMethods(org.joda.time.TestMutableDateTime_Basics)  Time elapsed: 0.001 sec  <<< FAILURE!
junit.framework.AssertionFailedError: expected:<2002> but was:<-2001>
	at junit.framework.Assert.fail(Assert.java:47)
	at junit.framework.Assert.failNotEquals(Assert.java:280)
	at junit.framework.Assert.assertEquals(Assert.java:64)
	at junit.framework.Assert.assertEquals(Assert.java:198)
	at junit.framework.Assert.assertEquals(Assert.java:204)
	at org.joda.time.TestMutableDateTime_Basics.testGetMethods(TestMutableDateTime_Basics.java:191)

testPropertyGetYearOfEra(org.joda.time.TestMutableDateTime_Properties)  Time elapsed: 0 sec  <<< FAILURE!
junit.framework.AssertionFailedError: expected:<2004> but was:<-2003>
	at junit.framework.Assert.fail(Assert.java:47)
	at junit.framework.Assert.failNotEquals(Assert.java:280)
	at junit.framework.Assert.assertEquals(Assert.java:64)
	at junit.framework.Assert.assertEquals(Assert.java:198)
	at junit.framework.Assert.assertEquals(Assert.java:204)
	at org.joda.time.TestMutableDateTime_Properties.testPropertyGetYearOfEra(TestMutableDateTime_Properties.java:124)

testGetters(org.joda.time.TestDateMidnight_Basics)  Time elapsed: 0.001 sec  <<< FAILURE!
junit.framework.AssertionFailedError: expected:<2002> but was:<-2001>
	at junit.framework.Assert.fail(Assert.java:47)
	at junit.framework.Assert.failNotEquals(Assert.java:280)
	at junit.framework.Assert.assertEquals(Assert.java:64)
	at junit.framework.Assert.assertEquals(Assert.java:198)
	at junit.framework.Assert.assertEquals(Assert.java:204)
	at org.joda.time.TestDateMidnight_Basics.testGetters(TestDateMidnight_Basics.java:223)

testWithers(org.joda.time.TestDateMidnight_Basics)  Time elapsed: 0.001 sec  <<< ERROR!
org.joda.time.IllegalFieldValueException: Value -1841 for yearOfEra must be in the range [100,292279092]
	at org.joda.time.field.FieldUtils.verifyValueBounds(FieldUtils.java:234)
	at org.joda.time.field.OffsetDateTimeField.set(OffsetDateTimeField.java:153)
	at org.joda.time.field.RemainderDateTimeField.set(RemainderDateTimeField.java:168)
	at org.joda.time.field.DecoratedDateTimeField.set(DecoratedDateTimeField.java:83)
	at org.joda.time.field.OffsetDateTimeField.set(OffsetDateTimeField.java:154)
	at org.joda.time.chrono.GJChronology$CutoverField.set(GJChronology.java:727)
	at org.joda.time.chrono.ZonedChronology$ZonedDateTimeField.set(ZonedChronology.java:482)
	at org.joda.time.DateMidnight.withYearOfCentury(DateMidnight.java:963)
	at org.joda.time.TestDateMidnight_Basics.testWithers(TestDateMidnight_Basics.java:249)

testGet_DateTimeFieldType(org.joda.time.TestDateMidnight_Basics)  Time elapsed: 0 sec  <<< FAILURE!
junit.framework.AssertionFailedError: expected:<2002> but was:<-2001>
	at junit.framework.Assert.fail(Assert.java:47)
	at junit.framework.Assert.failNotEquals(Assert.java:280)
	at junit.framework.Assert.assertEquals(Assert.java:64)
	at junit.framework.Assert.assertEquals(Assert.java:198)
	at junit.framework.Assert.assertEquals(Assert.java:204)
	at org.joda.time.TestDateMidnight_Basics.testGet_DateTimeFieldType(TestDateMidnight_Basics.java:187)

testGet_DateTimeField(org.joda.time.TestDateMidnight_Basics)  Time elapsed: 0 sec  <<< FAILURE!
junit.framework.AssertionFailedError: expected:<2002> but was:<-2001>
	at junit.framework.Assert.fail(Assert.java:47)
	at junit.framework.Assert.failNotEquals(Assert.java:280)
	at junit.framework.Assert.assertEquals(Assert.java:64)
	at junit.framework.Assert.assertEquals(Assert.java:198)
	at junit.framework.Assert.assertEquals(Assert.java:204)
	at org.joda.time.TestDateMidnight_Basics.testGet_DateTimeField(TestDateMidnight_Basics.java:157)

testPropertyGetYearOfEra(org.joda.time.TestDateMidnight_Properties)  Time elapsed: 0.001 sec  <<< FAILURE!
junit.framework.AssertionFailedError: expected:<2004> but was:<-2003>
	at junit.framework.Assert.fail(Assert.java:47)
	at junit.framework.Assert.failNotEquals(Assert.java:280)
	at junit.framework.Assert.assertEquals(Assert.java:64)
	at junit.framework.Assert.assertEquals(Assert.java:198)
	at junit.framework.Assert.assertEquals(Assert.java:204)
	at org.joda.time.TestDateMidnight_Properties.testPropertyGetYearOfEra(TestDateMidnight_Properties.java:133)

testGetters(org.joda.time.TestLocalDateTime_Basics)  Time elapsed: 0 sec  <<< FAILURE!
junit.framework.AssertionFailedError: expected:<70> but was:<31>
	at junit.framework.Assert.fail(Assert.java:47)
	at junit.framework.Assert.failNotEquals(Assert.java:280)
	at junit.framework.Assert.assertEquals(Assert.java:64)
	at junit.framework.Assert.assertEquals(Assert.java:198)
	at junit.framework.Assert.assertEquals(Assert.java:204)
	at org.joda.time.TestLocalDateTime_Basics.testGetters(TestLocalDateTime_Basics.java:725)

testWithers(org.joda.time.TestLocalDateTime_Basics)  Time elapsed: 0 sec  <<< ERROR!
org.joda.time.IllegalFieldValueException: Value -1841 for yearOfEra must be in the range [100,292279092]
	at org.joda.time.field.FieldUtils.verifyValueBounds(FieldUtils.java:234)
	at org.joda.time.field.OffsetDateTimeField.set(OffsetDateTimeField.java:153)
	at org.joda.time.field.RemainderDateTimeField.set(RemainderDateTimeField.java:168)
	at org.joda.time.field.DecoratedDateTimeField.set(DecoratedDateTimeField.java:83)
	at org.joda.time.field.OffsetDateTimeField.set(OffsetDateTimeField.java:154)
	at org.joda.time.chrono.GJChronology$CutoverField.set(GJChronology.java:727)
	at org.joda.time.LocalDateTime.withYearOfCentury(LocalDateTime.java:1738)
	at org.joda.time.TestLocalDateTime_Basics.testWithers(TestLocalDateTime_Basics.java:746)

testGetters(org.joda.time.TestLocalDate_Basics)  Time elapsed: 0 sec  <<< FAILURE!
junit.framework.AssertionFailedError: expected:<70> but was:<31>
	at junit.framework.Assert.fail(Assert.java:47)
	at junit.framework.Assert.failNotEquals(Assert.java:280)
	at junit.framework.Assert.assertEquals(Assert.java:64)
	at junit.framework.Assert.assertEquals(Assert.java:198)
	at junit.framework.Assert.assertEquals(Assert.java:204)
	at org.joda.time.TestLocalDate_Basics.testGetters(TestLocalDate_Basics.java:632)

testWithers(org.joda.time.TestLocalDate_Basics)  Time elapsed: 0.001 sec  <<< ERROR!
org.joda.time.IllegalFieldValueException: Value -1841 for yearOfEra must be in the range [100,292279092]
	at org.joda.time.field.FieldUtils.verifyValueBounds(FieldUtils.java:234)
	at org.joda.time.field.OffsetDateTimeField.set(OffsetDateTimeField.java:153)
	at org.joda.time.field.RemainderDateTimeField.set(RemainderDateTimeField.java:168)
	at org.joda.time.field.DecoratedDateTimeField.set(DecoratedDateTimeField.java:83)
	at org.joda.time.field.OffsetDateTimeField.set(OffsetDateTimeField.java:154)
	at org.joda.time.chrono.GJChronology$CutoverField.set(GJChronology.java:727)
	at org.joda.time.LocalDate.withYearOfCentury(LocalDate.java:1605)
	at org.joda.time.TestLocalDate_Basics.testWithers(TestLocalDate_Basics.java:648)

testSampleDate(org.joda.time.chrono.TestCopticChronology)  Time elapsed: 0 sec  <<< FAILURE!
junit.framework.AssertionFailedError: expected:<18> but was:<-17>
	at junit.framework.Assert.fail(Assert.java:47)
	at junit.framework.Assert.failNotEquals(Assert.java:280)
	at junit.framework.Assert.assertEquals(Assert.java:64)
	at junit.framework.Assert.assertEquals(Assert.java:198)
	at junit.framework.Assert.assertEquals(Assert.java:204)
	at org.joda.time.chrono.TestCopticChronology.testSampleDate(TestCopticChronology.java:403)

testSampleDateWithZone(org.joda.time.chrono.TestCopticChronology)  Time elapsed: 0.001 sec  <<< FAILURE!
junit.framework.AssertionFailedError: expected:<1720> but was:<-1719>
	at junit.framework.Assert.fail(Assert.java:47)
	at junit.framework.Assert.failNotEquals(Assert.java:280)
	at junit.framework.Assert.assertEquals(Assert.java:64)
	at junit.framework.Assert.assertEquals(Assert.java:198)
	at junit.framework.Assert.assertEquals(Assert.java:204)
	at org.joda.time.chrono.TestCopticChronology.testSampleDateWithZone(TestCopticChronology.java:469)

testCalendar(org.joda.time.chrono.TestCopticChronology)  Time elapsed: 0 sec  <<< FAILURE!
junit.framework.AssertionFailedError: expected:<1> but was:<0>
	at junit.framework.Assert.fail(Assert.java:47)
	at junit.framework.Assert.failNotEquals(Assert.java:280)
	at junit.framework.Assert.assertEquals(Assert.java:64)
	at junit.framework.Assert.assertEquals(Assert.java:198)
	at junit.framework.Assert.assertEquals(Assert.java:204)
	at org.joda.time.chrono.TestCopticChronology.testCalendar(TestCopticChronology.java:355)

testSampleDate(org.joda.time.chrono.TestEthiopicChronology)  Time elapsed: 0.001 sec  <<< FAILURE!
junit.framework.AssertionFailedError: expected:<20> but was:<-19>
	at junit.framework.Assert.fail(Assert.java:47)
	at junit.framework.Assert.failNotEquals(Assert.java:280)
	at junit.framework.Assert.assertEquals(Assert.java:64)
	at junit.framework.Assert.assertEquals(Assert.java:198)
	at junit.framework.Assert.assertEquals(Assert.java:204)
	at org.joda.time.chrono.TestEthiopicChronology.testSampleDate(TestEthiopicChronology.java:403)

testSampleDateWithZone(org.joda.time.chrono.TestEthiopicChronology)  Time elapsed: 0 sec  <<< FAILURE!
junit.framework.AssertionFailedError: expected:<1996> but was:<-1995>
	at junit.framework.Assert.fail(Assert.java:47)
	at junit.framework.Assert.failNotEquals(Assert.java:280)
	at junit.framework.Assert.assertEquals(Assert.java:64)
	at junit.framework.Assert.assertEquals(Assert.java:198)
	at junit.framework.Assert.assertEquals(Assert.java:204)
	at org.joda.time.chrono.TestEthiopicChronology.testSampleDateWithZone(TestEthiopicChronology.java:469)

testCalendar(org.joda.time.chrono.TestEthiopicChronology)  Time elapsed: 0.001 sec  <<< FAILURE!
junit.framework.AssertionFailedError: expected:<1> but was:<0>
	at junit.framework.Assert.fail(Assert.java:47)
	at junit.framework.Assert.failNotEquals(Assert.java:280)
	at junit.framework.Assert.assertEquals(Assert.java:64)
	at junit.framework.Assert.assertEquals(Assert.java:198)
	at junit.framework.Assert.assertEquals(Assert.java:204)
	at org.joda.time.chrono.TestEthiopicChronology.testCalendar(TestEthiopicChronology.java:355)

testCalendar(org.joda.time.chrono.TestIslamicChronology)  Time elapsed: 0.001 sec  <<< FAILURE!
junit.framework.AssertionFailedError: expected:<1> but was:<0>
	at junit.framework.Assert.fail(Assert.java:47)
	at junit.framework.Assert.failNotEquals(Assert.java:280)
	at junit.framework.Assert.assertEquals(Assert.java:64)
	at junit.framework.Assert.assertEquals(Assert.java:198)
	at junit.framework.Assert.assertEquals(Assert.java:204)
	at org.joda.time.chrono.TestIslamicChronology.testCalendar(TestIslamicChronology.java:365)

testSampleDate1(org.joda.time.chrono.TestIslamicChronology)  Time elapsed: 0.001 sec  <<< FAILURE!
junit.framework.AssertionFailedError: expected:<14> but was:<-13>
	at junit.framework.Assert.fail(Assert.java:47)
	at junit.framework.Assert.failNotEquals(Assert.java:280)
	at junit.framework.Assert.assertEquals(Assert.java:64)
	at junit.framework.Assert.assertEquals(Assert.java:198)
	at junit.framework.Assert.assertEquals(Assert.java:204)
	at org.joda.time.chrono.TestIslamicChronology.testSampleDate1(TestIslamicChronology.java:417)

testSampleDate2(org.joda.time.chrono.TestIslamicChronology)  Time elapsed: 0.001 sec  <<< FAILURE!
junit.framework.AssertionFailedError: expected:<15> but was:<-14>
	at junit.framework.Assert.fail(Assert.java:47)
	at junit.framework.Assert.failNotEquals(Assert.java:280)
	at junit.framework.Assert.assertEquals(Assert.java:64)
	at junit.framework.Assert.assertEquals(Assert.java:198)
	at junit.framework.Assert.assertEquals(Assert.java:204)
	at org.joda.time.chrono.TestIslamicChronology.testSampleDate2(TestIslamicChronology.java:483)

testParseLocalDate_yearOfEra(org.joda.time.format.TestDateTimeFormatter)  Time elapsed: 0.001 sec  <<< ERROR!
org.joda.time.IllegalFieldValueException: Cannot parse "2005-10 AD": Value 2005 for yearOfEra is not supported
	at org.joda.time.chrono.GJChronology$CutoverField.set(GJChronology.java:748)
	at org.joda.time.format.DateTimeParserBucket$SavedField.set(DateTimeParserBucket.java:568)
	at org.joda.time.format.DateTimeParserBucket.computeMillis(DateTimeParserBucket.java:447)
	at org.joda.time.format.DateTimeParserBucket.computeMillis(DateTimeParserBucket.java:411)
	at org.joda.time.format.DateTimeFormatter.parseLocalDateTime(DateTimeFormatter.java:841)
	at org.joda.time.format.DateTimeFormatter.parseLocalDate(DateTimeFormatter.java:798)
	at org.joda.time.format.TestDateTimeFormatter.testParseLocalDate_yearOfEra(TestDateTimeFormatter.java:384)

testFormat_yearOfEra(org.joda.time.format.TestDateTimeFormat)  Time elapsed: 0.001 sec  <<< FAILURE!
junit.framework.ComparisonFailure: 2004-06-09T10:20:30.040Z expected:<[2004]> but was:<[-2003]>
	at junit.framework.Assert.assertEquals(Assert.java:81)
	at org.joda.time.format.TestDateTimeFormat.testFormat_yearOfEra(TestDateTimeFormat.java:131)

testFormat_yearOfEraParse(org.joda.time.format.TestDateTimeFormat)  Time elapsed: 0 sec  <<< ERROR!
org.joda.time.IllegalFieldValueException: Cannot parse "2005-10 AD": Value 2005 for yearOfEra is not supported
	at org.joda.time.chrono.GJChronology$CutoverField.set(GJChronology.java:748)
	at org.joda.time.format.DateTimeParserBucket$SavedField.set(DateTimeParserBucket.java:568)
	at org.joda.time.format.DateTimeParserBucket.computeMillis(DateTimeParserBucket.java:447)
	at org.joda.time.format.DateTimeParserBucket.computeMillis(DateTimeParserBucket.java:411)
	at org.joda.time.format.DateTimeFormatter.parseDateTime(DateTimeFormatter.java:882)
	at org.joda.time.format.TestDateTimeFormat.testFormat_yearOfEraParse(TestDateTimeFormat.java:200)


Results :

Failed tests: 
  org.joda.time.TestDateMidnight_Basics#testGet_DateTimeField AssertionFailedError
  org.joda.time.TestDateMidnight_Basics#testGet_DateTimeFieldType AssertionFailedError
  org.joda.time.TestDateMidnight_Basics#testGetters AssertionFailedError expecte...
  org.joda.time.TestDateMidnight_Properties#testPropertyGetYearOfEra AssertionFailedError
  org.joda.time.TestDateTime_Basics#testGet_DateTimeField AssertionFailedError e...
  org.joda.time.TestDateTime_Basics#testGet_DateTimeFieldType AssertionFailedError
  org.joda.time.TestDateTime_Basics#testGetters AssertionFailedError expected:<2...
  org.joda.time.TestDateTime_Properties#testPropertyGetYearOfEra AssertionFailedError
  org.joda.time.TestInstant_Basics#testGet_DateTimeField AssertionFailedError ex...
  org.joda.time.TestInstant_Basics#testGet_DateTimeFieldType AssertionFailedError
  org.joda.time.TestLocalDateTime_Basics#testGetters AssertionFailedError expect...
  org.joda.time.TestLocalDate_Basics#testGetters AssertionFailedError expected:<...
  org.joda.time.TestMutableDateTime_Basics#testGetMethods AssertionFailedError e...
  org.joda.time.TestMutableDateTime_Basics#testGet_DateTimeField AssertionFailedError
  org.joda.time.TestMutableDateTime_Basics#testGet_DateTimeFieldType AssertionFailedError
  org.joda.time.TestMutableDateTime_Properties#testPropertyGetYearOfEra AssertionFailedError
  org.joda.time.chrono.TestCopticChronology#testCalendar AssertionFailedError ex...
  org.joda.time.chrono.TestCopticChronology#testSampleDate AssertionFailedError ...
  org.joda.time.chrono.TestCopticChronology#testSampleDateWithZone AssertionFailedError
  org.joda.time.chrono.TestEthiopicChronology#testCalendar AssertionFailedError ...
  org.joda.time.chrono.TestEthiopicChronology#testSampleDate AssertionFailedError
  org.joda.time.chrono.TestEthiopicChronology#testSampleDateWithZone AssertionFailedError
  org.joda.time.chrono.TestIslamicChronology#testCalendar AssertionFailedError e...
  org.joda.time.chrono.TestIslamicChronology#testSampleDate1 AssertionFailedError
  org.joda.time.chrono.TestIslamicChronology#testSampleDate2 AssertionFailedError
  org.joda.time.format.TestDateTimeFormat#testFormat_yearOfEra ComparisonFailure
Tests in error: 
  org.joda.time.TestDateMidnight_Basics#testWithers IllegalFieldValueException V...
  org.joda.time.TestDateTime_Basics#testWithers IllegalFieldValueException Value...
  org.joda.time.TestLocalDateTime_Basics#testWithers IllegalFieldValueException ...
  org.joda.time.TestLocalDate_Basics#testWithers IllegalFieldValueException Valu...
  org.joda.time.format.TestDateTimeFormat#testFormat_yearOfEraParse IllegalFieldValueException
  org.joda.time.format.TestDateTimeFormatter#testParseLocalDate_yearOfEra IllegalFieldValueException

Tests run: 4157, Failures: 26, Errors: 6, Skipped: 0

[INFO] ------------------------------------------------------------------------
[INFO] BUILD FAILURE
[INFO] ------------------------------------------------------------------------
[INFO] Total time: 13.972s
[INFO] Finished at: Thu Aug 06 01:03:22 BST 2015
[INFO] Final Memory: 9M/213M
[INFO] ------------------------------------------------------------------------
[ERROR] Failed to execute goal org.apache.maven.plugins:maven-surefire-plugin:2.18.1:test (default-test) on project joda-time: There are test failures.
[ERROR] 
[ERROR] Please refer to /home/perham/Study/LittleDarwin/Cases/joda-time-2.8.1/target/surefire-reports for the individual test results.
[ERROR] -> [Help 1]
[ERROR] 
[ERROR] To see the full stack trace of the errors, re-run Maven with the -e switch.
[ERROR] Re-run Maven using the -X switch to enable full debug logging.
[ERROR] 
[ERROR] For more information about the errors and possible solutions, please read the following articles:
[ERROR] [Help 1] http://cwiki.apache.org/confluence/display/MAVEN/MojoFailureException
