[INFO] Scanning for projects...
[INFO]                                                                         
[INFO] ------------------------------------------------------------------------
[INFO] Building Joda-Time 2.8.1
[INFO] ------------------------------------------------------------------------
[INFO] 
[INFO] --- maven-resources-plugin:2.7:resources (default-resources) @ joda-time ---
[INFO] Using 'UTF-8' encoding to copy filtered resources.
[INFO] Copying 2 resources to META-INF
[INFO] Copying 10 resources
[INFO] 
[INFO] --- maven-compiler-plugin:3.3:compile (default-compile) @ joda-time ---
[INFO] Changes detected - recompiling the module!
[INFO] Compiling 166 source files to /home/perham/Study/LittleDarwin/Cases/joda-time-2.8.1/target/classes
[INFO] 
[INFO] --- exec-maven-plugin:1.4.0:java (compile-tzdb) @ joda-time ---
Writing zoneinfo files
Writing ZoneInfoMap
[INFO] 
[INFO] --- maven-resources-plugin:2.7:testResources (default-testResources) @ joda-time ---
[INFO] Using 'UTF-8' encoding to copy filtered resources.
[INFO] Copying 34 resources
[INFO] 
[INFO] --- maven-compiler-plugin:3.3:testCompile (default-testCompile) @ joda-time ---
[INFO] Nothing to compile - all classes are up to date
[INFO] 
[INFO] --- maven-surefire-plugin:2.18.1:test (default-test) @ joda-time ---
[INFO] Surefire report directory: /home/perham/Study/LittleDarwin/Cases/joda-time-2.8.1/target/surefire-reports

-------------------------------------------------------
 T E S T S
-------------------------------------------------------
Running org.joda.time.TestAllPackages

TestBuddhistChronology.testCalendar

TestCopticChronology.testCalendar

TestEthiopicChronology.testCalendar

TestIslamicChronology.testCalendar

Testing Gregorian chronology over 1000 iterations
100% complete (i=1000)

Testing Julian chronology over 1000 iterations
100% complete (i=1000)
Writing zoneinfo files
Writing ZoneInfoMap
Tests run: 4157, Failures: 29, Errors: 27, Skipped: 0, Time elapsed: 5.261 sec <<< FAILURE! - in org.joda.time.TestAllPackages
testToString_String_Locale(org.joda.time.TestDateTime_Basics)  Time elapsed: 0.013 sec  <<< FAILURE!
junit.framework.ComparisonFailure: expected:<[dim.] 9/6> but was:<[Sun] 9/6>
	at junit.framework.Assert.assertEquals(Assert.java:81)
	at junit.framework.Assert.assertEquals(Assert.java:87)
	at org.joda.time.TestDateTime_Basics.testToString_String_Locale(TestDateTime_Basics.java:519)

testPropertyGetEra(org.joda.time.TestDateTime_Properties)  Time elapsed: 0.003 sec  <<< ERROR!
java.lang.NullPointerException
	at java.util.concurrent.ConcurrentHashMap.hash(ConcurrentHashMap.java:333)
	at java.util.concurrent.ConcurrentHashMap.get(ConcurrentHashMap.java:988)
	at org.joda.time.chrono.GJLocaleSymbols.forLocale(GJLocaleSymbols.java:19)
	at org.joda.time.chrono.GJEraDateTimeField.getAsText(GJEraDateTimeField.java:69)
	at org.joda.time.field.BaseDateTimeField.getAsText(BaseDateTimeField.java:94)
	at org.joda.time.chrono.ZonedChronology$ZonedDateTimeField.getAsText(ZonedChronology.java:428)
	at org.joda.time.field.AbstractReadableInstantFieldProperty.getAsText(AbstractReadableInstantFieldProperty.java:167)
	at org.joda.time.field.AbstractReadableInstantFieldProperty.getAsText(AbstractReadableInstantFieldProperty.java:151)
	at org.joda.time.TestDateTime_Properties.testPropertyGetEra(TestDateTime_Properties.java:114)

testPropertyGetDayOfWeek(org.joda.time.TestDateTime_Properties)  Time elapsed: 0.001 sec  <<< ERROR!
java.lang.NullPointerException
	at java.util.concurrent.ConcurrentHashMap.hash(ConcurrentHashMap.java:333)
	at java.util.concurrent.ConcurrentHashMap.get(ConcurrentHashMap.java:988)
	at org.joda.time.chrono.GJLocaleSymbols.forLocale(GJLocaleSymbols.java:19)
	at org.joda.time.chrono.GJDayOfWeekDateTimeField.getAsText(GJDayOfWeekDateTimeField.java:68)
	at org.joda.time.field.BaseDateTimeField.getAsText(BaseDateTimeField.java:94)
	at org.joda.time.chrono.ZonedChronology$ZonedDateTimeField.getAsText(ZonedChronology.java:428)
	at org.joda.time.field.AbstractReadableInstantFieldProperty.getAsText(AbstractReadableInstantFieldProperty.java:167)
	at org.joda.time.field.AbstractReadableInstantFieldProperty.getAsText(AbstractReadableInstantFieldProperty.java:151)
	at org.joda.time.TestDateTime_Properties.testPropertyGetDayOfWeek(TestDateTime_Properties.java:960)

testPropertySetTextDayOfWeek(org.joda.time.TestDateTime_Properties)  Time elapsed: 0 sec  <<< ERROR!
java.lang.NullPointerException
	at java.util.concurrent.ConcurrentHashMap.hash(ConcurrentHashMap.java:333)
	at java.util.concurrent.ConcurrentHashMap.get(ConcurrentHashMap.java:988)
	at org.joda.time.chrono.GJLocaleSymbols.forLocale(GJLocaleSymbols.java:19)
	at org.joda.time.chrono.GJDayOfWeekDateTimeField.convertText(GJDayOfWeekDateTimeField.java:91)
	at org.joda.time.field.BaseDateTimeField.set(BaseDateTimeField.java:618)
	at org.joda.time.chrono.ZonedChronology$ZonedDateTimeField.set(ZonedChronology.java:496)
	at org.joda.time.DateTime$Property.setCopy(DateTime.java:2237)
	at org.joda.time.DateTime$Property.setCopy(DateTime.java:2253)
	at org.joda.time.TestDateTime_Properties.testPropertySetTextDayOfWeek(TestDateTime_Properties.java:1057)

testPropertyGetMonthOfYear(org.joda.time.TestDateTime_Properties)  Time elapsed: 0.001 sec  <<< ERROR!
java.lang.NullPointerException
	at java.util.concurrent.ConcurrentHashMap.hash(ConcurrentHashMap.java:333)
	at java.util.concurrent.ConcurrentHashMap.get(ConcurrentHashMap.java:988)
	at org.joda.time.chrono.GJLocaleSymbols.forLocale(GJLocaleSymbols.java:19)
	at org.joda.time.chrono.GJMonthOfYearDateTimeField.getAsText(GJMonthOfYearDateTimeField.java:43)
	at org.joda.time.field.BaseDateTimeField.getAsText(BaseDateTimeField.java:94)
	at org.joda.time.chrono.ZonedChronology$ZonedDateTimeField.getAsText(ZonedChronology.java:428)
	at org.joda.time.field.AbstractReadableInstantFieldProperty.getAsText(AbstractReadableInstantFieldProperty.java:167)
	at org.joda.time.field.AbstractReadableInstantFieldProperty.getAsText(AbstractReadableInstantFieldProperty.java:151)
	at org.joda.time.TestDateTime_Properties.testPropertyGetMonthOfYear(TestDateTime_Properties.java:348)

testPropertySetTextMonthOfYear(org.joda.time.TestDateTime_Properties)  Time elapsed: 0 sec  <<< ERROR!
java.lang.NullPointerException
	at java.util.concurrent.ConcurrentHashMap.hash(ConcurrentHashMap.java:333)
	at java.util.concurrent.ConcurrentHashMap.get(ConcurrentHashMap.java:988)
	at org.joda.time.chrono.GJLocaleSymbols.forLocale(GJLocaleSymbols.java:19)
	at org.joda.time.chrono.GJMonthOfYearDateTimeField.convertText(GJMonthOfYearDateTimeField.java:53)
	at org.joda.time.field.BaseDateTimeField.set(BaseDateTimeField.java:618)
	at org.joda.time.chrono.ZonedChronology$ZonedDateTimeField.set(ZonedChronology.java:496)
	at org.joda.time.DateTime$Property.setCopy(DateTime.java:2237)
	at org.joda.time.DateTime$Property.setCopy(DateTime.java:2253)
	at org.joda.time.TestDateTime_Properties.testPropertySetTextMonthOfYear(TestDateTime_Properties.java:479)

testToString_String_String(org.joda.time.TestMutableDateTime_Basics)  Time elapsed: 0 sec  <<< FAILURE!
junit.framework.ComparisonFailure: expected:<[dim.] 9/6> but was:<[Sun] 9/6>
	at junit.framework.Assert.assertEquals(Assert.java:81)
	at junit.framework.Assert.assertEquals(Assert.java:87)
	at org.joda.time.TestMutableDateTime_Basics.testToString_String_String(TestMutableDateTime_Basics.java:423)

testPropertyGetEra(org.joda.time.TestMutableDateTime_Properties)  Time elapsed: 0.001 sec  <<< ERROR!
java.lang.NullPointerException
	at java.util.concurrent.ConcurrentHashMap.hash(ConcurrentHashMap.java:333)
	at java.util.concurrent.ConcurrentHashMap.get(ConcurrentHashMap.java:988)
	at org.joda.time.chrono.GJLocaleSymbols.forLocale(GJLocaleSymbols.java:19)
	at org.joda.time.chrono.GJEraDateTimeField.getAsText(GJEraDateTimeField.java:69)
	at org.joda.time.field.BaseDateTimeField.getAsText(BaseDateTimeField.java:94)
	at org.joda.time.chrono.ZonedChronology$ZonedDateTimeField.getAsText(ZonedChronology.java:428)
	at org.joda.time.field.AbstractReadableInstantFieldProperty.getAsText(AbstractReadableInstantFieldProperty.java:167)
	at org.joda.time.field.AbstractReadableInstantFieldProperty.getAsText(AbstractReadableInstantFieldProperty.java:151)
	at org.joda.time.TestMutableDateTime_Properties.testPropertyGetEra(TestMutableDateTime_Properties.java:106)

testPropertyGetDayOfWeek(org.joda.time.TestMutableDateTime_Properties)  Time elapsed: 0 sec  <<< ERROR!
java.lang.NullPointerException
	at java.util.concurrent.ConcurrentHashMap.hash(ConcurrentHashMap.java:333)
	at java.util.concurrent.ConcurrentHashMap.get(ConcurrentHashMap.java:988)
	at org.joda.time.chrono.GJLocaleSymbols.forLocale(GJLocaleSymbols.java:19)
	at org.joda.time.chrono.GJDayOfWeekDateTimeField.getAsText(GJDayOfWeekDateTimeField.java:68)
	at org.joda.time.field.BaseDateTimeField.getAsText(BaseDateTimeField.java:94)
	at org.joda.time.chrono.ZonedChronology$ZonedDateTimeField.getAsText(ZonedChronology.java:428)
	at org.joda.time.field.AbstractReadableInstantFieldProperty.getAsText(AbstractReadableInstantFieldProperty.java:167)
	at org.joda.time.field.AbstractReadableInstantFieldProperty.getAsText(AbstractReadableInstantFieldProperty.java:151)
	at org.joda.time.TestMutableDateTime_Properties.testPropertyGetDayOfWeek(TestMutableDateTime_Properties.java:448)

testPropertySetTextDayOfWeek(org.joda.time.TestMutableDateTime_Properties)  Time elapsed: 0.001 sec  <<< ERROR!
java.lang.NullPointerException
	at java.util.concurrent.ConcurrentHashMap.hash(ConcurrentHashMap.java:333)
	at java.util.concurrent.ConcurrentHashMap.get(ConcurrentHashMap.java:988)
	at org.joda.time.chrono.GJLocaleSymbols.forLocale(GJLocaleSymbols.java:19)
	at org.joda.time.chrono.GJDayOfWeekDateTimeField.convertText(GJDayOfWeekDateTimeField.java:91)
	at org.joda.time.field.BaseDateTimeField.set(BaseDateTimeField.java:618)
	at org.joda.time.chrono.ZonedChronology$ZonedDateTimeField.set(ZonedChronology.java:496)
	at org.joda.time.MutableDateTime$Property.set(MutableDateTime.java:1398)
	at org.joda.time.MutableDateTime$Property.set(MutableDateTime.java:1411)
	at org.joda.time.TestMutableDateTime_Properties.testPropertySetTextDayOfWeek(TestMutableDateTime_Properties.java:493)

testPropertyGetMonthOfYear(org.joda.time.TestMutableDateTime_Properties)  Time elapsed: 0 sec  <<< ERROR!
java.lang.NullPointerException
	at java.util.concurrent.ConcurrentHashMap.hash(ConcurrentHashMap.java:333)
	at java.util.concurrent.ConcurrentHashMap.get(ConcurrentHashMap.java:988)
	at org.joda.time.chrono.GJLocaleSymbols.forLocale(GJLocaleSymbols.java:19)
	at org.joda.time.chrono.GJMonthOfYearDateTimeField.getAsText(GJMonthOfYearDateTimeField.java:43)
	at org.joda.time.field.BaseDateTimeField.getAsText(BaseDateTimeField.java:94)
	at org.joda.time.chrono.ZonedChronology$ZonedDateTimeField.getAsText(ZonedChronology.java:428)
	at org.joda.time.field.AbstractReadableInstantFieldProperty.getAsText(AbstractReadableInstantFieldProperty.java:167)
	at org.joda.time.field.AbstractReadableInstantFieldProperty.getAsText(AbstractReadableInstantFieldProperty.java:151)
	at org.joda.time.TestMutableDateTime_Properties.testPropertyGetMonthOfYear(TestMutableDateTime_Properties.java:238)

testPropertySetTextMonthOfYear(org.joda.time.TestMutableDateTime_Properties)  Time elapsed: 0.001 sec  <<< ERROR!
java.lang.NullPointerException
	at java.util.concurrent.ConcurrentHashMap.hash(ConcurrentHashMap.java:333)
	at java.util.concurrent.ConcurrentHashMap.get(ConcurrentHashMap.java:988)
	at org.joda.time.chrono.GJLocaleSymbols.forLocale(GJLocaleSymbols.java:19)
	at org.joda.time.chrono.GJMonthOfYearDateTimeField.convertText(GJMonthOfYearDateTimeField.java:53)
	at org.joda.time.field.BaseDateTimeField.set(BaseDateTimeField.java:618)
	at org.joda.time.chrono.ZonedChronology$ZonedDateTimeField.set(ZonedChronology.java:496)
	at org.joda.time.MutableDateTime$Property.set(MutableDateTime.java:1398)
	at org.joda.time.MutableDateTime$Property.set(MutableDateTime.java:1411)
	at org.joda.time.TestMutableDateTime_Properties.testPropertySetTextMonthOfYear(TestMutableDateTime_Properties.java:279)

testToString_String_String(org.joda.time.TestDateMidnight_Basics)  Time elapsed: 0.001 sec  <<< FAILURE!
junit.framework.ComparisonFailure: expected:<[dim.] 9/6> but was:<[Sun] 9/6>
	at junit.framework.Assert.assertEquals(Assert.java:81)
	at junit.framework.Assert.assertEquals(Assert.java:87)
	at org.joda.time.TestDateMidnight_Basics.testToString_String_String(TestDateMidnight_Basics.java:457)

testPropertyGetEra(org.joda.time.TestDateMidnight_Properties)  Time elapsed: 0.001 sec  <<< ERROR!
java.lang.NullPointerException
	at java.util.concurrent.ConcurrentHashMap.hash(ConcurrentHashMap.java:333)
	at java.util.concurrent.ConcurrentHashMap.get(ConcurrentHashMap.java:988)
	at org.joda.time.chrono.GJLocaleSymbols.forLocale(GJLocaleSymbols.java:19)
	at org.joda.time.chrono.GJEraDateTimeField.getAsText(GJEraDateTimeField.java:69)
	at org.joda.time.field.BaseDateTimeField.getAsText(BaseDateTimeField.java:94)
	at org.joda.time.chrono.ZonedChronology$ZonedDateTimeField.getAsText(ZonedChronology.java:428)
	at org.joda.time.field.AbstractReadableInstantFieldProperty.getAsText(AbstractReadableInstantFieldProperty.java:167)
	at org.joda.time.field.AbstractReadableInstantFieldProperty.getAsText(AbstractReadableInstantFieldProperty.java:151)
	at org.joda.time.TestDateMidnight_Properties.testPropertyGetEra(TestDateMidnight_Properties.java:114)

testPropertyGetDayOfWeek(org.joda.time.TestDateMidnight_Properties)  Time elapsed: 0 sec  <<< ERROR!
java.lang.NullPointerException
	at java.util.concurrent.ConcurrentHashMap.hash(ConcurrentHashMap.java:333)
	at java.util.concurrent.ConcurrentHashMap.get(ConcurrentHashMap.java:988)
	at org.joda.time.chrono.GJLocaleSymbols.forLocale(GJLocaleSymbols.java:19)
	at org.joda.time.chrono.GJDayOfWeekDateTimeField.getAsText(GJDayOfWeekDateTimeField.java:68)
	at org.joda.time.field.BaseDateTimeField.getAsText(BaseDateTimeField.java:94)
	at org.joda.time.chrono.ZonedChronology$ZonedDateTimeField.getAsText(ZonedChronology.java:428)
	at org.joda.time.field.AbstractReadableInstantFieldProperty.getAsText(AbstractReadableInstantFieldProperty.java:167)
	at org.joda.time.field.AbstractReadableInstantFieldProperty.getAsText(AbstractReadableInstantFieldProperty.java:151)
	at org.joda.time.TestDateMidnight_Properties.testPropertyGetDayOfWeek(TestDateMidnight_Properties.java:461)

testPropertySetTextLocaleMonthOfYear(org.joda.time.TestDateMidnight_Properties)  Time elapsed: 0 sec  <<< ERROR!
org.joda.time.IllegalFieldValueException: Value "mars" for monthOfYear is not supported
	at org.joda.time.chrono.GJLocaleSymbols.monthOfYearTextToValue(GJLocaleSymbols.java:101)
	at org.joda.time.chrono.GJMonthOfYearDateTimeField.convertText(GJMonthOfYearDateTimeField.java:53)
	at org.joda.time.field.BaseDateTimeField.set(BaseDateTimeField.java:618)
	at org.joda.time.chrono.ZonedChronology$ZonedDateTimeField.set(ZonedChronology.java:496)
	at org.joda.time.DateMidnight$Property.setCopy(DateMidnight.java:1378)
	at org.joda.time.TestDateMidnight_Properties.testPropertySetTextLocaleMonthOfYear(TestDateMidnight_Properties.java:268)

testPropertyGetMonthOfYear(org.joda.time.TestDateMidnight_Properties)  Time elapsed: 0.001 sec  <<< ERROR!
java.lang.NullPointerException
	at java.util.concurrent.ConcurrentHashMap.hash(ConcurrentHashMap.java:333)
	at java.util.concurrent.ConcurrentHashMap.get(ConcurrentHashMap.java:988)
	at org.joda.time.chrono.GJLocaleSymbols.forLocale(GJLocaleSymbols.java:19)
	at org.joda.time.chrono.GJMonthOfYearDateTimeField.getAsText(GJMonthOfYearDateTimeField.java:43)
	at org.joda.time.field.BaseDateTimeField.getAsText(BaseDateTimeField.java:94)
	at org.joda.time.chrono.ZonedChronology$ZonedDateTimeField.getAsText(ZonedChronology.java:428)
	at org.joda.time.field.AbstractReadableInstantFieldProperty.getAsText(AbstractReadableInstantFieldProperty.java:167)
	at org.joda.time.field.AbstractReadableInstantFieldProperty.getAsText(AbstractReadableInstantFieldProperty.java:151)
	at org.joda.time.TestDateMidnight_Properties.testPropertyGetMonthOfYear(TestDateMidnight_Properties.java:229)

testPropertySetTextMonthOfYear(org.joda.time.TestDateMidnight_Properties)  Time elapsed: 0.001 sec  <<< ERROR!
java.lang.NullPointerException
	at java.util.concurrent.ConcurrentHashMap.hash(ConcurrentHashMap.java:333)
	at java.util.concurrent.ConcurrentHashMap.get(ConcurrentHashMap.java:988)
	at org.joda.time.chrono.GJLocaleSymbols.forLocale(GJLocaleSymbols.java:19)
	at org.joda.time.chrono.GJMonthOfYearDateTimeField.convertText(GJMonthOfYearDateTimeField.java:53)
	at org.joda.time.field.BaseDateTimeField.set(BaseDateTimeField.java:618)
	at org.joda.time.chrono.ZonedChronology$ZonedDateTimeField.set(ZonedChronology.java:496)
	at org.joda.time.DateMidnight$Property.setCopy(DateMidnight.java:1378)
	at org.joda.time.DateMidnight$Property.setCopy(DateMidnight.java:1394)
	at org.joda.time.TestDateMidnight_Properties.testPropertySetTextMonthOfYear(TestDateMidnight_Properties.java:260)

testToString_String_Locale(org.joda.time.TestLocalDateTime_Basics)  Time elapsed: 0.002 sec  <<< FAILURE!
junit.framework.ComparisonFailure: expected:<[mar.] 9/6> but was:<[Tue] 9/6>
	at junit.framework.Assert.assertEquals(Assert.java:81)
	at junit.framework.Assert.assertEquals(Assert.java:87)
	at org.joda.time.TestLocalDateTime_Basics.testToString_String_Locale(TestLocalDateTime_Basics.java:1086)

testPropertyGetMonth(org.joda.time.TestLocalDateTime_Properties)  Time elapsed: 0 sec  <<< ERROR!
java.lang.NullPointerException
	at java.util.concurrent.ConcurrentHashMap.hash(ConcurrentHashMap.java:333)
	at java.util.concurrent.ConcurrentHashMap.get(ConcurrentHashMap.java:988)
	at org.joda.time.chrono.GJLocaleSymbols.forLocale(GJLocaleSymbols.java:19)
	at org.joda.time.chrono.GJMonthOfYearDateTimeField.getAsText(GJMonthOfYearDateTimeField.java:43)
	at org.joda.time.field.BaseDateTimeField.getAsText(BaseDateTimeField.java:94)
	at org.joda.time.field.AbstractReadableInstantFieldProperty.getAsText(AbstractReadableInstantFieldProperty.java:167)
	at org.joda.time.field.AbstractReadableInstantFieldProperty.getAsText(AbstractReadableInstantFieldProperty.java:151)
	at org.joda.time.TestLocalDateTime_Properties.testPropertyGetMonth(TestLocalDateTime_Properties.java:206)

testPropertySetCopyTextMonth(org.joda.time.TestLocalDateTime_Properties)  Time elapsed: 0.001 sec  <<< ERROR!
java.lang.NullPointerException
	at java.util.concurrent.ConcurrentHashMap.hash(ConcurrentHashMap.java:333)
	at java.util.concurrent.ConcurrentHashMap.get(ConcurrentHashMap.java:988)
	at org.joda.time.chrono.GJLocaleSymbols.forLocale(GJLocaleSymbols.java:19)
	at org.joda.time.chrono.GJMonthOfYearDateTimeField.convertText(GJMonthOfYearDateTimeField.java:53)
	at org.joda.time.field.BaseDateTimeField.set(BaseDateTimeField.java:618)
	at org.joda.time.LocalDateTime$Property.setCopy(LocalDateTime.java:2290)
	at org.joda.time.LocalDateTime$Property.setCopy(LocalDateTime.java:2303)
	at org.joda.time.TestLocalDateTime_Properties.testPropertySetCopyTextMonth(TestLocalDateTime_Properties.java:306)

testToString_String_Locale(org.joda.time.TestLocalDate_Basics)  Time elapsed: 0.001 sec  <<< FAILURE!
junit.framework.ComparisonFailure: expected:<[mar.] 9/6> but was:<[Tue] 9/6>
	at junit.framework.Assert.assertEquals(Assert.java:81)
	at junit.framework.Assert.assertEquals(Assert.java:87)
	at org.joda.time.TestLocalDate_Basics.testToString_String_Locale(TestLocalDate_Basics.java:1140)

testPropertyGetMonth(org.joda.time.TestLocalDate_Properties)  Time elapsed: 0.001 sec  <<< ERROR!
java.lang.NullPointerException
	at java.util.concurrent.ConcurrentHashMap.hash(ConcurrentHashMap.java:333)
	at java.util.concurrent.ConcurrentHashMap.get(ConcurrentHashMap.java:988)
	at org.joda.time.chrono.GJLocaleSymbols.forLocale(GJLocaleSymbols.java:19)
	at org.joda.time.chrono.GJMonthOfYearDateTimeField.getAsText(GJMonthOfYearDateTimeField.java:43)
	at org.joda.time.field.BaseDateTimeField.getAsText(BaseDateTimeField.java:94)
	at org.joda.time.field.AbstractReadableInstantFieldProperty.getAsText(AbstractReadableInstantFieldProperty.java:167)
	at org.joda.time.field.AbstractReadableInstantFieldProperty.getAsText(AbstractReadableInstantFieldProperty.java:151)
	at org.joda.time.TestLocalDate_Properties.testPropertyGetMonth(TestLocalDate_Properties.java:201)

testPropertySetCopyTextMonth(org.joda.time.TestLocalDate_Properties)  Time elapsed: 0 sec  <<< ERROR!
java.lang.NullPointerException
	at java.util.concurrent.ConcurrentHashMap.hash(ConcurrentHashMap.java:333)
	at java.util.concurrent.ConcurrentHashMap.get(ConcurrentHashMap.java:988)
	at org.joda.time.chrono.GJLocaleSymbols.forLocale(GJLocaleSymbols.java:19)
	at org.joda.time.chrono.GJMonthOfYearDateTimeField.convertText(GJMonthOfYearDateTimeField.java:53)
	at org.joda.time.field.BaseDateTimeField.set(BaseDateTimeField.java:618)
	at org.joda.time.LocalDate$Property.setCopy(LocalDate.java:2021)
	at org.joda.time.LocalDate$Property.setCopy(LocalDate.java:2034)
	at org.joda.time.TestLocalDate_Properties.testPropertySetCopyTextMonth(TestLocalDate_Properties.java:301)

testPropertyGetMonth(org.joda.time.TestYearMonthDay_Properties)  Time elapsed: 0.001 sec  <<< ERROR!
java.lang.NullPointerException
	at java.util.concurrent.ConcurrentHashMap.hash(ConcurrentHashMap.java:333)
	at java.util.concurrent.ConcurrentHashMap.get(ConcurrentHashMap.java:988)
	at org.joda.time.chrono.GJLocaleSymbols.forLocale(GJLocaleSymbols.java:19)
	at org.joda.time.chrono.GJMonthOfYearDateTimeField.getAsText(GJMonthOfYearDateTimeField.java:43)
	at org.joda.time.field.BaseDateTimeField.getAsText(BaseDateTimeField.java:121)
	at org.joda.time.field.AbstractPartialFieldProperty.getAsText(AbstractPartialFieldProperty.java:137)
	at org.joda.time.field.AbstractPartialFieldProperty.getAsText(AbstractPartialFieldProperty.java:121)
	at org.joda.time.TestYearMonthDay_Properties.testPropertyGetMonth(TestYearMonthDay_Properties.java:204)

testPropertySetTextMonth(org.joda.time.TestYearMonthDay_Properties)  Time elapsed: 0.001 sec  <<< ERROR!
java.lang.NullPointerException
	at java.util.concurrent.ConcurrentHashMap.hash(ConcurrentHashMap.java:333)
	at java.util.concurrent.ConcurrentHashMap.get(ConcurrentHashMap.java:988)
	at org.joda.time.chrono.GJLocaleSymbols.forLocale(GJLocaleSymbols.java:19)
	at org.joda.time.chrono.GJMonthOfYearDateTimeField.convertText(GJMonthOfYearDateTimeField.java:53)
	at org.joda.time.field.BaseDateTimeField.set(BaseDateTimeField.java:654)
	at org.joda.time.YearMonthDay$Property.setCopy(YearMonthDay.java:1069)
	at org.joda.time.YearMonthDay$Property.setCopy(YearMonthDay.java:1084)
	at org.joda.time.TestYearMonthDay_Properties.testPropertySetTextMonth(TestYearMonthDay_Properties.java:304)

testPropertyGetMonth(org.joda.time.TestYearMonth_Properties)  Time elapsed: 0 sec  <<< ERROR!
java.lang.NullPointerException
	at java.util.concurrent.ConcurrentHashMap.hash(ConcurrentHashMap.java:333)
	at java.util.concurrent.ConcurrentHashMap.get(ConcurrentHashMap.java:988)
	at org.joda.time.chrono.GJLocaleSymbols.forLocale(GJLocaleSymbols.java:19)
	at org.joda.time.chrono.GJMonthOfYearDateTimeField.getAsText(GJMonthOfYearDateTimeField.java:43)
	at org.joda.time.field.BaseDateTimeField.getAsText(BaseDateTimeField.java:121)
	at org.joda.time.field.AbstractPartialFieldProperty.getAsText(AbstractPartialFieldProperty.java:137)
	at org.joda.time.field.AbstractPartialFieldProperty.getAsText(AbstractPartialFieldProperty.java:121)
	at org.joda.time.TestYearMonth_Properties.testPropertyGetMonth(TestYearMonth_Properties.java:203)

testPropertySetTextMonth(org.joda.time.TestYearMonth_Properties)  Time elapsed: 0 sec  <<< ERROR!
java.lang.NullPointerException
	at java.util.concurrent.ConcurrentHashMap.hash(ConcurrentHashMap.java:333)
	at java.util.concurrent.ConcurrentHashMap.get(ConcurrentHashMap.java:988)
	at org.joda.time.chrono.GJLocaleSymbols.forLocale(GJLocaleSymbols.java:19)
	at org.joda.time.chrono.GJMonthOfYearDateTimeField.convertText(GJMonthOfYearDateTimeField.java:53)
	at org.joda.time.field.BaseDateTimeField.set(BaseDateTimeField.java:654)
	at org.joda.time.YearMonth$Property.setCopy(YearMonth.java:972)
	at org.joda.time.YearMonth$Property.setCopy(YearMonth.java:987)
	at org.joda.time.TestYearMonth_Properties.testPropertySetTextMonth(TestYearMonth_Properties.java:271)

testPropertyGetMonthOfYear(org.joda.time.TestMonthDay_Properties)  Time elapsed: 0 sec  <<< ERROR!
java.lang.NullPointerException
	at java.util.concurrent.ConcurrentHashMap.hash(ConcurrentHashMap.java:333)
	at java.util.concurrent.ConcurrentHashMap.get(ConcurrentHashMap.java:988)
	at org.joda.time.chrono.GJLocaleSymbols.forLocale(GJLocaleSymbols.java:19)
	at org.joda.time.chrono.GJMonthOfYearDateTimeField.getAsText(GJMonthOfYearDateTimeField.java:43)
	at org.joda.time.field.BaseDateTimeField.getAsText(BaseDateTimeField.java:121)
	at org.joda.time.field.AbstractPartialFieldProperty.getAsText(AbstractPartialFieldProperty.java:137)
	at org.joda.time.field.AbstractPartialFieldProperty.getAsText(AbstractPartialFieldProperty.java:121)
	at org.joda.time.TestMonthDay_Properties.testPropertyGetMonthOfYear(TestMonthDay_Properties.java:89)

testPropertySetTextMonthOfYear(org.joda.time.TestMonthDay_Properties)  Time elapsed: 0 sec  <<< ERROR!
java.lang.NullPointerException
	at java.util.concurrent.ConcurrentHashMap.hash(ConcurrentHashMap.java:333)
	at java.util.concurrent.ConcurrentHashMap.get(ConcurrentHashMap.java:988)
	at org.joda.time.chrono.GJLocaleSymbols.forLocale(GJLocaleSymbols.java:19)
	at org.joda.time.chrono.GJMonthOfYearDateTimeField.convertText(GJMonthOfYearDateTimeField.java:53)
	at org.joda.time.field.BaseDateTimeField.set(BaseDateTimeField.java:654)
	at org.joda.time.MonthDay$Property.setCopy(MonthDay.java:958)
	at org.joda.time.MonthDay$Property.setCopy(MonthDay.java:973)
	at org.joda.time.TestMonthDay_Properties.testPropertySetTextMonthOfYear(TestMonthDay_Properties.java:148)

testPartialGetAsText(org.joda.time.chrono.TestGJChronology)  Time elapsed: 0 sec  <<< ERROR!
java.lang.NullPointerException

testPrint_locale(org.joda.time.format.TestDateTimeFormatter)  Time elapsed: 0 sec  <<< FAILURE!
junit.framework.ComparisonFailure: expected:<[mer.] 2004-06-09T10:20:30...> but was:<[Wed] 2004-06-09T10:20:30...>
	at junit.framework.Assert.assertEquals(Assert.java:81)
	at junit.framework.Assert.assertEquals(Assert.java:87)
	at org.joda.time.format.TestDateTimeFormatter.testPrint_locale(TestDateTimeFormatter.java:127)

testFormat_dayOfWeekShortText(org.joda.time.format.TestDateTimeFormat)  Time elapsed: 0.001 sec  <<< FAILURE!
junit.framework.ComparisonFailure: 2004-06-09T19:20:30.040+09:00 expected:<[mer.]> but was:<[Wed]>
	at junit.framework.Assert.assertEquals(Assert.java:81)
	at org.joda.time.format.TestDateTimeFormat.testFormat_dayOfWeekShortText(TestDateTimeFormat.java:534)

testFormat_dayOfWeekText(org.joda.time.format.TestDateTimeFormat)  Time elapsed: 0 sec  <<< FAILURE!
junit.framework.ComparisonFailure: 2004-06-09T19:20:30.040+09:00 expected:<[mercredi]> but was:<[Wednesday]>
	at junit.framework.Assert.assertEquals(Assert.java:81)
	at org.joda.time.format.TestDateTimeFormat.testFormat_dayOfWeekText(TestDateTimeFormat.java:550)

testFormat_monthOfYearShortText(org.joda.time.format.TestDateTimeFormat)  Time elapsed: 0.001 sec  <<< FAILURE!
junit.framework.ComparisonFailure: 2004-06-09T19:20:30.040+09:00 expected:<[jui]n> but was:<[Ju]n>
	at junit.framework.Assert.assertEquals(Assert.java:81)
	at org.joda.time.format.TestDateTimeFormat.testFormat_monthOfYearShortText(TestDateTimeFormat.java:592)

testFormat_monthOfYearText(org.joda.time.format.TestDateTimeFormat)  Time elapsed: 0.001 sec  <<< FAILURE!
junit.framework.ComparisonFailure: 2004-06-09T19:20:30.040+09:00 expected:<[juin]> but was:<[June]>
	at junit.framework.Assert.assertEquals(Assert.java:81)
	at org.joda.time.format.TestDateTimeFormat.testFormat_monthOfYearText(TestDateTimeFormat.java:608)

testFormatParse_textMonthJanShort_France(org.joda.time.format.TestDateTimeFormat)  Time elapsed: 0.001 sec  <<< FAILURE!
junit.framework.ComparisonFailure: expected:<23 [janv.] 2007> but was:<23 [Jan] 2007>
	at junit.framework.Assert.assertEquals(Assert.java:81)
	at junit.framework.Assert.assertEquals(Assert.java:87)
	at org.joda.time.format.TestDateTimeFormat.testFormatParse_textMonthJanShort_France(TestDateTimeFormat.java:944)

testFormatParse_textMonthJanLong_France(org.joda.time.format.TestDateTimeFormat)  Time elapsed: 0 sec  <<< ERROR!
java.lang.IllegalArgumentException: Invalid format: "23 janvier 2007" is malformed at "vier 2007"
	at org.joda.time.format.DateTimeFormatter.parseDateTime(DateTimeFormatter.java:899)
	at org.joda.time.format.TestDateTimeFormat.testFormatParse_textMonthJanLong_France(TestDateTimeFormat.java:953)

testFormatParse_textMonthApr_France(org.joda.time.format.TestDateTimeFormat)  Time elapsed: 0 sec  <<< FAILURE!
junit.framework.ComparisonFailure: expected:<23 [févr.] 2007> but was:<23 [Feb] 2007>
	at junit.framework.Assert.assertEquals(Assert.java:81)
	at junit.framework.Assert.assertEquals(Assert.java:87)
	at org.joda.time.format.TestDateTimeFormat.testFormatParse_textMonthApr_France(TestDateTimeFormat.java:962)

testFormatParse_textMonthAtEnd_France(org.joda.time.format.TestDateTimeFormat)  Time elapsed: 0.001 sec  <<< FAILURE!
junit.framework.ComparisonFailure: expected:<23 [jui]n> but was:<23 [Ju]n>
	at junit.framework.Assert.assertEquals(Assert.java:81)
	at junit.framework.Assert.assertEquals(Assert.java:87)
	at org.joda.time.format.TestDateTimeFormat.testFormatParse_textMonthAtEnd_France(TestDateTimeFormat.java:972)

testFormatParse_textMonthAtEnd_France_withSpecifiedDefault(org.joda.time.format.TestDateTimeFormat)  Time elapsed: 0 sec  <<< FAILURE!
junit.framework.ComparisonFailure: expected:<23 [jui]n> but was:<23 [Ju]n>
	at junit.framework.Assert.assertEquals(Assert.java:81)
	at junit.framework.Assert.assertEquals(Assert.java:87)
	at org.joda.time.format.TestDateTimeFormat.testFormatParse_textMonthAtEnd_France_withSpecifiedDefault(TestDateTimeFormat.java:982)

testFormatParse_textEraAD_France(org.joda.time.format.TestDateTimeFormat)  Time elapsed: 0.001 sec  <<< FAILURE!
junit.framework.ComparisonFailure: expected:<$[ap. J.-C.]2007> but was:<$[AD]2007>
	at junit.framework.Assert.assertEquals(Assert.java:81)
	at junit.framework.Assert.assertEquals(Assert.java:87)
	at org.joda.time.format.TestDateTimeFormat.testFormatParse_textEraAD_France(TestDateTimeFormat.java:1055)

testForStyle_mediumShortDateTime(org.joda.time.format.TestDateTimeFormatStyle)  Time elapsed: 0.001 sec  <<< FAILURE!
junit.framework.ComparisonFailure: expected:<9 [jui]n 2004 10:20> but was:<9 [Ju]n 2004 10:20>
	at junit.framework.Assert.assertEquals(Assert.java:81)
	at junit.framework.Assert.assertEquals(Assert.java:87)
	at org.joda.time.format.TestDateTimeFormatStyle.testForStyle_mediumShortDateTime(TestDateTimeFormatStyle.java:345)

testForStyle_mediumLongDateTime(org.joda.time.format.TestDateTimeFormatStyle)  Time elapsed: 0.002 sec  <<< FAILURE!
junit.framework.ComparisonFailure: expected:<9 [jui]n 2004 10:20:30 BST> but was:<9 [Ju]n 2004 10:20:30 BST>
	at junit.framework.Assert.assertEquals(Assert.java:81)
	at junit.framework.Assert.assertEquals(Assert.java:87)
	at org.joda.time.format.TestDateTimeFormatStyle.testForStyle_mediumLongDateTime(TestDateTimeFormatStyle.java:356)

testForStyle_mediumFullDateTime(org.joda.time.format.TestDateTimeFormatStyle)  Time elapsed: 0.001 sec  <<< FAILURE!
junit.framework.ComparisonFailure: expected:<9 [jui]n 2004 10 h 20 BST> but was:<9 [Ju]n 2004 10 h 20 BST>
	at junit.framework.Assert.assertEquals(Assert.java:81)
	at junit.framework.Assert.assertEquals(Assert.java:87)
	at org.joda.time.format.TestDateTimeFormatStyle.testForStyle_mediumFullDateTime(TestDateTimeFormatStyle.java:367)

testForStyle_mediumDate(org.joda.time.format.TestDateTimeFormatStyle)  Time elapsed: 0.001 sec  <<< FAILURE!
junit.framework.ComparisonFailure: expected:<9 [jui]n 2004> but was:<9 [Ju]n 2004>
	at junit.framework.Assert.assertEquals(Assert.java:81)
	at junit.framework.Assert.assertEquals(Assert.java:87)
	at org.joda.time.format.TestDateTimeFormatStyle.testForStyle_mediumDate(TestDateTimeFormatStyle.java:193)

testForStyle_mediumDateTime(org.joda.time.format.TestDateTimeFormatStyle)  Time elapsed: 0.001 sec  <<< FAILURE!
junit.framework.ComparisonFailure: expected:<9 [jui]n 2004 10:20:30> but was:<9 [Ju]n 2004 10:20:30>
	at junit.framework.Assert.assertEquals(Assert.java:81)
	at junit.framework.Assert.assertEquals(Assert.java:87)
	at org.joda.time.format.TestDateTimeFormatStyle.testForStyle_mediumDateTime(TestDateTimeFormatStyle.java:219)

testForStyle_longDate(org.joda.time.format.TestDateTimeFormatStyle)  Time elapsed: 0.001 sec  <<< FAILURE!
junit.framework.ComparisonFailure: expected:<9 [juin] 2004> but was:<9 [June] 2004>
	at junit.framework.Assert.assertEquals(Assert.java:81)
	at junit.framework.Assert.assertEquals(Assert.java:87)
	at org.joda.time.format.TestDateTimeFormatStyle.testForStyle_longDate(TestDateTimeFormatStyle.java:233)

testForStyle_longDateTime(org.joda.time.format.TestDateTimeFormatStyle)  Time elapsed: 0.002 sec  <<< FAILURE!
junit.framework.ComparisonFailure: expected:<9 [juin] 2004 10:20:30 BST> but was:<9 [June] 2004 10:20:30 BST>
	at junit.framework.Assert.assertEquals(Assert.java:81)
	at junit.framework.Assert.assertEquals(Assert.java:87)
	at org.joda.time.format.TestDateTimeFormatStyle.testForStyle_longDateTime(TestDateTimeFormatStyle.java:259)

testForStyle_fullDate(org.joda.time.format.TestDateTimeFormatStyle)  Time elapsed: 0.001 sec  <<< FAILURE!
junit.framework.ComparisonFailure: expected:<[mercredi 9 juin] 2004> but was:<[Wednesday 9 June] 2004>
	at junit.framework.Assert.assertEquals(Assert.java:81)
	at junit.framework.Assert.assertEquals(Assert.java:87)
	at org.joda.time.format.TestDateTimeFormatStyle.testForStyle_fullDate(TestDateTimeFormatStyle.java:273)

testForStyle_fullDateTime(org.joda.time.format.TestDateTimeFormatStyle)  Time elapsed: 0.001 sec  <<< FAILURE!
junit.framework.ComparisonFailure: expected:<[mercredi 9 juin] 2004 10 h 20 BST> but was:<[Wednesday 9 June] 2004 10 h 20 BST>
	at junit.framework.Assert.assertEquals(Assert.java:81)
	at junit.framework.Assert.assertEquals(Assert.java:87)
	at org.joda.time.format.TestDateTimeFormatStyle.testForStyle_fullDateTime(TestDateTimeFormatStyle.java:299)

testMonthNames_monthStart(org.joda.time.format.TestTextFields)  Time elapsed: 0.001 sec  <<< FAILURE!
junit.framework.ComparisonFailure: expected:<[January]> but was:<[�]>
	at junit.framework.Assert.assertEquals(Assert.java:81)
	at junit.framework.Assert.assertEquals(Assert.java:87)
	at org.joda.time.format.TestTextFields.testMonthNames_monthStart(TestTextFields.java:95)

testMonthNames_monthMiddle(org.joda.time.format.TestTextFields)  Time elapsed: 0 sec  <<< FAILURE!
junit.framework.ComparisonFailure: expected:<[January]> but was:<[�]>
	at junit.framework.Assert.assertEquals(Assert.java:81)
	at junit.framework.Assert.assertEquals(Assert.java:87)
	at org.joda.time.format.TestTextFields.testMonthNames_monthMiddle(TestTextFields.java:106)

testMonthNames_monthEnd(org.joda.time.format.TestTextFields)  Time elapsed: 0.001 sec  <<< FAILURE!
junit.framework.ComparisonFailure: expected:<[January]> but was:<[�]>
	at junit.framework.Assert.assertEquals(Assert.java:81)
	at junit.framework.Assert.assertEquals(Assert.java:87)
	at org.joda.time.format.TestTextFields.testMonthNames_monthEnd(TestTextFields.java:120)

testWeekdayNames(org.joda.time.format.TestTextFields)  Time elapsed: 0.001 sec  <<< FAILURE!
junit.framework.ComparisonFailure: expected:<[Thursday]> but was:<[�]>
	at junit.framework.Assert.assertEquals(Assert.java:81)
	at junit.framework.Assert.assertEquals(Assert.java:87)
	at org.joda.time.format.TestTextFields.testWeekdayNames(TestTextFields.java:133)

testHalfdayNames(org.joda.time.format.TestTextFields)  Time elapsed: 0 sec  <<< FAILURE!
junit.framework.ComparisonFailure: expected:<[AM]> but was:<[�]>
	at junit.framework.Assert.assertEquals(Assert.java:81)
	at junit.framework.Assert.assertEquals(Assert.java:87)
	at org.joda.time.format.TestTextFields.testHalfdayNames(TestTextFields.java:147)


Results :

Failed tests: 
  org.joda.time.TestDateMidnight_Basics#testToString_String_String ComparisonFailure
  org.joda.time.TestDateTime_Basics#testToString_String_Locale ComparisonFailure
  org.joda.time.TestLocalDateTime_Basics#testToString_String_Locale ComparisonFailure
  org.joda.time.TestLocalDate_Basics#testToString_String_Locale ComparisonFailure
  org.joda.time.TestMutableDateTime_Basics#testToString_String_String ComparisonFailure
  org.joda.time.format.TestDateTimeFormat#testFormatParse_textEraAD_France ComparisonFailure
  org.joda.time.format.TestDateTimeFormat#testFormatParse_textMonthApr_France ComparisonFailure
  org.joda.time.format.TestDateTimeFormat#testFormatParse_textMonthAtEnd_France ComparisonFailure
  org.joda.time.format.TestDateTimeFormat#testFormatParse_textMonthAtEnd_France_withSpecifiedDefault ComparisonFailure
  org.joda.time.format.TestDateTimeFormat#testFormatParse_textMonthJanShort_France ComparisonFailure
  org.joda.time.format.TestDateTimeFormat#testFormat_dayOfWeekShortText ComparisonFailure
  org.joda.time.format.TestDateTimeFormat#testFormat_dayOfWeekText ComparisonFailure
  org.joda.time.format.TestDateTimeFormat#testFormat_monthOfYearShortText ComparisonFailure
  org.joda.time.format.TestDateTimeFormat#testFormat_monthOfYearText ComparisonFailure
  org.joda.time.format.TestDateTimeFormatStyle#testForStyle_fullDate ComparisonFailure
  org.joda.time.format.TestDateTimeFormatStyle#testForStyle_fullDateTime ComparisonFailure
  org.joda.time.format.TestDateTimeFormatStyle#testForStyle_longDate ComparisonFailure
  org.joda.time.format.TestDateTimeFormatStyle#testForStyle_longDateTime ComparisonFailure
  org.joda.time.format.TestDateTimeFormatStyle#testForStyle_mediumDate ComparisonFailure
  org.joda.time.format.TestDateTimeFormatStyle#testForStyle_mediumDateTime ComparisonFailure
  org.joda.time.format.TestDateTimeFormatStyle#testForStyle_mediumFullDateTime ComparisonFailure
  org.joda.time.format.TestDateTimeFormatStyle#testForStyle_mediumLongDateTime ComparisonFailure
  org.joda.time.format.TestDateTimeFormatStyle#testForStyle_mediumShortDateTime ComparisonFailure
  org.joda.time.format.TestDateTimeFormatter#testPrint_locale ComparisonFailure ...
  org.joda.time.format.TestTextFields#testHalfdayNames ComparisonFailure expecte...
  org.joda.time.format.TestTextFields#testMonthNames_monthEnd ComparisonFailure ...
  org.joda.time.format.TestTextFields#testMonthNames_monthMiddle ComparisonFailure
  org.joda.time.format.TestTextFields#testMonthNames_monthStart ComparisonFailure
  org.joda.time.format.TestTextFields#testWeekdayNames ComparisonFailure expecte...
Tests in error: 
  org.joda.time.TestDateMidnight_Properties#testPropertyGetDayOfWeek NullPointerException
  org.joda.time.TestDateMidnight_Properties#testPropertyGetEra NullPointerException
  org.joda.time.TestDateMidnight_Properties#testPropertyGetMonthOfYear NullPointerException
  org.joda.time.TestDateMidnight_Properties#testPropertySetTextLocaleMonthOfYear IllegalFieldValueException
  org.joda.time.TestDateMidnight_Properties#testPropertySetTextMonthOfYear NullPointerException
  org.joda.time.TestDateTime_Properties#testPropertyGetDayOfWeek NullPointerException
  org.joda.time.TestDateTime_Properties#testPropertyGetEra NullPointerException
  org.joda.time.TestDateTime_Properties#testPropertyGetMonthOfYear NullPointerException
  org.joda.time.TestDateTime_Properties#testPropertySetTextDayOfWeek NullPointerException
  org.joda.time.TestDateTime_Properties#testPropertySetTextMonthOfYear NullPointerException
  org.joda.time.TestLocalDateTime_Properties#testPropertyGetMonth NullPointerException
  org.joda.time.TestLocalDateTime_Properties#testPropertySetCopyTextMonth NullPointerException
  org.joda.time.TestLocalDate_Properties#testPropertyGetMonth NullPointerException
  org.joda.time.TestLocalDate_Properties#testPropertySetCopyTextMonth NullPointerException
  org.joda.time.TestMonthDay_Properties#testPropertyGetMonthOfYear NullPointerException
  org.joda.time.TestMonthDay_Properties#testPropertySetTextMonthOfYear NullPointerException
  org.joda.time.TestMutableDateTime_Properties#testPropertyGetDayOfWeek NullPointerException
  org.joda.time.TestMutableDateTime_Properties#testPropertyGetEra NullPointerException
  org.joda.time.TestMutableDateTime_Properties#testPropertyGetMonthOfYear NullPointerException
  org.joda.time.TestMutableDateTime_Properties#testPropertySetTextDayOfWeek NullPointerException
  org.joda.time.TestMutableDateTime_Properties#testPropertySetTextMonthOfYear NullPointerException
  org.joda.time.TestYearMonthDay_Properties#testPropertyGetMonth NullPointerException
  org.joda.time.TestYearMonthDay_Properties#testPropertySetTextMonth NullPointerException
  org.joda.time.TestYearMonth_Properties#testPropertyGetMonth NullPointerException
  org.joda.time.TestYearMonth_Properties#testPropertySetTextMonth NullPointerException
  org.joda.time.chrono.TestGJChronology#testPartialGetAsText NullPointerException
  org.joda.time.format.TestDateTimeFormat#testFormatParse_textMonthJanLong_France IllegalArgumentException

Tests run: 4157, Failures: 29, Errors: 27, Skipped: 0

[INFO] ------------------------------------------------------------------------
[INFO] BUILD FAILURE
[INFO] ------------------------------------------------------------------------
[INFO] Total time: 15.941s
[INFO] Finished at: Thu Aug 06 01:01:40 BST 2015
[INFO] Final Memory: 9M/213M
[INFO] ------------------------------------------------------------------------
[ERROR] Failed to execute goal org.apache.maven.plugins:maven-surefire-plugin:2.18.1:test (default-test) on project joda-time: There are test failures.
[ERROR] 
[ERROR] Please refer to /home/perham/Study/LittleDarwin/Cases/joda-time-2.8.1/target/surefire-reports for the individual test results.
[ERROR] -> [Help 1]
[ERROR] 
[ERROR] To see the full stack trace of the errors, re-run Maven with the -e switch.
[ERROR] Re-run Maven using the -X switch to enable full debug logging.
[ERROR] 
[ERROR] For more information about the errors and possible solutions, please read the following articles:
[ERROR] [Help 1] http://cwiki.apache.org/confluence/display/MAVEN/MojoFailureException
