[INFO] Scanning for projects...
[INFO]                                                                         
[INFO] ------------------------------------------------------------------------
[INFO] Building Joda-Time 2.8.1
[INFO] ------------------------------------------------------------------------
[INFO] 
[INFO] --- maven-resources-plugin:2.7:resources (default-resources) @ joda-time ---
[INFO] Using 'UTF-8' encoding to copy filtered resources.
[INFO] Copying 2 resources to META-INF
[INFO] Copying 10 resources
[INFO] 
[INFO] --- maven-compiler-plugin:3.3:compile (default-compile) @ joda-time ---
[INFO] Changes detected - recompiling the module!
[INFO] Compiling 166 source files to /home/perham/Study/LittleDarwin/Cases/joda-time-2.8.1/target/classes
[INFO] 
[INFO] --- exec-maven-plugin:1.4.0:java (compile-tzdb) @ joda-time ---
Writing zoneinfo files
Writing ZoneInfoMap
[INFO] 
[INFO] --- maven-resources-plugin:2.7:testResources (default-testResources) @ joda-time ---
[INFO] Using 'UTF-8' encoding to copy filtered resources.
[INFO] Copying 34 resources
[INFO] 
[INFO] --- maven-compiler-plugin:3.3:testCompile (default-testCompile) @ joda-time ---
[INFO] Nothing to compile - all classes are up to date
[INFO] 
[INFO] --- maven-surefire-plugin:2.18.1:test (default-test) @ joda-time ---
[INFO] Surefire report directory: /home/perham/Study/LittleDarwin/Cases/joda-time-2.8.1/target/surefire-reports

-------------------------------------------------------
 T E S T S
-------------------------------------------------------
Running org.joda.time.TestAllPackages

TestBuddhistChronology.testCalendar

TestCopticChronology.testCalendar

TestEthiopicChronology.testCalendar

TestIslamicChronology.testCalendar

Testing Gregorian chronology over 1000 iterations
100% complete (i=1000)

Testing Julian chronology over 1000 iterations
100% complete (i=1000)
Writing zoneinfo files
Writing ZoneInfoMap
Tests run: 4157, Failures: 0, Errors: 10, Skipped: 0, Time elapsed: 5.232 sec <<< FAILURE! - in org.joda.time.TestAllPackages
testPropertySetTextMonthOfYear(org.joda.time.TestDateTime_Properties)  Time elapsed: 0.003 sec  <<< ERROR!
org.joda.time.IllegalFieldValueException: Value "12" for monthOfYear is not supported
	at org.joda.time.chrono.GJLocaleSymbols.monthOfYearTextToValue(GJLocaleSymbols.java:101)
	at org.joda.time.chrono.GJMonthOfYearDateTimeField.convertText(GJMonthOfYearDateTimeField.java:53)
	at org.joda.time.field.BaseDateTimeField.set(BaseDateTimeField.java:618)
	at org.joda.time.chrono.ZonedChronology$ZonedDateTimeField.set(ZonedChronology.java:496)
	at org.joda.time.DateTime$Property.setCopy(DateTime.java:2237)
	at org.joda.time.DateTime$Property.setCopy(DateTime.java:2253)
	at org.joda.time.TestDateTime_Properties.testPropertySetTextMonthOfYear(TestDateTime_Properties.java:479)

testPropertySetTextDayOfWeek(org.joda.time.TestDateTime_Properties)  Time elapsed: 0.001 sec  <<< ERROR!
org.joda.time.IllegalFieldValueException: Value "4" for dayOfWeek is not supported
	at org.joda.time.chrono.GJLocaleSymbols.dayOfWeekTextToValue(GJLocaleSymbols.java:108)
	at org.joda.time.chrono.GJDayOfWeekDateTimeField.convertText(GJDayOfWeekDateTimeField.java:91)
	at org.joda.time.field.BaseDateTimeField.set(BaseDateTimeField.java:618)
	at org.joda.time.chrono.ZonedChronology$ZonedDateTimeField.set(ZonedChronology.java:496)
	at org.joda.time.DateTime$Property.setCopy(DateTime.java:2237)
	at org.joda.time.DateTime$Property.setCopy(DateTime.java:2253)
	at org.joda.time.TestDateTime_Properties.testPropertySetTextDayOfWeek(TestDateTime_Properties.java:1057)

testPropertySetTextMonthOfYear(org.joda.time.TestMutableDateTime_Properties)  Time elapsed: 0.001 sec  <<< ERROR!
org.joda.time.IllegalFieldValueException: Value "12" for monthOfYear is not supported
	at org.joda.time.chrono.GJLocaleSymbols.monthOfYearTextToValue(GJLocaleSymbols.java:101)
	at org.joda.time.chrono.GJMonthOfYearDateTimeField.convertText(GJMonthOfYearDateTimeField.java:53)
	at org.joda.time.field.BaseDateTimeField.set(BaseDateTimeField.java:618)
	at org.joda.time.chrono.ZonedChronology$ZonedDateTimeField.set(ZonedChronology.java:496)
	at org.joda.time.MutableDateTime$Property.set(MutableDateTime.java:1398)
	at org.joda.time.MutableDateTime$Property.set(MutableDateTime.java:1411)
	at org.joda.time.TestMutableDateTime_Properties.testPropertySetTextMonthOfYear(TestMutableDateTime_Properties.java:279)

testPropertySetTextDayOfWeek(org.joda.time.TestMutableDateTime_Properties)  Time elapsed: 0 sec  <<< ERROR!
org.joda.time.IllegalFieldValueException: Value "4" for dayOfWeek is not supported
	at org.joda.time.chrono.GJLocaleSymbols.dayOfWeekTextToValue(GJLocaleSymbols.java:108)
	at org.joda.time.chrono.GJDayOfWeekDateTimeField.convertText(GJDayOfWeekDateTimeField.java:91)
	at org.joda.time.field.BaseDateTimeField.set(BaseDateTimeField.java:618)
	at org.joda.time.chrono.ZonedChronology$ZonedDateTimeField.set(ZonedChronology.java:496)
	at org.joda.time.MutableDateTime$Property.set(MutableDateTime.java:1398)
	at org.joda.time.MutableDateTime$Property.set(MutableDateTime.java:1411)
	at org.joda.time.TestMutableDateTime_Properties.testPropertySetTextDayOfWeek(TestMutableDateTime_Properties.java:493)

testPropertySetTextMonthOfYear(org.joda.time.TestDateMidnight_Properties)  Time elapsed: 0.001 sec  <<< ERROR!
org.joda.time.IllegalFieldValueException: Value "8" for monthOfYear is not supported
	at org.joda.time.chrono.GJLocaleSymbols.monthOfYearTextToValue(GJLocaleSymbols.java:101)
	at org.joda.time.chrono.GJMonthOfYearDateTimeField.convertText(GJMonthOfYearDateTimeField.java:53)
	at org.joda.time.field.BaseDateTimeField.set(BaseDateTimeField.java:618)
	at org.joda.time.chrono.ZonedChronology$ZonedDateTimeField.set(ZonedChronology.java:496)
	at org.joda.time.DateMidnight$Property.setCopy(DateMidnight.java:1378)
	at org.joda.time.DateMidnight$Property.setCopy(DateMidnight.java:1394)
	at org.joda.time.TestDateMidnight_Properties.testPropertySetTextMonthOfYear(TestDateMidnight_Properties.java:260)

testPropertySetCopyTextMonth(org.joda.time.TestLocalDateTime_Properties)  Time elapsed: 0 sec  <<< ERROR!
org.joda.time.IllegalFieldValueException: Value "12" for monthOfYear is not supported
	at org.joda.time.chrono.GJLocaleSymbols.monthOfYearTextToValue(GJLocaleSymbols.java:101)
	at org.joda.time.chrono.GJMonthOfYearDateTimeField.convertText(GJMonthOfYearDateTimeField.java:53)
	at org.joda.time.field.BaseDateTimeField.set(BaseDateTimeField.java:618)
	at org.joda.time.LocalDateTime$Property.setCopy(LocalDateTime.java:2290)
	at org.joda.time.LocalDateTime$Property.setCopy(LocalDateTime.java:2303)
	at org.joda.time.TestLocalDateTime_Properties.testPropertySetCopyTextMonth(TestLocalDateTime_Properties.java:306)

testPropertySetCopyTextMonth(org.joda.time.TestLocalDate_Properties)  Time elapsed: 0 sec  <<< ERROR!
org.joda.time.IllegalFieldValueException: Value "12" for monthOfYear is not supported
	at org.joda.time.chrono.GJLocaleSymbols.monthOfYearTextToValue(GJLocaleSymbols.java:101)
	at org.joda.time.chrono.GJMonthOfYearDateTimeField.convertText(GJMonthOfYearDateTimeField.java:53)
	at org.joda.time.field.BaseDateTimeField.set(BaseDateTimeField.java:618)
	at org.joda.time.LocalDate$Property.setCopy(LocalDate.java:2021)
	at org.joda.time.LocalDate$Property.setCopy(LocalDate.java:2034)
	at org.joda.time.TestLocalDate_Properties.testPropertySetCopyTextMonth(TestLocalDate_Properties.java:301)

testPropertySetTextMonth(org.joda.time.TestYearMonthDay_Properties)  Time elapsed: 0 sec  <<< ERROR!
org.joda.time.IllegalFieldValueException: Value "12" for monthOfYear is not supported
	at org.joda.time.chrono.GJLocaleSymbols.monthOfYearTextToValue(GJLocaleSymbols.java:101)
	at org.joda.time.chrono.GJMonthOfYearDateTimeField.convertText(GJMonthOfYearDateTimeField.java:53)
	at org.joda.time.field.BaseDateTimeField.set(BaseDateTimeField.java:654)
	at org.joda.time.YearMonthDay$Property.setCopy(YearMonthDay.java:1069)
	at org.joda.time.YearMonthDay$Property.setCopy(YearMonthDay.java:1084)
	at org.joda.time.TestYearMonthDay_Properties.testPropertySetTextMonth(TestYearMonthDay_Properties.java:304)

testPropertySetTextMonth(org.joda.time.TestYearMonth_Properties)  Time elapsed: 0 sec  <<< ERROR!
org.joda.time.IllegalFieldValueException: Value "12" for monthOfYear is not supported
	at org.joda.time.chrono.GJLocaleSymbols.monthOfYearTextToValue(GJLocaleSymbols.java:101)
	at org.joda.time.chrono.GJMonthOfYearDateTimeField.convertText(GJMonthOfYearDateTimeField.java:53)
	at org.joda.time.field.BaseDateTimeField.set(BaseDateTimeField.java:654)
	at org.joda.time.YearMonth$Property.setCopy(YearMonth.java:972)
	at org.joda.time.YearMonth$Property.setCopy(YearMonth.java:987)
	at org.joda.time.TestYearMonth_Properties.testPropertySetTextMonth(TestYearMonth_Properties.java:271)

testPropertySetTextMonthOfYear(org.joda.time.TestMonthDay_Properties)  Time elapsed: 0 sec  <<< ERROR!
org.joda.time.IllegalFieldValueException: Value "12" for monthOfYear is not supported
	at org.joda.time.chrono.GJLocaleSymbols.monthOfYearTextToValue(GJLocaleSymbols.java:101)
	at org.joda.time.chrono.GJMonthOfYearDateTimeField.convertText(GJMonthOfYearDateTimeField.java:53)
	at org.joda.time.field.BaseDateTimeField.set(BaseDateTimeField.java:654)
	at org.joda.time.MonthDay$Property.setCopy(MonthDay.java:958)
	at org.joda.time.MonthDay$Property.setCopy(MonthDay.java:973)
	at org.joda.time.TestMonthDay_Properties.testPropertySetTextMonthOfYear(TestMonthDay_Properties.java:148)


Results :

Tests in error: 
  org.joda.time.TestDateMidnight_Properties#testPropertySetTextMonthOfYear IllegalFieldValueException
  org.joda.time.TestDateTime_Properties#testPropertySetTextDayOfWeek IllegalFieldValueException
  org.joda.time.TestDateTime_Properties#testPropertySetTextMonthOfYear IllegalFieldValueException
  org.joda.time.TestLocalDateTime_Properties#testPropertySetCopyTextMonth IllegalFieldValueException
  org.joda.time.TestLocalDate_Properties#testPropertySetCopyTextMonth IllegalFieldValueException
  org.joda.time.TestMonthDay_Properties#testPropertySetTextMonthOfYear IllegalFieldValueException
  org.joda.time.TestMutableDateTime_Properties#testPropertySetTextDayOfWeek IllegalFieldValueException
  org.joda.time.TestMutableDateTime_Properties#testPropertySetTextMonthOfYear IllegalFieldValueException
  org.joda.time.TestYearMonthDay_Properties#testPropertySetTextMonth IllegalFieldValueException
  org.joda.time.TestYearMonth_Properties#testPropertySetTextMonth IllegalFieldValueException

Tests run: 4157, Failures: 0, Errors: 10, Skipped: 0

[INFO] ------------------------------------------------------------------------
[INFO] BUILD FAILURE
[INFO] ------------------------------------------------------------------------
[INFO] Total time: 15.441s
[INFO] Finished at: Thu Aug 06 01:00:16 BST 2015
[INFO] Final Memory: 9M/213M
[INFO] ------------------------------------------------------------------------
[ERROR] Failed to execute goal org.apache.maven.plugins:maven-surefire-plugin:2.18.1:test (default-test) on project joda-time: There are test failures.
[ERROR] 
[ERROR] Please refer to /home/perham/Study/LittleDarwin/Cases/joda-time-2.8.1/target/surefire-reports for the individual test results.
[ERROR] -> [Help 1]
[ERROR] 
[ERROR] To see the full stack trace of the errors, re-run Maven with the -e switch.
[ERROR] Re-run Maven using the -X switch to enable full debug logging.
[ERROR] 
[ERROR] For more information about the errors and possible solutions, please read the following articles:
[ERROR] [Help 1] http://cwiki.apache.org/confluence/display/MAVEN/MojoFailureException
