[INFO] Scanning for projects...
[INFO]                                                                         
[INFO] ------------------------------------------------------------------------
[INFO] Building Joda-Time 2.8.1
[INFO] ------------------------------------------------------------------------
[INFO] 
[INFO] --- maven-resources-plugin:2.7:resources (default-resources) @ joda-time ---
[INFO] Using 'UTF-8' encoding to copy filtered resources.
[INFO] Copying 2 resources to META-INF
[INFO] Copying 10 resources
[INFO] 
[INFO] --- maven-compiler-plugin:3.3:compile (default-compile) @ joda-time ---
[INFO] Changes detected - recompiling the module!
[INFO] Compiling 166 source files to /home/perham/Study/LittleDarwin/Cases/joda-time-2.8.1/target/classes
[INFO] 
[INFO] --- exec-maven-plugin:1.4.0:java (compile-tzdb) @ joda-time ---
Writing zoneinfo files
Writing ZoneInfoMap
[INFO] 
[INFO] --- maven-resources-plugin:2.7:testResources (default-testResources) @ joda-time ---
[INFO] Using 'UTF-8' encoding to copy filtered resources.
[INFO] Copying 34 resources
[INFO] 
[INFO] --- maven-compiler-plugin:3.3:testCompile (default-testCompile) @ joda-time ---
[INFO] Nothing to compile - all classes are up to date
[INFO] 
[INFO] --- maven-surefire-plugin:2.18.1:test (default-test) @ joda-time ---
[INFO] Surefire report directory: /home/perham/Study/LittleDarwin/Cases/joda-time-2.8.1/target/surefire-reports

-------------------------------------------------------
 T E S T S
-------------------------------------------------------
Running org.joda.time.TestAllPackages

TestBuddhistChronology.testCalendar

TestCopticChronology.testCalendar

TestEthiopicChronology.testCalendar

TestIslamicChronology.testCalendar

Testing Gregorian chronology over 1000 iterations
100% complete (i=1000)

Testing Julian chronology over 1000 iterations
100% complete (i=1000)
Writing zoneinfo files
Writing ZoneInfoMap
Tests run: 4157, Failures: 0, Errors: 29, Skipped: 0, Time elapsed: 5.249 sec <<< FAILURE! - in org.joda.time.TestAllPackages
testGetters(org.joda.time.TestLocalDate_Basics)  Time elapsed: 0.004 sec  <<< ERROR!
java.lang.NullPointerException
	at org.joda.time.chrono.GJChronology.getDateTimeMillis(GJChronology.java:73)
	at org.joda.time.LocalDate.<init>(LocalDate.java:457)
	at org.joda.time.TestLocalDate_Basics.testGetters(TestLocalDate_Basics.java:624)

testWithers(org.joda.time.TestLocalDate_Basics)  Time elapsed: 0 sec  <<< ERROR!
java.lang.NullPointerException
	at org.joda.time.chrono.GJChronology.getDateTimeMillis(GJChronology.java:73)
	at org.joda.time.LocalDate.<init>(LocalDate.java:457)
	at org.joda.time.TestLocalDate_Basics.testWithers(TestLocalDate_Basics.java:640)

testProperty(org.joda.time.TestLocalDate_Basics)  Time elapsed: 0.001 sec  <<< ERROR!
java.lang.NullPointerException
	at org.joda.time.chrono.GJChronology.getDateTimeMillis(GJChronology.java:73)
	at org.joda.time.LocalDate.<init>(LocalDate.java:457)
	at org.joda.time.TestLocalDate_Basics.testProperty(TestLocalDate_Basics.java:1080)

test_plusYears_positiveToZero_crossCutover(org.joda.time.chrono.TestGJDate)  Time elapsed: 0.001 sec  <<< ERROR!
java.lang.NullPointerException
	at org.joda.time.chrono.GJChronology.getDateTimeMillis(GJChronology.java:73)
	at org.joda.time.LocalDate.<init>(LocalDate.java:457)
	at org.joda.time.chrono.TestGJDate.test_plusYears_positiveToZero_crossCutover(TestGJDate.java:97)

test_plusYears_positiveToNegative_crossCutover(org.joda.time.chrono.TestGJDate)  Time elapsed: 0.001 sec  <<< ERROR!
java.lang.NullPointerException
	at org.joda.time.chrono.GJChronology.getDateTimeMillis(GJChronology.java:73)
	at org.joda.time.LocalDate.<init>(LocalDate.java:457)
	at org.joda.time.chrono.TestGJDate.test_plusYears_positiveToNegative_crossCutover(TestGJDate.java:103)

test_plusYears_negativeToPositive_crossCutover(org.joda.time.chrono.TestGJDate)  Time elapsed: 0.001 sec  <<< ERROR!
java.lang.NullPointerException
	at org.joda.time.chrono.GJChronology.getDateTimeMillis(GJChronology.java:73)
	at org.joda.time.LocalDate.<init>(LocalDate.java:457)
	at org.joda.time.chrono.TestGJDate.test_plusYears_negativeToPositive_crossCutover(TestGJDate.java:109)

test_plusWeekyears_positiveToZero_crossCutover(org.joda.time.chrono.TestGJDate)  Time elapsed: 0 sec  <<< ERROR!
java.lang.NullPointerException
	at org.joda.time.chrono.GJChronology.getDateTimeMillis(GJChronology.java:73)
	at org.joda.time.LocalDate.<init>(LocalDate.java:457)
	at org.joda.time.chrono.TestGJDate.test_plusWeekyears_positiveToZero_crossCutover(TestGJDate.java:116)

test_plusWeekyears_positiveToNegative_crossCutover(org.joda.time.chrono.TestGJDate)  Time elapsed: 0.001 sec  <<< ERROR!
java.lang.NullPointerException
	at org.joda.time.chrono.GJChronology.getDateTimeMillis(GJChronology.java:73)
	at org.joda.time.LocalDate.<init>(LocalDate.java:457)
	at org.joda.time.chrono.TestGJDate.test_plusWeekyears_positiveToNegative_crossCutover(TestGJDate.java:122)

test_plusYears_positiveToPositive(org.joda.time.chrono.TestGJDate)  Time elapsed: 0.001 sec  <<< ERROR!
java.lang.NullPointerException
	at org.joda.time.chrono.GJChronology.getDateTimeMillis(GJChronology.java:73)
	at org.joda.time.LocalDate.<init>(LocalDate.java:457)
	at org.joda.time.chrono.TestGJDate.test_plusYears_positiveToPositive(TestGJDate.java:53)

test_plusYears_positiveToZero(org.joda.time.chrono.TestGJDate)  Time elapsed: 0.001 sec  <<< ERROR!
java.lang.NullPointerException
	at org.joda.time.chrono.GJChronology.getDateTimeMillis(GJChronology.java:73)
	at org.joda.time.LocalDate.<init>(LocalDate.java:457)
	at org.joda.time.chrono.TestGJDate.test_plusYears_positiveToZero(TestGJDate.java:59)

test_plusYears_positiveToNegative(org.joda.time.chrono.TestGJDate)  Time elapsed: 0.001 sec  <<< ERROR!
java.lang.NullPointerException
	at org.joda.time.chrono.GJChronology.getDateTimeMillis(GJChronology.java:73)
	at org.joda.time.LocalDate.<init>(LocalDate.java:457)
	at org.joda.time.chrono.TestGJDate.test_plusYears_positiveToNegative(TestGJDate.java:65)

test_plusYears_negativeToNegative(org.joda.time.chrono.TestGJDate)  Time elapsed: 0 sec  <<< ERROR!
java.lang.NullPointerException
	at org.joda.time.chrono.GJChronology.getDateTimeMillis(GJChronology.java:73)
	at org.joda.time.LocalDate.<init>(LocalDate.java:457)
	at org.joda.time.chrono.TestGJDate.test_plusYears_negativeToNegative(TestGJDate.java:72)

test_plusYears_negativeToZero(org.joda.time.chrono.TestGJDate)  Time elapsed: 0.001 sec  <<< ERROR!
java.lang.NullPointerException
	at org.joda.time.chrono.GJChronology.getDateTimeMillis(GJChronology.java:73)
	at org.joda.time.LocalDate.<init>(LocalDate.java:457)
	at org.joda.time.chrono.TestGJDate.test_plusYears_negativeToZero(TestGJDate.java:78)

test_plusYears_negativeToPositive(org.joda.time.chrono.TestGJDate)  Time elapsed: 0.001 sec  <<< ERROR!
java.lang.NullPointerException
	at org.joda.time.chrono.GJChronology.getDateTimeMillis(GJChronology.java:73)
	at org.joda.time.LocalDate.<init>(LocalDate.java:457)
	at org.joda.time.chrono.TestGJDate.test_plusYears_negativeToPositive(TestGJDate.java:84)

test_plusYears_positiveToPositive_crossCutover(org.joda.time.chrono.TestGJDate)  Time elapsed: 0 sec  <<< ERROR!
java.lang.NullPointerException
	at org.joda.time.chrono.GJChronology.getDateTimeMillis(GJChronology.java:73)
	at org.joda.time.LocalDate.<init>(LocalDate.java:457)
	at org.joda.time.chrono.TestGJDate.test_plusYears_positiveToPositive_crossCutover(TestGJDate.java:91)

testParseLocalDate_yearOfEra(org.joda.time.format.TestDateTimeFormatter)  Time elapsed: 0 sec  <<< ERROR!
java.lang.NullPointerException
	at org.joda.time.chrono.GJChronology.getDateTimeMillis(GJChronology.java:73)
	at org.joda.time.LocalDate.<init>(LocalDate.java:457)
	at org.joda.time.format.TestDateTimeFormatter.testParseLocalDate_yearOfEra(TestDateTimeFormatter.java:383)

testParseLocalDate_yearOfCentury(org.joda.time.format.TestDateTimeFormatter)  Time elapsed: 0.001 sec  <<< ERROR!
java.lang.NullPointerException
	at org.joda.time.chrono.GJChronology.getDateTimeMillis(GJChronology.java:73)
	at org.joda.time.LocalDate.<init>(LocalDate.java:457)
	at org.joda.time.format.TestDateTimeFormatter.testParseLocalDate_yearOfCentury(TestDateTimeFormatter.java:400)

testParseLocalDate_monthDay_feb29(org.joda.time.format.TestDateTimeFormatter)  Time elapsed: 0 sec  <<< ERROR!
java.lang.NullPointerException
	at org.joda.time.chrono.GJChronology.getDateTimeMillis(GJChronology.java:73)
	at org.joda.time.LocalDate.<init>(LocalDate.java:457)
	at org.joda.time.format.TestDateTimeFormatter.testParseLocalDate_monthDay_feb29(TestDateTimeFormatter.java:411)

testParseLocalDate_monthDay_withDefaultYear_feb29(org.joda.time.format.TestDateTimeFormatter)  Time elapsed: 0 sec  <<< ERROR!
java.lang.NullPointerException
	at org.joda.time.chrono.GJChronology.getDateTimeMillis(GJChronology.java:73)
	at org.joda.time.LocalDate.<init>(LocalDate.java:457)
	at org.joda.time.format.TestDateTimeFormatter.testParseLocalDate_monthDay_withDefaultYear_feb29(TestDateTimeFormatter.java:422)

testParseLocalDate_weekyear_month_week_2010(org.joda.time.format.TestDateTimeFormatter)  Time elapsed: 0.001 sec  <<< ERROR!
java.lang.NullPointerException
	at org.joda.time.chrono.GJChronology.getDateTimeMillis(GJChronology.java:73)
	at org.joda.time.LocalDate.<init>(LocalDate.java:457)
	at org.joda.time.format.TestDateTimeFormatter.testParseLocalDate_weekyear_month_week_2010(TestDateTimeFormatter.java:428)

testParseLocalDate_weekyear_month_week_2011(org.joda.time.format.TestDateTimeFormatter)  Time elapsed: 0 sec  <<< ERROR!
java.lang.NullPointerException
	at org.joda.time.chrono.GJChronology.getDateTimeMillis(GJChronology.java:73)
	at org.joda.time.LocalDate.<init>(LocalDate.java:457)
	at org.joda.time.format.TestDateTimeFormatter.testParseLocalDate_weekyear_month_week_2011(TestDateTimeFormatter.java:434)

testParseLocalDate_weekyear_month_week_2012(org.joda.time.format.TestDateTimeFormatter)  Time elapsed: 0.001 sec  <<< ERROR!
java.lang.NullPointerException
	at org.joda.time.chrono.GJChronology.getDateTimeMillis(GJChronology.java:73)
	at org.joda.time.LocalDate.<init>(LocalDate.java:457)
	at org.joda.time.format.TestDateTimeFormatter.testParseLocalDate_weekyear_month_week_2012(TestDateTimeFormatter.java:440)

testParseLocalDate_year_month_week_2010(org.joda.time.format.TestDateTimeFormatter)  Time elapsed: 0 sec  <<< ERROR!
java.lang.NullPointerException
	at org.joda.time.chrono.GJChronology.getDateTimeMillis(GJChronology.java:73)
	at org.joda.time.LocalDate.<init>(LocalDate.java:457)
	at org.joda.time.format.TestDateTimeFormatter.testParseLocalDate_year_month_week_2010(TestDateTimeFormatter.java:454)

testParseLocalDate_year_month_week_2011(org.joda.time.format.TestDateTimeFormatter)  Time elapsed: 0.001 sec  <<< ERROR!
java.lang.NullPointerException
	at org.joda.time.chrono.GJChronology.getDateTimeMillis(GJChronology.java:73)
	at org.joda.time.LocalDate.<init>(LocalDate.java:457)
	at org.joda.time.format.TestDateTimeFormatter.testParseLocalDate_year_month_week_2011(TestDateTimeFormatter.java:460)

testParseLocalDate_year_month_week_2012(org.joda.time.format.TestDateTimeFormatter)  Time elapsed: 0 sec  <<< ERROR!
java.lang.NullPointerException
	at org.joda.time.chrono.GJChronology.getDateTimeMillis(GJChronology.java:73)
	at org.joda.time.LocalDate.<init>(LocalDate.java:457)
	at org.joda.time.format.TestDateTimeFormatter.testParseLocalDate_year_month_week_2012(TestDateTimeFormatter.java:466)

testParseLocalDate_year_month_week_2013(org.joda.time.format.TestDateTimeFormatter)  Time elapsed: 0 sec  <<< ERROR!
java.lang.NullPointerException
	at org.joda.time.chrono.GJChronology.getDateTimeMillis(GJChronology.java:73)
	at org.joda.time.LocalDate.<init>(LocalDate.java:457)
	at org.joda.time.format.TestDateTimeFormatter.testParseLocalDate_year_month_week_2013(TestDateTimeFormatter.java:472)

testParseLocalDate_year_month_week_2014(org.joda.time.format.TestDateTimeFormatter)  Time elapsed: 0.001 sec  <<< ERROR!
java.lang.NullPointerException
	at org.joda.time.chrono.GJChronology.getDateTimeMillis(GJChronology.java:73)
	at org.joda.time.LocalDate.<init>(LocalDate.java:457)
	at org.joda.time.format.TestDateTimeFormatter.testParseLocalDate_year_month_week_2014(TestDateTimeFormatter.java:478)

testParseLocalDate_year_month_week_2015(org.joda.time.format.TestDateTimeFormatter)  Time elapsed: 0 sec  <<< ERROR!
java.lang.NullPointerException
	at org.joda.time.chrono.GJChronology.getDateTimeMillis(GJChronology.java:73)
	at org.joda.time.LocalDate.<init>(LocalDate.java:457)
	at org.joda.time.format.TestDateTimeFormatter.testParseLocalDate_year_month_week_2015(TestDateTimeFormatter.java:484)

testParseLocalDate_year_month_week_2016(org.joda.time.format.TestDateTimeFormatter)  Time elapsed: 0 sec  <<< ERROR!
java.lang.NullPointerException
	at org.joda.time.chrono.GJChronology.getDateTimeMillis(GJChronology.java:73)
	at org.joda.time.LocalDate.<init>(LocalDate.java:457)
	at org.joda.time.format.TestDateTimeFormatter.testParseLocalDate_year_month_week_2016(TestDateTimeFormatter.java:490)


Results :

Tests in error: 
  org.joda.time.TestLocalDate_Basics#testGetters NullPointerException
  org.joda.time.TestLocalDate_Basics#testProperty NullPointerException
  org.joda.time.TestLocalDate_Basics#testWithers NullPointerException
  org.joda.time.chrono.TestGJDate#test_plusWeekyears_positiveToNegative_crossCutover NullPointerException
  org.joda.time.chrono.TestGJDate#test_plusWeekyears_positiveToZero_crossCutover NullPointerException
  org.joda.time.chrono.TestGJDate#test_plusYears_negativeToNegative NullPointerException
  org.joda.time.chrono.TestGJDate#test_plusYears_negativeToPositive NullPointerException
  org.joda.time.chrono.TestGJDate#test_plusYears_negativeToPositive_crossCutover NullPointerException
  org.joda.time.chrono.TestGJDate#test_plusYears_negativeToZero NullPointerException
  org.joda.time.chrono.TestGJDate#test_plusYears_positiveToNegative NullPointerException
  org.joda.time.chrono.TestGJDate#test_plusYears_positiveToNegative_crossCutover NullPointerException
  org.joda.time.chrono.TestGJDate#test_plusYears_positiveToPositive NullPointerException
  org.joda.time.chrono.TestGJDate#test_plusYears_positiveToPositive_crossCutover NullPointerException
  org.joda.time.chrono.TestGJDate#test_plusYears_positiveToZero NullPointerException
  org.joda.time.chrono.TestGJDate#test_plusYears_positiveToZero_crossCutover NullPointerException
  org.joda.time.format.TestDateTimeFormatter#testParseLocalDate_monthDay_feb29 NullPointerException
  org.joda.time.format.TestDateTimeFormatter#testParseLocalDate_monthDay_withDefaultYear_feb29 NullPointerException
  org.joda.time.format.TestDateTimeFormatter#testParseLocalDate_weekyear_month_week_2010 NullPointerException
  org.joda.time.format.TestDateTimeFormatter#testParseLocalDate_weekyear_month_week_2011 NullPointerException
  org.joda.time.format.TestDateTimeFormatter#testParseLocalDate_weekyear_month_week_2012 NullPointerException
  org.joda.time.format.TestDateTimeFormatter#testParseLocalDate_yearOfCentury NullPointerException
  org.joda.time.format.TestDateTimeFormatter#testParseLocalDate_yearOfEra NullPointerException
  org.joda.time.format.TestDateTimeFormatter#testParseLocalDate_year_month_week_2010 NullPointerException
  org.joda.time.format.TestDateTimeFormatter#testParseLocalDate_year_month_week_2011 NullPointerException
  org.joda.time.format.TestDateTimeFormatter#testParseLocalDate_year_month_week_2012 NullPointerException
  org.joda.time.format.TestDateTimeFormatter#testParseLocalDate_year_month_week_2013 NullPointerException
  org.joda.time.format.TestDateTimeFormatter#testParseLocalDate_year_month_week_2014 NullPointerException
  org.joda.time.format.TestDateTimeFormatter#testParseLocalDate_year_month_week_2015 NullPointerException
  org.joda.time.format.TestDateTimeFormatter#testParseLocalDate_year_month_week_2016 NullPointerException

Tests run: 4157, Failures: 0, Errors: 29, Skipped: 0

[INFO] ------------------------------------------------------------------------
[INFO] BUILD FAILURE
[INFO] ------------------------------------------------------------------------
[INFO] Total time: 15.354s
[INFO] Finished at: Thu Aug 06 00:52:02 BST 2015
[INFO] Final Memory: 9M/213M
[INFO] ------------------------------------------------------------------------
[ERROR] Failed to execute goal org.apache.maven.plugins:maven-surefire-plugin:2.18.1:test (default-test) on project joda-time: There are test failures.
[ERROR] 
[ERROR] Please refer to /home/perham/Study/LittleDarwin/Cases/joda-time-2.8.1/target/surefire-reports for the individual test results.
[ERROR] -> [Help 1]
[ERROR] 
[ERROR] To see the full stack trace of the errors, re-run Maven with the -e switch.
[ERROR] Re-run Maven using the -X switch to enable full debug logging.
[ERROR] 
[ERROR] For more information about the errors and possible solutions, please read the following articles:
[ERROR] [Help 1] http://cwiki.apache.org/confluence/display/MAVEN/MojoFailureException
