[INFO] Scanning for projects...
[INFO]                                                                         
[INFO] ------------------------------------------------------------------------
[INFO] Building Joda-Time 2.8.1
[INFO] ------------------------------------------------------------------------
[INFO] 
[INFO] --- maven-resources-plugin:2.7:resources (default-resources) @ joda-time ---
[INFO] Using 'UTF-8' encoding to copy filtered resources.
[INFO] Copying 2 resources to META-INF
[INFO] Copying 10 resources
[INFO] 
[INFO] --- maven-compiler-plugin:3.3:compile (default-compile) @ joda-time ---
[INFO] Changes detected - recompiling the module!
[INFO] Compiling 166 source files to /home/perham/Study/LittleDarwin/Cases/joda-time-2.8.1/target/classes
[INFO] 
[INFO] --- exec-maven-plugin:1.4.0:java (compile-tzdb) @ joda-time ---
Writing zoneinfo files
Writing ZoneInfoMap
[INFO] 
[INFO] --- maven-resources-plugin:2.7:testResources (default-testResources) @ joda-time ---
[INFO] Using 'UTF-8' encoding to copy filtered resources.
[INFO] Copying 34 resources
[INFO] 
[INFO] --- maven-compiler-plugin:3.3:testCompile (default-testCompile) @ joda-time ---
[INFO] Nothing to compile - all classes are up to date
[INFO] 
[INFO] --- maven-surefire-plugin:2.18.1:test (default-test) @ joda-time ---
[INFO] Surefire report directory: /home/perham/Study/LittleDarwin/Cases/joda-time-2.8.1/target/surefire-reports

-------------------------------------------------------
 T E S T S
-------------------------------------------------------
Running org.joda.time.TestAllPackages

TestBuddhistChronology.testCalendar

TestCopticChronology.testCalendar

TestEthiopicChronology.testCalendar

TestIslamicChronology.testCalendar

Testing Gregorian chronology over 1000 iterations
100% complete (i=1000)

Testing Julian chronology over 1000 iterations
100% complete (i=1000)
Writing zoneinfo files
Writing ZoneInfoMap
Tests run: 4157, Failures: 1, Errors: 11, Skipped: 0, Time elapsed: 5.116 sec <<< FAILURE! - in org.joda.time.TestAllPackages
testWithers(org.joda.time.TestDateTime_Basics)  Time elapsed: 0.006 sec  <<< FAILURE!
junit.framework.AssertionFailedError: expected:<10> but was:<11>
	at junit.framework.Assert.fail(Assert.java:47)
	at junit.framework.Assert.failNotEquals(Assert.java:280)
	at junit.framework.Assert.assertEquals(Assert.java:64)
	at junit.framework.Assert.assertEquals(Assert.java:198)
	at junit.framework.Assert.assertEquals(Assert.java:204)
	at org.joda.time.TestDateTime_Basics.check(TestDateTime_Basics.java:1287)
	at org.joda.time.TestDateTime_Basics.testWithers(TestDateTime_Basics.java:254)

testGetters(org.joda.time.TestLocalDateTime_Basics)  Time elapsed: 0.001 sec  <<< ERROR!
java.lang.NullPointerException
	at org.joda.time.chrono.GJChronology.getDateTimeMillis(GJChronology.java:79)
	at org.joda.time.LocalDateTime.<init>(LocalDateTime.java:511)
	at org.joda.time.TestLocalDateTime_Basics.testGetters(TestLocalDateTime_Basics.java:717)

testWithers(org.joda.time.TestLocalDateTime_Basics)  Time elapsed: 0.001 sec  <<< ERROR!
java.lang.NullPointerException
	at org.joda.time.chrono.GJChronology.getDateTimeMillis(GJChronology.java:79)
	at org.joda.time.LocalDateTime.<init>(LocalDateTime.java:511)
	at org.joda.time.TestLocalDateTime_Basics.testWithers(TestLocalDateTime_Basics.java:738)

testProperty(org.joda.time.TestLocalDateTime_Basics)  Time elapsed: 0.001 sec  <<< ERROR!
java.lang.NullPointerException
	at org.joda.time.chrono.GJChronology.getDateTimeMillis(GJChronology.java:79)
	at org.joda.time.LocalDateTime.<init>(LocalDateTime.java:511)
	at org.joda.time.TestLocalDateTime_Basics.testProperty(TestLocalDateTime_Basics.java:1022)

testKeyYears(org.joda.time.chrono.TestBuddhistChronology)  Time elapsed: 0 sec  <<< ERROR!
java.lang.NullPointerException
	at org.joda.time.chrono.GJChronology.getDateTimeMillis(GJChronology.java:79)
	at org.joda.time.base.BaseDateTime.<init>(BaseDateTime.java:258)
	at org.joda.time.DateTime.<init>(DateTime.java:532)
	at org.joda.time.chrono.TestBuddhistChronology.testKeyYears(TestBuddhistChronology.java:311)

testIllegalDates(org.joda.time.chrono.TestGJChronology)  Time elapsed: 0.001 sec  <<< ERROR!
java.lang.NullPointerException
	at org.joda.time.chrono.GJChronology.getDateTimeMillis(GJChronology.java:79)
	at org.joda.time.base.BaseDateTime.<init>(BaseDateTime.java:258)
	at org.joda.time.DateTime.<init>(DateTime.java:532)
	at org.joda.time.chrono.TestGJChronology.testIllegalDates(TestGJChronology.java:351)

testParseEquivalence(org.joda.time.chrono.TestGJChronology)  Time elapsed: 0 sec  <<< ERROR!
java.lang.NullPointerException
	at org.joda.time.chrono.GJChronology.getDateTimeMillis(GJChronology.java:79)
	at org.joda.time.base.BaseDateTime.<init>(BaseDateTime.java:258)
	at org.joda.time.DateTime.<init>(DateTime.java:532)
	at org.joda.time.chrono.TestGJChronology.testParse(TestGJChronology.java:375)
	at org.joda.time.chrono.TestGJChronology.testParseEquivalence(TestGJChronology.java:362)

testLeapYearRulesConstruction(org.joda.time.chrono.TestGJChronology)  Time elapsed: 0.001 sec  <<< ERROR!
java.lang.NullPointerException
	at org.joda.time.chrono.GJChronology.getDateTimeMillis(GJChronology.java:79)
	at org.joda.time.base.BaseDateTime.<init>(BaseDateTime.java:258)
	at org.joda.time.DateMidnight.<init>(DateMidnight.java:350)
	at org.joda.time.chrono.TestGJChronology.testLeapYearRulesConstruction(TestGJChronology.java:529)

testLeapYearRulesConstructionInvalid(org.joda.time.chrono.TestGJChronology)  Time elapsed: 0.001 sec  <<< ERROR!
java.lang.NullPointerException
	at org.joda.time.chrono.GJChronology.getDateTimeMillis(GJChronology.java:79)
	at org.joda.time.base.BaseDateTime.<init>(BaseDateTime.java:258)
	at org.joda.time.DateMidnight.<init>(DateMidnight.java:350)
	at org.joda.time.chrono.TestGJChronology.testLeapYearRulesConstructionInvalid(TestGJChronology.java:538)

testParseLocalDateTime_monthDay_feb29(org.joda.time.format.TestDateTimeFormatter)  Time elapsed: 0.001 sec  <<< ERROR!
java.lang.NullPointerException
	at org.joda.time.chrono.GJChronology.getDateTimeMillis(GJChronology.java:79)
	at org.joda.time.LocalDateTime.<init>(LocalDateTime.java:511)
	at org.joda.time.format.TestDateTimeFormatter.testParseLocalDateTime_monthDay_feb29(TestDateTimeFormatter.java:526)

testParseLocalDateTime_monthDay_withDefaultYear_feb29(org.joda.time.format.TestDateTimeFormatter)  Time elapsed: 0.001 sec  <<< ERROR!
java.lang.NullPointerException
	at org.joda.time.chrono.GJChronology.getDateTimeMillis(GJChronology.java:79)
	at org.joda.time.LocalDateTime.<init>(LocalDateTime.java:511)
	at org.joda.time.format.TestDateTimeFormatter.testParseLocalDateTime_monthDay_withDefaultYear_feb29(TestDateTimeFormatter.java:537)

testFormat_yearOfEraParse(org.joda.time.format.TestDateTimeFormat)  Time elapsed: 0.001 sec  <<< ERROR!
java.lang.NullPointerException
	at org.joda.time.chrono.GJChronology.getDateTimeMillis(GJChronology.java:79)
	at org.joda.time.base.BaseDateTime.<init>(BaseDateTime.java:258)
	at org.joda.time.DateTime.<init>(DateTime.java:532)
	at org.joda.time.format.TestDateTimeFormat.testFormat_yearOfEraParse(TestDateTimeFormat.java:199)


Results :

Failed tests: 
  org.joda.time.TestDateTime_Basics#testWithers AssertionFailedError expected:<1...
Tests in error: 
  org.joda.time.TestLocalDateTime_Basics#testGetters NullPointerException
  org.joda.time.TestLocalDateTime_Basics#testProperty NullPointerException
  org.joda.time.TestLocalDateTime_Basics#testWithers NullPointerException
  org.joda.time.chrono.TestBuddhistChronology#testKeyYears NullPointerException
  org.joda.time.chrono.TestGJChronology#testIllegalDates NullPointerException
  org.joda.time.chrono.TestGJChronology#testLeapYearRulesConstruction NullPointerException
  org.joda.time.chrono.TestGJChronology#testLeapYearRulesConstructionInvalid NullPointerException
  org.joda.time.chrono.TestGJChronology#testParseEquivalence NullPointerException
  org.joda.time.format.TestDateTimeFormat#testFormat_yearOfEraParse NullPointerException
  org.joda.time.format.TestDateTimeFormatter#testParseLocalDateTime_monthDay_feb29 NullPointerException
  org.joda.time.format.TestDateTimeFormatter#testParseLocalDateTime_monthDay_withDefaultYear_feb29 NullPointerException

Tests run: 4157, Failures: 1, Errors: 11, Skipped: 0

[INFO] ------------------------------------------------------------------------
[INFO] BUILD FAILURE
[INFO] ------------------------------------------------------------------------
[INFO] Total time: 15.645s
[INFO] Finished at: Thu Aug 06 00:51:10 BST 2015
[INFO] Final Memory: 9M/213M
[INFO] ------------------------------------------------------------------------
[ERROR] Failed to execute goal org.apache.maven.plugins:maven-surefire-plugin:2.18.1:test (default-test) on project joda-time: There are test failures.
[ERROR] 
[ERROR] Please refer to /home/perham/Study/LittleDarwin/Cases/joda-time-2.8.1/target/surefire-reports for the individual test results.
[ERROR] -> [Help 1]
[ERROR] 
[ERROR] To see the full stack trace of the errors, re-run Maven with the -e switch.
[ERROR] Re-run Maven using the -X switch to enable full debug logging.
[ERROR] 
[ERROR] For more information about the errors and possible solutions, please read the following articles:
[ERROR] [Help 1] http://cwiki.apache.org/confluence/display/MAVEN/MojoFailureException
