[INFO] Scanning for projects...
[INFO]                                                                         
[INFO] ------------------------------------------------------------------------
[INFO] Building Joda-Time 2.8.1
[INFO] ------------------------------------------------------------------------
[INFO] 
[INFO] --- maven-resources-plugin:2.7:resources (default-resources) @ joda-time ---
[INFO] Using 'UTF-8' encoding to copy filtered resources.
[INFO] Copying 2 resources to META-INF
[INFO] Copying 10 resources
[INFO] 
[INFO] --- maven-compiler-plugin:3.3:compile (default-compile) @ joda-time ---
[INFO] Changes detected - recompiling the module!
[INFO] Compiling 166 source files to /home/perham/Study/LittleDarwin/Cases/joda-time-2.8.1/target/classes
[INFO] 
[INFO] --- exec-maven-plugin:1.4.0:java (compile-tzdb) @ joda-time ---
Writing zoneinfo files
Writing ZoneInfoMap
[INFO] 
[INFO] --- maven-resources-plugin:2.7:testResources (default-testResources) @ joda-time ---
[INFO] Using 'UTF-8' encoding to copy filtered resources.
[INFO] Copying 34 resources
[INFO] 
[INFO] --- maven-compiler-plugin:3.3:testCompile (default-testCompile) @ joda-time ---
[INFO] Nothing to compile - all classes are up to date
[INFO] 
[INFO] --- maven-surefire-plugin:2.18.1:test (default-test) @ joda-time ---
[INFO] Surefire report directory: /home/perham/Study/LittleDarwin/Cases/joda-time-2.8.1/target/surefire-reports

-------------------------------------------------------
 T E S T S
-------------------------------------------------------
Running org.joda.time.TestAllPackages

TestBuddhistChronology.testCalendar

TestCopticChronology.testCalendar

TestEthiopicChronology.testCalendar

TestIslamicChronology.testCalendar

Testing Gregorian chronology over 1000 iterations
100% complete (i=1000)

Testing Julian chronology over 1000 iterations
100% complete (i=1000)
Writing zoneinfo files
Writing ZoneInfoMap
Tests run: 4157, Failures: 71, Errors: 5, Skipped: 0, Time elapsed: 4.875 sec <<< FAILURE! - in org.joda.time.TestAllPackages
testWithTime_int_int_int_int(org.joda.time.TestDateTime_Basics)  Time elapsed: 0.004 sec  <<< FAILURE!
junit.framework.AssertionFailedError: expected:<1018009440000> but was:<1010838240000>
	at junit.framework.Assert.fail(Assert.java:47)
	at junit.framework.Assert.failNotEquals(Assert.java:280)
	at junit.framework.Assert.assertEquals(Assert.java:64)
	at junit.framework.Assert.assertEquals(Assert.java:133)
	at junit.framework.Assert.assertEquals(Assert.java:139)
	at org.joda.time.TestDateTime_Basics.testWithTime_int_int_int_int(TestDateTime_Basics.java:883)

testWithTime_LocalTime(org.joda.time.TestDateTime_Basics)  Time elapsed: 0.001 sec  <<< FAILURE!
junit.framework.AssertionFailedError: expected:<1018009440000> but was:<1010838240000>
	at junit.framework.Assert.fail(Assert.java:47)
	at junit.framework.Assert.failNotEquals(Assert.java:280)
	at junit.framework.Assert.assertEquals(Assert.java:64)
	at junit.framework.Assert.assertEquals(Assert.java:133)
	at junit.framework.Assert.assertEquals(Assert.java:139)
	at org.joda.time.TestDateTime_Basics.testWithTime_LocalTime(TestDateTime_Basics.java:904)

testWithDurationAdded_RP_int(org.joda.time.TestDateTime_Basics)  Time elapsed: 0.002 sec  <<< FAILURE!
junit.framework.AssertionFailedError: expected:<2003-10-03T06:08:10.012-00:01:15> but was:<2003-10-04T06:08:10.012-00:01:15>
	at junit.framework.Assert.fail(Assert.java:47)
	at junit.framework.Assert.failNotEquals(Assert.java:280)
	at junit.framework.Assert.assertEquals(Assert.java:64)
	at junit.framework.Assert.assertEquals(Assert.java:71)
	at org.joda.time.TestDateTime_Basics.testWithDurationAdded_RP_int(TestDateTime_Basics.java:1020)

testPlus_RP(org.joda.time.TestDateTime_Basics)  Time elapsed: 0.001 sec  <<< FAILURE!
junit.framework.AssertionFailedError: expected:<2003-10-03T06:08:10.012-00:01:15> but was:<2003-10-04T06:08:10.012-00:01:15>
	at junit.framework.Assert.fail(Assert.java:47)
	at junit.framework.Assert.failNotEquals(Assert.java:280)
	at junit.framework.Assert.assertEquals(Assert.java:64)
	at junit.framework.Assert.assertEquals(Assert.java:71)
	at org.joda.time.TestDateTime_Basics.testPlus_RP(TestDateTime_Basics.java:1059)

testWithers(org.joda.time.TestDateTime_Basics)  Time elapsed: 0.001 sec  <<< FAILURE!
junit.framework.AssertionFailedError: expected:<6> but was:<5>
	at junit.framework.Assert.fail(Assert.java:47)
	at junit.framework.Assert.failNotEquals(Assert.java:280)
	at junit.framework.Assert.assertEquals(Assert.java:64)
	at junit.framework.Assert.assertEquals(Assert.java:198)
	at junit.framework.Assert.assertEquals(Assert.java:204)
	at org.joda.time.TestDateTime_Basics.check(TestDateTime_Basics.java:1285)
	at org.joda.time.TestDateTime_Basics.testWithers(TestDateTime_Basics.java:254)

testPlusMonths_int(org.joda.time.TestDateTime_Basics)  Time elapsed: 0.001 sec  <<< FAILURE!
junit.framework.AssertionFailedError: expected:<2002-08-08T01:02:03.004-00:01:15> but was:<2002-08-09T01:02:03.004-00:01:15>
	at junit.framework.Assert.fail(Assert.java:47)
	at junit.framework.Assert.failNotEquals(Assert.java:280)
	at junit.framework.Assert.assertEquals(Assert.java:64)
	at junit.framework.Assert.assertEquals(Assert.java:71)
	at org.joda.time.TestDateTime_Basics.testPlusMonths_int(TestDateTime_Basics.java:1079)

testMinusMonths_int(org.joda.time.TestDateTime_Basics)  Time elapsed: 0 sec  <<< FAILURE!
junit.framework.AssertionFailedError: expected:<2002-06-08T01:02:03.004-00:01:15> but was:<2002-06-09T01:02:03.004-00:01:15>
	at junit.framework.Assert.fail(Assert.java:47)
	at junit.framework.Assert.failNotEquals(Assert.java:280)
	at junit.framework.Assert.assertEquals(Assert.java:64)
	at junit.framework.Assert.assertEquals(Assert.java:71)
	at org.joda.time.TestDateTime_Basics.testMinusMonths_int(TestDateTime_Basics.java:1187)

testMinusWeeks_int(org.joda.time.TestDateTime_Basics)  Time elapsed: 0 sec  <<< FAILURE!
junit.framework.AssertionFailedError: expected:<2002-07-01T01:02:03.004-00:01:15> but was:<2002-07-02T01:02:03.004-00:01:15>
	at junit.framework.Assert.fail(Assert.java:47)
	at junit.framework.Assert.failNotEquals(Assert.java:280)
	at junit.framework.Assert.assertEquals(Assert.java:64)
	at junit.framework.Assert.assertEquals(Assert.java:71)
	at org.joda.time.TestDateTime_Basics.testMinusWeeks_int(TestDateTime_Basics.java:1197)

testWithDurationAdded_RP_int(org.joda.time.TestDateMidnight_Basics)  Time elapsed: 0 sec  <<< FAILURE!
junit.framework.AssertionFailedError: expected:<2003-10-03T00:00:00.000-00:01:15> but was:<2003-10-04T00:00:00.000-00:01:15>
	at junit.framework.Assert.fail(Assert.java:47)
	at junit.framework.Assert.failNotEquals(Assert.java:280)
	at junit.framework.Assert.assertEquals(Assert.java:64)
	at junit.framework.Assert.assertEquals(Assert.java:71)
	at org.joda.time.TestDateMidnight_Basics.testWithDurationAdded_RP_int(TestDateMidnight_Basics.java:833)

testPlus_RP(org.joda.time.TestDateMidnight_Basics)  Time elapsed: 0.001 sec  <<< FAILURE!
junit.framework.AssertionFailedError: expected:<2003-10-03T00:00:00.000-00:01:15> but was:<2003-10-04T00:00:00.000-00:01:15>
	at junit.framework.Assert.fail(Assert.java:47)
	at junit.framework.Assert.failNotEquals(Assert.java:280)
	at junit.framework.Assert.assertEquals(Assert.java:64)
	at junit.framework.Assert.assertEquals(Assert.java:71)
	at org.joda.time.TestDateMidnight_Basics.testPlus_RP(TestDateMidnight_Basics.java:872)

testWithers(org.joda.time.TestDateMidnight_Basics)  Time elapsed: 0.001 sec  <<< FAILURE!
junit.framework.AssertionFailedError: expected:<6> but was:<5>
	at junit.framework.Assert.fail(Assert.java:47)
	at junit.framework.Assert.failNotEquals(Assert.java:280)
	at junit.framework.Assert.assertEquals(Assert.java:64)
	at junit.framework.Assert.assertEquals(Assert.java:198)
	at junit.framework.Assert.assertEquals(Assert.java:204)
	at org.joda.time.TestDateMidnight_Basics.check(TestDateMidnight_Basics.java:1018)
	at org.joda.time.TestDateMidnight_Basics.testWithers(TestDateMidnight_Basics.java:242)

testPlusMonths_int(org.joda.time.TestDateMidnight_Basics)  Time elapsed: 0 sec  <<< FAILURE!
junit.framework.AssertionFailedError: expected:<2002-08-08T00:00:00.000-00:01:15> but was:<2002-08-09T00:00:00.000-00:01:15>
	at junit.framework.Assert.fail(Assert.java:47)
	at junit.framework.Assert.failNotEquals(Assert.java:280)
	at junit.framework.Assert.assertEquals(Assert.java:64)
	at junit.framework.Assert.assertEquals(Assert.java:71)
	at org.joda.time.TestDateMidnight_Basics.testPlusMonths_int(TestDateMidnight_Basics.java:892)

testMinusMonths_int(org.joda.time.TestDateMidnight_Basics)  Time elapsed: 0.001 sec  <<< FAILURE!
junit.framework.AssertionFailedError: expected:<2002-06-08T00:00:00.000-00:01:15> but was:<2002-06-09T00:00:00.000-00:01:15>
	at junit.framework.Assert.fail(Assert.java:47)
	at junit.framework.Assert.failNotEquals(Assert.java:280)
	at junit.framework.Assert.assertEquals(Assert.java:64)
	at junit.framework.Assert.assertEquals(Assert.java:71)
	at org.joda.time.TestDateMidnight_Basics.testMinusMonths_int(TestDateMidnight_Basics.java:960)

testMinusWeeks_int(org.joda.time.TestDateMidnight_Basics)  Time elapsed: 0.001 sec  <<< FAILURE!
junit.framework.AssertionFailedError: expected:<2002-07-01T00:00:00.000-00:01:15> but was:<2002-07-02T00:00:00.000-00:01:15>
	at junit.framework.Assert.fail(Assert.java:47)
	at junit.framework.Assert.failNotEquals(Assert.java:280)
	at junit.framework.Assert.assertEquals(Assert.java:64)
	at junit.framework.Assert.assertEquals(Assert.java:71)
	at org.joda.time.TestDateMidnight_Basics.testMinusWeeks_int(TestDateMidnight_Basics.java:970)

testConstructor_ObjectLocalDateTime(org.joda.time.TestLocalDateTime_Constructors)  Time elapsed: 0.001 sec  <<< FAILURE!
junit.framework.AssertionFailedError: expected:<5> but was:<8>
	at junit.framework.Assert.fail(Assert.java:47)
	at junit.framework.Assert.failNotEquals(Assert.java:280)
	at junit.framework.Assert.assertEquals(Assert.java:64)
	at junit.framework.Assert.assertEquals(Assert.java:198)
	at junit.framework.Assert.assertEquals(Assert.java:204)
	at org.joda.time.TestLocalDateTime_Constructors.testConstructor_ObjectLocalDateTime(TestLocalDateTime_Constructors.java:474)

testConstructor_Object_Chronology_crossChronology(org.joda.time.TestLocalDateTime_Constructors)  Time elapsed: 0.001 sec  <<< FAILURE!
junit.framework.AssertionFailedError: expected:<4> but was:<5>
	at junit.framework.Assert.fail(Assert.java:47)
	at junit.framework.Assert.failNotEquals(Assert.java:280)
	at junit.framework.Assert.assertEquals(Assert.java:64)
	at junit.framework.Assert.assertEquals(Assert.java:198)
	at junit.framework.Assert.assertEquals(Assert.java:204)
	at org.joda.time.TestLocalDateTime_Constructors.testConstructor_Object_Chronology_crossChronology(TestLocalDateTime_Constructors.java:596)

testPlus_RP(org.joda.time.TestLocalDateTime_Basics)  Time elapsed: 0.001 sec  <<< FAILURE!
junit.framework.AssertionFailedError: expected:<2003-10-04T15:26:37.048> but was:<2003-10-05T15:26:37.048>
	at junit.framework.Assert.fail(Assert.java:47)
	at junit.framework.Assert.failNotEquals(Assert.java:280)
	at junit.framework.Assert.assertEquals(Assert.java:64)
	at junit.framework.Assert.assertEquals(Assert.java:71)
	at org.joda.time.TestLocalDateTime_Basics.testPlus_RP(TestLocalDateTime_Basics.java:537)

testWithers(org.joda.time.TestLocalDateTime_Basics)  Time elapsed: 0 sec  <<< FAILURE!
junit.framework.AssertionFailedError: expected:<6> but was:<5>
	at junit.framework.Assert.fail(Assert.java:47)
	at junit.framework.Assert.failNotEquals(Assert.java:280)
	at junit.framework.Assert.assertEquals(Assert.java:64)
	at junit.framework.Assert.assertEquals(Assert.java:198)
	at junit.framework.Assert.assertEquals(Assert.java:204)
	at org.joda.time.TestLocalDateTime_Basics.check(TestLocalDateTime_Basics.java:1102)
	at org.joda.time.TestLocalDateTime_Basics.testWithers(TestLocalDateTime_Basics.java:739)

testPlusMonths_int(org.joda.time.TestLocalDateTime_Basics)  Time elapsed: 0 sec  <<< FAILURE!
junit.framework.AssertionFailedError: expected:<2002-08-08T10:20:30.040> but was:<2002-08-09T10:20:30.040>
	at junit.framework.Assert.fail(Assert.java:47)
	at junit.framework.Assert.failNotEquals(Assert.java:280)
	at junit.framework.Assert.assertEquals(Assert.java:64)
	at junit.framework.Assert.assertEquals(Assert.java:71)
	at org.joda.time.TestLocalDateTime_Basics.testPlusMonths_int(TestLocalDateTime_Basics.java:557)

testMinusMonths_int(org.joda.time.TestLocalDateTime_Basics)  Time elapsed: 0.001 sec  <<< FAILURE!
junit.framework.AssertionFailedError: expected:<2002-06-08T10:20:30.040> but was:<2002-06-09T10:20:30.040>
	at junit.framework.Assert.fail(Assert.java:47)
	at junit.framework.Assert.failNotEquals(Assert.java:280)
	at junit.framework.Assert.assertEquals(Assert.java:64)
	at junit.framework.Assert.assertEquals(Assert.java:71)
	at org.joda.time.TestLocalDateTime_Basics.testMinusMonths_int(TestLocalDateTime_Basics.java:649)

testMinusWeeks_int(org.joda.time.TestLocalDateTime_Basics)  Time elapsed: 0 sec  <<< FAILURE!
junit.framework.AssertionFailedError: expected:<2002-07-01T10:20:30.040> but was:<2002-07-02T10:20:30.040>
	at junit.framework.Assert.fail(Assert.java:47)
	at junit.framework.Assert.failNotEquals(Assert.java:280)
	at junit.framework.Assert.assertEquals(Assert.java:64)
	at junit.framework.Assert.assertEquals(Assert.java:71)
	at org.joda.time.TestLocalDateTime_Basics.testMinusWeeks_int(TestLocalDateTime_Basics.java:659)

testToDateTime_RI(org.joda.time.TestLocalDateTime_Basics)  Time elapsed: 0.001 sec  <<< FAILURE!
junit.framework.AssertionFailedError: expected:<2005-08-14T10:20:30.040+09:18:59> but was:<2005-07-18T10:20:30.040+09:18:59>
	at junit.framework.Assert.fail(Assert.java:47)
	at junit.framework.Assert.failNotEquals(Assert.java:280)
	at junit.framework.Assert.assertEquals(Assert.java:64)
	at junit.framework.Assert.assertEquals(Assert.java:71)
	at org.joda.time.TestLocalDateTime_Basics.testToDateTime_RI(TestLocalDateTime_Basics.java:837)

testConstructor_ObjectLocalDateTime(org.joda.time.TestLocalDate_Constructors)  Time elapsed: 0.001 sec  <<< FAILURE!
junit.framework.AssertionFailedError: expected:<5> but was:<8>
	at junit.framework.Assert.fail(Assert.java:47)
	at junit.framework.Assert.failNotEquals(Assert.java:280)
	at junit.framework.Assert.assertEquals(Assert.java:64)
	at junit.framework.Assert.assertEquals(Assert.java:198)
	at junit.framework.Assert.assertEquals(Assert.java:204)
	at org.joda.time.TestLocalDate_Constructors.testConstructor_ObjectLocalDateTime(TestLocalDate_Constructors.java:427)

testConstructor_ObjectLocalDate(org.joda.time.TestLocalDate_Constructors)  Time elapsed: 0 sec  <<< FAILURE!
junit.framework.AssertionFailedError: expected:<4> but was:<6>
	at junit.framework.Assert.fail(Assert.java:47)
	at junit.framework.Assert.failNotEquals(Assert.java:280)
	at junit.framework.Assert.assertEquals(Assert.java:64)
	at junit.framework.Assert.assertEquals(Assert.java:198)
	at junit.framework.Assert.assertEquals(Assert.java:204)
	at org.joda.time.TestLocalDate_Constructors.testConstructor_ObjectLocalDate(TestLocalDate_Constructors.java:410)

testConstructor_Object_Chronology_crossChronology(org.joda.time.TestLocalDate_Constructors)  Time elapsed: 0 sec  <<< FAILURE!
junit.framework.AssertionFailedError: expected:<4> but was:<5>
	at junit.framework.Assert.fail(Assert.java:47)
	at junit.framework.Assert.failNotEquals(Assert.java:280)
	at junit.framework.Assert.assertEquals(Assert.java:64)
	at junit.framework.Assert.assertEquals(Assert.java:198)
	at junit.framework.Assert.assertEquals(Assert.java:204)
	at org.joda.time.TestLocalDate_Constructors.testConstructor_Object_Chronology_crossChronology(TestLocalDate_Constructors.java:490)

testConstructor_ObjectYearMonthDay(org.joda.time.TestLocalDate_Constructors)  Time elapsed: 0.001 sec  <<< FAILURE!
junit.framework.AssertionFailedError: expected:<4> but was:<5>
	at junit.framework.Assert.fail(Assert.java:47)
	at junit.framework.Assert.failNotEquals(Assert.java:280)
	at junit.framework.Assert.assertEquals(Assert.java:64)
	at junit.framework.Assert.assertEquals(Assert.java:198)
	at junit.framework.Assert.assertEquals(Assert.java:204)
	at org.joda.time.TestLocalDate_Constructors.testConstructor_ObjectYearMonthDay(TestLocalDate_Constructors.java:437)

testWithers(org.joda.time.TestLocalDate_Basics)  Time elapsed: 0 sec  <<< FAILURE!
junit.framework.AssertionFailedError: expected:<6> but was:<5>
	at junit.framework.Assert.fail(Assert.java:47)
	at junit.framework.Assert.failNotEquals(Assert.java:280)
	at junit.framework.Assert.assertEquals(Assert.java:64)
	at junit.framework.Assert.assertEquals(Assert.java:198)
	at junit.framework.Assert.assertEquals(Assert.java:204)
	at org.joda.time.TestLocalDate_Basics.check(TestLocalDate_Basics.java:1156)
	at org.joda.time.TestLocalDate_Basics.testWithers(TestLocalDate_Basics.java:641)

testMinus_RP(org.joda.time.TestLocalDate_Basics)  Time elapsed: 0.001 sec  <<< FAILURE!
junit.framework.AssertionFailedError: expected:<2001-05-05> but was:<2001-05-04>
	at junit.framework.Assert.fail(Assert.java:47)
	at junit.framework.Assert.failNotEquals(Assert.java:280)
	at junit.framework.Assert.assertEquals(Assert.java:64)
	at junit.framework.Assert.assertEquals(Assert.java:71)
	at org.joda.time.TestLocalDate_Basics.testMinus_RP(TestLocalDate_Basics.java:576)

testMinusWeeks_int(org.joda.time.TestLocalDate_Basics)  Time elapsed: 0.001 sec  <<< FAILURE!
junit.framework.AssertionFailedError: expected:<2002-06-04> but was:<2002-06-05>
	at junit.framework.Assert.fail(Assert.java:47)
	at junit.framework.Assert.failNotEquals(Assert.java:280)
	at junit.framework.Assert.assertEquals(Assert.java:64)
	at junit.framework.Assert.assertEquals(Assert.java:71)
	at org.joda.time.TestLocalDate_Basics.testMinusWeeks_int(TestLocalDate_Basics.java:606)

testPlus_RP(org.joda.time.TestLocalTime_Basics)  Time elapsed: 0 sec  <<< FAILURE!
junit.framework.AssertionFailedError: expected:<15:26:37.048> but was:<15:26:37.048>
	at junit.framework.Assert.fail(Assert.java:47)
	at junit.framework.Assert.failNotEquals(Assert.java:280)
	at junit.framework.Assert.assertEquals(Assert.java:64)
	at junit.framework.Assert.assertEquals(Assert.java:71)
	at org.joda.time.TestLocalTime_Basics.testPlus_RP(TestLocalTime_Basics.java:542)

testPlusHours_int(org.joda.time.TestLocalTime_Basics)  Time elapsed: 0 sec  <<< FAILURE!
junit.framework.AssertionFailedError: expected:<02:02:03.004> but was:<02:02:03.004>
	at junit.framework.Assert.fail(Assert.java:47)
	at junit.framework.Assert.failNotEquals(Assert.java:280)
	at junit.framework.Assert.assertEquals(Assert.java:64)
	at junit.framework.Assert.assertEquals(Assert.java:71)
	at org.joda.time.TestLocalTime_Basics.testPlusHours_int(TestLocalTime_Basics.java:552)

testPlusMinutes_int(org.joda.time.TestLocalTime_Basics)  Time elapsed: 0.001 sec  <<< FAILURE!
junit.framework.AssertionFailedError: expected:<01:03:03.004> but was:<01:03:03.004>
	at junit.framework.Assert.fail(Assert.java:47)
	at junit.framework.Assert.failNotEquals(Assert.java:280)
	at junit.framework.Assert.assertEquals(Assert.java:64)
	at junit.framework.Assert.assertEquals(Assert.java:71)
	at org.joda.time.TestLocalTime_Basics.testPlusMinutes_int(TestLocalTime_Basics.java:562)

testPlusSeconds_int(org.joda.time.TestLocalTime_Basics)  Time elapsed: 0.001 sec  <<< FAILURE!
junit.framework.AssertionFailedError: expected:<01:02:04.004> but was:<01:02:04.004>
	at junit.framework.Assert.fail(Assert.java:47)
	at junit.framework.Assert.failNotEquals(Assert.java:280)
	at junit.framework.Assert.assertEquals(Assert.java:64)
	at junit.framework.Assert.assertEquals(Assert.java:71)
	at org.joda.time.TestLocalTime_Basics.testPlusSeconds_int(TestLocalTime_Basics.java:572)

testPlusMillis_int(org.joda.time.TestLocalTime_Basics)  Time elapsed: 0 sec  <<< FAILURE!
junit.framework.AssertionFailedError: expected:<01:02:03.005> but was:<01:02:03.005>
	at junit.framework.Assert.fail(Assert.java:47)
	at junit.framework.Assert.failNotEquals(Assert.java:280)
	at junit.framework.Assert.assertEquals(Assert.java:64)
	at junit.framework.Assert.assertEquals(Assert.java:71)
	at org.joda.time.TestLocalTime_Basics.testPlusMillis_int(TestLocalTime_Basics.java:582)

testMinus_RP(org.joda.time.TestLocalTime_Basics)  Time elapsed: 0.001 sec  <<< FAILURE!
junit.framework.AssertionFailedError: expected:<09:19:29.039> but was:<09:19:29.039>
	at junit.framework.Assert.fail(Assert.java:47)
	at junit.framework.Assert.failNotEquals(Assert.java:280)
	at junit.framework.Assert.assertEquals(Assert.java:64)
	at junit.framework.Assert.assertEquals(Assert.java:71)
	at org.joda.time.TestLocalTime_Basics.testMinus_RP(TestLocalTime_Basics.java:593)

testMinusHours_int(org.joda.time.TestLocalTime_Basics)  Time elapsed: 0 sec  <<< FAILURE!
junit.framework.AssertionFailedError: expected:<00:02:03.004> but was:<00:02:03.004>
	at junit.framework.Assert.fail(Assert.java:47)
	at junit.framework.Assert.failNotEquals(Assert.java:280)
	at junit.framework.Assert.assertEquals(Assert.java:64)
	at junit.framework.Assert.assertEquals(Assert.java:71)
	at org.joda.time.TestLocalTime_Basics.testMinusHours_int(TestLocalTime_Basics.java:603)

testMinusMinutes_int(org.joda.time.TestLocalTime_Basics)  Time elapsed: 0.001 sec  <<< FAILURE!
junit.framework.AssertionFailedError: expected:<01:01:03.004> but was:<01:01:03.004>
	at junit.framework.Assert.fail(Assert.java:47)
	at junit.framework.Assert.failNotEquals(Assert.java:280)
	at junit.framework.Assert.assertEquals(Assert.java:64)
	at junit.framework.Assert.assertEquals(Assert.java:71)
	at org.joda.time.TestLocalTime_Basics.testMinusMinutes_int(TestLocalTime_Basics.java:613)

testMinusSeconds_int(org.joda.time.TestLocalTime_Basics)  Time elapsed: 0.001 sec  <<< FAILURE!
junit.framework.AssertionFailedError: expected:<01:02:02.004> but was:<01:02:02.004>
	at junit.framework.Assert.fail(Assert.java:47)
	at junit.framework.Assert.failNotEquals(Assert.java:280)
	at junit.framework.Assert.assertEquals(Assert.java:64)
	at junit.framework.Assert.assertEquals(Assert.java:71)
	at org.joda.time.TestLocalTime_Basics.testMinusSeconds_int(TestLocalTime_Basics.java:623)

testMinusMillis_int(org.joda.time.TestLocalTime_Basics)  Time elapsed: 0 sec  <<< FAILURE!
junit.framework.AssertionFailedError: expected:<01:02:03.003> but was:<01:02:03.003>
	at junit.framework.Assert.fail(Assert.java:47)
	at junit.framework.Assert.failNotEquals(Assert.java:280)
	at junit.framework.Assert.assertEquals(Assert.java:64)
	at junit.framework.Assert.assertEquals(Assert.java:71)
	at org.joda.time.TestLocalTime_Basics.testMinusMillis_int(TestLocalTime_Basics.java:633)

testEpoch(org.joda.time.chrono.TestBuddhistChronology)  Time elapsed: 0.001 sec  <<< FAILURE!
junit.framework.AssertionFailedError: expected:<-0543-01-01T00:00:00.000Z> but was:<-0538-12-08T00:00:00.000Z>
	at junit.framework.Assert.fail(Assert.java:47)
	at junit.framework.Assert.failNotEquals(Assert.java:280)
	at junit.framework.Assert.assertEquals(Assert.java:64)
	at junit.framework.Assert.assertEquals(Assert.java:71)
	at org.joda.time.chrono.TestBuddhistChronology.testEpoch(TestBuddhistChronology.java:298)

testKeyYears(org.joda.time.chrono.TestBuddhistChronology)  Time elapsed: 0 sec  <<< FAILURE!
junit.framework.AssertionFailedError: expected:<1970-01-01T00:00:00.000Z> but was:<1969-10-10T00:00:00.000Z>
	at junit.framework.Assert.fail(Assert.java:47)
	at junit.framework.Assert.failNotEquals(Assert.java:280)
	at junit.framework.Assert.assertEquals(Assert.java:64)
	at junit.framework.Assert.assertEquals(Assert.java:71)
	at org.joda.time.chrono.TestBuddhistChronology.testKeyYears(TestBuddhistChronology.java:312)

testParseEquivalence(org.joda.time.chrono.TestGJChronology)  Time elapsed: 0.001 sec  <<< FAILURE!
junit.framework.AssertionFailedError: expected:<1581-01-31T01:23:45.678Z> but was:<1581-01-01T01:23:45.678Z>
	at junit.framework.Assert.fail(Assert.java:47)
	at junit.framework.Assert.failNotEquals(Assert.java:280)
	at junit.framework.Assert.assertEquals(Assert.java:64)
	at junit.framework.Assert.assertEquals(Assert.java:71)
	at org.joda.time.chrono.TestGJChronology.testParse(TestGJChronology.java:375)
	at org.joda.time.chrono.TestGJChronology.testParseEquivalence(TestGJChronology.java:362)

testCutoverAddYears(org.joda.time.chrono.TestGJChronology)  Time elapsed: 0.001 sec  <<< FAILURE!
junit.framework.AssertionFailedError: expected:<1582-12-01T00:00:00.000Z> but was:<1583-01-01T00:00:00.000Z>
	at junit.framework.Assert.fail(Assert.java:47)
	at junit.framework.Assert.failNotEquals(Assert.java:280)
	at junit.framework.Assert.assertEquals(Assert.java:64)
	at junit.framework.Assert.assertEquals(Assert.java:71)
	at org.joda.time.chrono.TestGJChronology.testAdd(TestGJChronology.java:484)
	at org.joda.time.chrono.TestGJChronology.testCutoverAddYears(TestGJChronology.java:381)

testCutoverAddWeekyears(org.joda.time.chrono.TestGJChronology)  Time elapsed: 0 sec  <<< ERROR!
org.joda.time.IllegalFieldValueException: Cannot parse "1583-W01-1": Value 1 for weekOfWeekyear is not supported
	at org.joda.time.chrono.GJChronology$CutoverField.set(GJChronology.java:198)
	at org.joda.time.format.DateTimeParserBucket$SavedField.set(DateTimeParserBucket.java:568)
	at org.joda.time.format.DateTimeParserBucket.computeMillis(DateTimeParserBucket.java:451)
	at org.joda.time.format.DateTimeParserBucket.doParseMillis(DateTimeParserBucket.java:182)
	at org.joda.time.format.DateTimeFormatter.parseMillis(DateTimeFormatter.java:780)
	at org.joda.time.convert.StringConverter.getInstantMillis(StringConverter.java:65)
	at org.joda.time.base.BaseDateTime.<init>(BaseDateTime.java:175)
	at org.joda.time.DateTime.<init>(DateTime.java:302)
	at org.joda.time.chrono.TestGJChronology.testAdd(TestGJChronology.java:483)
	at org.joda.time.chrono.TestGJChronology.testCutoverAddWeekyears(TestGJChronology.java:401)

testCutoverAddMonths(org.joda.time.chrono.TestGJChronology)  Time elapsed: 0 sec  <<< FAILURE!
junit.framework.AssertionFailedError: expected:<1582-03-01T00:00:00.000Z> but was:<1582-02-01T00:00:00.000Z>
	at junit.framework.Assert.fail(Assert.java:47)
	at junit.framework.Assert.failNotEquals(Assert.java:280)
	at junit.framework.Assert.assertEquals(Assert.java:64)
	at junit.framework.Assert.assertEquals(Assert.java:71)
	at org.joda.time.chrono.TestGJChronology.testAdd(TestGJChronology.java:484)
	at org.joda.time.chrono.TestGJChronology.testCutoverAddMonths(TestGJChronology.java:422)

testCutoverAddWeeks(org.joda.time.chrono.TestGJChronology)  Time elapsed: 0.001 sec  <<< FAILURE!
junit.framework.AssertionFailedError: expected:<1582-02-08T00:00:00.000Z> but was:<1582-01-08T00:00:00.000Z>
	at junit.framework.Assert.fail(Assert.java:47)
	at junit.framework.Assert.failNotEquals(Assert.java:280)
	at junit.framework.Assert.assertEquals(Assert.java:64)
	at junit.framework.Assert.assertEquals(Assert.java:71)
	at org.joda.time.chrono.TestGJChronology.testAdd(TestGJChronology.java:484)
	at org.joda.time.chrono.TestGJChronology.testCutoverAddWeeks(TestGJChronology.java:443)

testYearEndAddDays(org.joda.time.chrono.TestGJChronology)  Time elapsed: 0 sec  <<< ERROR!
org.joda.time.IllegalFieldValueException: Cannot parse "1582-11-05": Value 5 for dayOfMonth is not supported
	at org.joda.time.chrono.GJChronology$CutoverField.set(GJChronology.java:198)
	at org.joda.time.format.DateTimeParserBucket$SavedField.set(DateTimeParserBucket.java:568)
	at org.joda.time.format.DateTimeParserBucket.computeMillis(DateTimeParserBucket.java:447)
	at org.joda.time.format.DateTimeParserBucket.doParseMillis(DateTimeParserBucket.java:182)
	at org.joda.time.format.DateTimeFormatter.parseMillis(DateTimeFormatter.java:780)
	at org.joda.time.convert.StringConverter.getInstantMillis(StringConverter.java:65)
	at org.joda.time.base.BaseDateTime.<init>(BaseDateTime.java:175)
	at org.joda.time.DateTime.<init>(DateTime.java:302)
	at org.joda.time.chrono.TestGJChronology.testAdd(TestGJChronology.java:482)
	at org.joda.time.chrono.TestGJChronology.testYearEndAddDays(TestGJChronology.java:462)

testMaximumValue(org.joda.time.chrono.TestGJChronology)  Time elapsed: 0 sec  <<< FAILURE!
junit.framework.AssertionFailedError: expected:<31> but was:<28>
	at junit.framework.Assert.fail(Assert.java:47)
	at junit.framework.Assert.failNotEquals(Assert.java:280)
	at junit.framework.Assert.assertEquals(Assert.java:64)
	at junit.framework.Assert.assertEquals(Assert.java:198)
	at junit.framework.Assert.assertEquals(Assert.java:204)
	at org.joda.time.chrono.TestGJChronology.testMaximumValue(TestGJChronology.java:517)

testPartialGetAsText(org.joda.time.chrono.TestGJChronology)  Time elapsed: 0.002 sec  <<< FAILURE!
junit.framework.ComparisonFailure: expected:<[January]> but was:<[December]>
	at junit.framework.Assert.assertEquals(Assert.java:81)
	at junit.framework.Assert.assertEquals(Assert.java:87)
	at org.joda.time.chrono.TestGJChronology.testPartialGetAsText(TestGJChronology.java:523)

test_plusWeekyears_positiveToZero_crossCutover(org.joda.time.chrono.TestGJDate)  Time elapsed: 0.001 sec  <<< ERROR!
org.joda.time.IllegalFieldValueException: Value 0 for year is not supported
	at org.joda.time.field.SkipDateTimeField.set(SkipDateTimeField.java:91)
	at org.joda.time.chrono.GJChronology.convertByWeekyear(GJChronology.java:28)
	at org.joda.time.chrono.GJChronology.gregorianToJulianByWeekyear(GJChronology.java:153)
	at org.joda.time.chrono.GJChronology$CutoverField.gregorianToJulian(GJChronology.java:247)
	at org.joda.time.chrono.GJChronology$CutoverField.set(GJChronology.java:194)
	at org.joda.time.LocalDate.withWeekOfWeekyear(LocalDate.java:1676)
	at org.joda.time.chrono.TestGJDate.test_plusWeekyears_positiveToZero_crossCutover(TestGJDate.java:117)

test_plusWeekyears_positiveToNegative_crossCutover(org.joda.time.chrono.TestGJDate)  Time elapsed: 0 sec  <<< FAILURE!
junit.framework.AssertionFailedError: expected:<-0001-06-28> but was:<-0002-06-30>
	at junit.framework.Assert.fail(Assert.java:47)
	at junit.framework.Assert.failNotEquals(Assert.java:280)
	at junit.framework.Assert.assertEquals(Assert.java:64)
	at junit.framework.Assert.assertEquals(Assert.java:71)
	at org.joda.time.chrono.TestGJDate.test_plusWeekyears_positiveToNegative_crossCutover(TestGJDate.java:124)

testSetIntoInterval_Object_Chronology7(org.joda.time.convert.TestStringConverter)  Time elapsed: 0.001 sec  <<< FAILURE!
junit.framework.AssertionFailedError: expected:<2003-10-15T00:00:00.000-00:01:15> but was:<2003-09-09T00:00:00.000-00:01:15>
	at junit.framework.Assert.fail(Assert.java:47)
	at junit.framework.Assert.failNotEquals(Assert.java:280)
	at junit.framework.Assert.assertEquals(Assert.java:64)
	at junit.framework.Assert.assertEquals(Assert.java:71)
	at org.joda.time.convert.TestStringConverter.testSetIntoInterval_Object_Chronology7(TestStringConverter.java:525)

testSetIntoInterval_Object_Chronology8(org.joda.time.convert.TestStringConverter)  Time elapsed: 0.001 sec  <<< FAILURE!
junit.framework.AssertionFailedError: expected:<2003-10-15T02:00:00.000+08:00> but was:<2003-09-09T02:00:00.000+08:00>
	at junit.framework.Assert.fail(Assert.java:47)
	at junit.framework.Assert.failNotEquals(Assert.java:280)
	at junit.framework.Assert.assertEquals(Assert.java:64)
	at junit.framework.Assert.assertEquals(Assert.java:71)
	at org.joda.time.convert.TestStringConverter.testSetIntoInterval_Object_Chronology8(TestStringConverter.java:533)

testParseMutableDateTime_chrono(org.joda.time.format.TestDateTimeFormatter)  Time elapsed: 0.001 sec  <<< FAILURE!
junit.framework.AssertionFailedError: expected:<2547-03-18T12:20:30.000+01:00> but was:<2547-03-31T12:20:30.000+02:00>
	at junit.framework.Assert.fail(Assert.java:47)
	at junit.framework.Assert.failNotEquals(Assert.java:280)
	at junit.framework.Assert.assertEquals(Assert.java:64)
	at junit.framework.Assert.assertEquals(Assert.java:71)
	at org.joda.time.format.TestDateTimeFormatter.testParseMutableDateTime_chrono(TestDateTimeFormatter.java:724)

testParseInto_chrono(org.joda.time.format.TestDateTimeFormatter)  Time elapsed: 0 sec  <<< FAILURE!
junit.framework.AssertionFailedError: expected:<2547-03-18T12:20:30.000+01:00> but was:<2547-03-31T12:20:30.000+02:00>
	at junit.framework.Assert.fail(Assert.java:47)
	at junit.framework.Assert.failNotEquals(Assert.java:280)
	at junit.framework.Assert.assertEquals(Assert.java:64)
	at junit.framework.Assert.assertEquals(Assert.java:71)
	at org.joda.time.format.TestDateTimeFormatter.testParseInto_chrono(TestDateTimeFormatter.java:858)

testParseLocalDate_simple(org.joda.time.format.TestDateTimeFormatter)  Time elapsed: 0 sec  <<< FAILURE!
junit.framework.AssertionFailedError: expected:<2004-07-18> but was:<2004-08-05>
	at junit.framework.Assert.fail(Assert.java:47)
	at junit.framework.Assert.failNotEquals(Assert.java:280)
	at junit.framework.Assert.assertEquals(Assert.java:64)
	at junit.framework.Assert.assertEquals(Assert.java:71)
	at org.joda.time.format.TestDateTimeFormatter.testParseLocalDate_simple(TestDateTimeFormatter.java:368)

testParseLocalDate_yearOfEra(org.joda.time.format.TestDateTimeFormatter)  Time elapsed: 0.001 sec  <<< ERROR!
org.joda.time.IllegalFieldValueException: Cannot parse "2005-10 AD": Value 2005 for yearOfEra is not supported
	at org.joda.time.chrono.GJChronology$CutoverField.set(GJChronology.java:195)
	at org.joda.time.format.DateTimeParserBucket$SavedField.set(DateTimeParserBucket.java:568)
	at org.joda.time.format.DateTimeParserBucket.computeMillis(DateTimeParserBucket.java:447)
	at org.joda.time.format.DateTimeParserBucket.computeMillis(DateTimeParserBucket.java:411)
	at org.joda.time.format.DateTimeFormatter.parseLocalDateTime(DateTimeFormatter.java:841)
	at org.joda.time.format.DateTimeFormatter.parseLocalDate(DateTimeFormatter.java:798)
	at org.joda.time.format.TestDateTimeFormatter.testParseLocalDate_yearOfEra(TestDateTimeFormatter.java:384)

testParseLocalDate_yearOfCentury(org.joda.time.format.TestDateTimeFormatter)  Time elapsed: 0.002 sec  <<< FAILURE!
junit.framework.AssertionFailedError: expected:<2050-08-04> but was:<2050-07-04>
	at junit.framework.Assert.fail(Assert.java:47)
	at junit.framework.Assert.failNotEquals(Assert.java:280)
	at junit.framework.Assert.assertEquals(Assert.java:64)
	at junit.framework.Assert.assertEquals(Assert.java:71)
	at org.joda.time.format.TestDateTimeFormatter.testParseLocalDate_yearOfCentury(TestDateTimeFormatter.java:401)

testParseLocalDate_monthDay_feb29(org.joda.time.format.TestDateTimeFormatter)  Time elapsed: 0 sec  <<< FAILURE!
junit.framework.AssertionFailedError: expected:<2000-02-29> but was:<2000-01-29>
	at junit.framework.Assert.fail(Assert.java:47)
	at junit.framework.Assert.failNotEquals(Assert.java:280)
	at junit.framework.Assert.assertEquals(Assert.java:64)
	at junit.framework.Assert.assertEquals(Assert.java:71)
	at org.joda.time.format.TestDateTimeFormatter.testParseLocalDate_monthDay_feb29(TestDateTimeFormatter.java:411)

testParseLocalDate_monthDay_withDefaultYear_feb29(org.joda.time.format.TestDateTimeFormatter)  Time elapsed: 0.001 sec  <<< FAILURE!
junit.framework.AssertionFailedError: expected:<2012-02-29> but was:<2012-01-29>
	at junit.framework.Assert.fail(Assert.java:47)
	at junit.framework.Assert.failNotEquals(Assert.java:280)
	at junit.framework.Assert.assertEquals(Assert.java:64)
	at junit.framework.Assert.assertEquals(Assert.java:71)
	at org.joda.time.format.TestDateTimeFormatter.testParseLocalDate_monthDay_withDefaultYear_feb29(TestDateTimeFormatter.java:422)

testParseLocalDate_weekyear_month_week_2010(org.joda.time.format.TestDateTimeFormatter)  Time elapsed: 0.001 sec  <<< FAILURE!
junit.framework.AssertionFailedError: expected:<2010-01-04> but was:<2008-12-29>
	at junit.framework.Assert.fail(Assert.java:47)
	at junit.framework.Assert.failNotEquals(Assert.java:280)
	at junit.framework.Assert.assertEquals(Assert.java:64)
	at junit.framework.Assert.assertEquals(Assert.java:71)
	at org.joda.time.format.TestDateTimeFormatter.testParseLocalDate_weekyear_month_week_2010(TestDateTimeFormatter.java:428)

testParseLocalDate_weekyear_month_week_2011(org.joda.time.format.TestDateTimeFormatter)  Time elapsed: 0.001 sec  <<< FAILURE!
junit.framework.AssertionFailedError: expected:<2011-01-03> but was:<2010-01-04>
	at junit.framework.Assert.fail(Assert.java:47)
	at junit.framework.Assert.failNotEquals(Assert.java:280)
	at junit.framework.Assert.assertEquals(Assert.java:64)
	at junit.framework.Assert.assertEquals(Assert.java:71)
	at org.joda.time.format.TestDateTimeFormatter.testParseLocalDate_weekyear_month_week_2011(TestDateTimeFormatter.java:434)

testParseLocalDate_weekyear_month_week_2012(org.joda.time.format.TestDateTimeFormatter)  Time elapsed: 0.001 sec  <<< FAILURE!
junit.framework.AssertionFailedError: expected:<2012-01-02> but was:<2011-01-03>
	at junit.framework.Assert.fail(Assert.java:47)
	at junit.framework.Assert.failNotEquals(Assert.java:280)
	at junit.framework.Assert.assertEquals(Assert.java:64)
	at junit.framework.Assert.assertEquals(Assert.java:71)
	at org.joda.time.format.TestDateTimeFormatter.testParseLocalDate_weekyear_month_week_2012(TestDateTimeFormatter.java:440)

testParseLocalDate_year_month_week_2010(org.joda.time.format.TestDateTimeFormatter)  Time elapsed: 0.001 sec  <<< FAILURE!
junit.framework.AssertionFailedError: expected:<2010-01-04> but was:<2008-12-29>
	at junit.framework.Assert.fail(Assert.java:47)
	at junit.framework.Assert.failNotEquals(Assert.java:280)
	at junit.framework.Assert.assertEquals(Assert.java:64)
	at junit.framework.Assert.assertEquals(Assert.java:71)
	at org.joda.time.format.TestDateTimeFormatter.testParseLocalDate_year_month_week_2010(TestDateTimeFormatter.java:454)

testParseLocalDate_year_month_week_2011(org.joda.time.format.TestDateTimeFormatter)  Time elapsed: 0 sec  <<< FAILURE!
junit.framework.AssertionFailedError: expected:<2011-01-03> but was:<2010-01-04>
	at junit.framework.Assert.fail(Assert.java:47)
	at junit.framework.Assert.failNotEquals(Assert.java:280)
	at junit.framework.Assert.assertEquals(Assert.java:64)
	at junit.framework.Assert.assertEquals(Assert.java:71)
	at org.joda.time.format.TestDateTimeFormatter.testParseLocalDate_year_month_week_2011(TestDateTimeFormatter.java:460)

testParseLocalDate_year_month_week_2012(org.joda.time.format.TestDateTimeFormatter)  Time elapsed: 0.001 sec  <<< FAILURE!
junit.framework.AssertionFailedError: expected:<2012-01-02> but was:<2011-01-03>
	at junit.framework.Assert.fail(Assert.java:47)
	at junit.framework.Assert.failNotEquals(Assert.java:280)
	at junit.framework.Assert.assertEquals(Assert.java:64)
	at junit.framework.Assert.assertEquals(Assert.java:71)
	at org.joda.time.format.TestDateTimeFormatter.testParseLocalDate_year_month_week_2012(TestDateTimeFormatter.java:466)

testParseLocalDate_year_month_week_2013(org.joda.time.format.TestDateTimeFormatter)  Time elapsed: 0.001 sec  <<< FAILURE!
junit.framework.AssertionFailedError: expected:<2012-12-31> but was:<2012-01-02>
	at junit.framework.Assert.fail(Assert.java:47)
	at junit.framework.Assert.failNotEquals(Assert.java:280)
	at junit.framework.Assert.assertEquals(Assert.java:64)
	at junit.framework.Assert.assertEquals(Assert.java:71)
	at org.joda.time.format.TestDateTimeFormatter.testParseLocalDate_year_month_week_2013(TestDateTimeFormatter.java:472)

testParseLocalDate_year_month_week_2014(org.joda.time.format.TestDateTimeFormatter)  Time elapsed: 0.001 sec  <<< FAILURE!
junit.framework.AssertionFailedError: expected:<2013-12-30> but was:<2012-12-31>
	at junit.framework.Assert.fail(Assert.java:47)
	at junit.framework.Assert.failNotEquals(Assert.java:280)
	at junit.framework.Assert.assertEquals(Assert.java:64)
	at junit.framework.Assert.assertEquals(Assert.java:71)
	at org.joda.time.format.TestDateTimeFormatter.testParseLocalDate_year_month_week_2014(TestDateTimeFormatter.java:478)

testParseLocalDate_year_month_week_2015(org.joda.time.format.TestDateTimeFormatter)  Time elapsed: 0 sec  <<< FAILURE!
junit.framework.AssertionFailedError: expected:<2014-12-29> but was:<2013-12-30>
	at junit.framework.Assert.fail(Assert.java:47)
	at junit.framework.Assert.failNotEquals(Assert.java:280)
	at junit.framework.Assert.assertEquals(Assert.java:64)
	at junit.framework.Assert.assertEquals(Assert.java:71)
	at org.joda.time.format.TestDateTimeFormatter.testParseLocalDate_year_month_week_2015(TestDateTimeFormatter.java:484)

testParseLocalDate_year_month_week_2016(org.joda.time.format.TestDateTimeFormatter)  Time elapsed: 0 sec  <<< FAILURE!
junit.framework.AssertionFailedError: expected:<2016-01-04> but was:<2014-12-29>
	at junit.framework.Assert.fail(Assert.java:47)
	at junit.framework.Assert.failNotEquals(Assert.java:280)
	at junit.framework.Assert.assertEquals(Assert.java:64)
	at junit.framework.Assert.assertEquals(Assert.java:71)
	at org.joda.time.format.TestDateTimeFormatter.testParseLocalDate_year_month_week_2016(TestDateTimeFormatter.java:490)

testParseLocalTime_simple(org.joda.time.format.TestDateTimeFormatter)  Time elapsed: 0.002 sec  <<< FAILURE!
junit.framework.AssertionFailedError: expected:<10:20:30.000> but was:<10:20:30.000>
	at junit.framework.Assert.fail(Assert.java:47)
	at junit.framework.Assert.failNotEquals(Assert.java:280)
	at junit.framework.Assert.assertEquals(Assert.java:64)
	at junit.framework.Assert.assertEquals(Assert.java:71)
	at org.joda.time.format.TestDateTimeFormatter.testParseLocalTime_simple(TestDateTimeFormatter.java:498)

testParseLocalDateTime_simple(org.joda.time.format.TestDateTimeFormatter)  Time elapsed: 0.001 sec  <<< FAILURE!
junit.framework.AssertionFailedError: expected:<2004-08-14T10:20:30.000> but was:<2004-08-05T10:20:30.000>
	at junit.framework.Assert.fail(Assert.java:47)
	at junit.framework.Assert.failNotEquals(Assert.java:280)
	at junit.framework.Assert.assertEquals(Assert.java:64)
	at junit.framework.Assert.assertEquals(Assert.java:71)
	at org.joda.time.format.TestDateTimeFormatter.testParseLocalDateTime_simple(TestDateTimeFormatter.java:511)

testParseLocalDateTime_monthDay_feb29(org.joda.time.format.TestDateTimeFormatter)  Time elapsed: 0.001 sec  <<< FAILURE!
junit.framework.AssertionFailedError: expected:<2000-02-29T13:40:00.000> but was:<2000-01-03T13:40:00.000>
	at junit.framework.Assert.fail(Assert.java:47)
	at junit.framework.Assert.failNotEquals(Assert.java:280)
	at junit.framework.Assert.assertEquals(Assert.java:64)
	at junit.framework.Assert.assertEquals(Assert.java:71)
	at org.joda.time.format.TestDateTimeFormatter.testParseLocalDateTime_monthDay_feb29(TestDateTimeFormatter.java:526)

testParseLocalDateTime_monthDay_withDefaultYear_feb29(org.joda.time.format.TestDateTimeFormatter)  Time elapsed: 0.001 sec  <<< FAILURE!
junit.framework.AssertionFailedError: expected:<2012-02-29T13:40:00.000> but was:<2012-01-03T13:40:00.000>
	at junit.framework.Assert.fail(Assert.java:47)
	at junit.framework.Assert.failNotEquals(Assert.java:280)
	at junit.framework.Assert.assertEquals(Assert.java:64)
	at junit.framework.Assert.assertEquals(Assert.java:71)
	at org.joda.time.format.TestDateTimeFormatter.testParseLocalDateTime_monthDay_withDefaultYear_feb29(TestDateTimeFormatter.java:537)

testParseDateTime_chrono(org.joda.time.format.TestDateTimeFormatter)  Time elapsed: 0 sec  <<< FAILURE!
junit.framework.AssertionFailedError: expected:<2547-03-18T12:20:30.000+01:00> but was:<2547-03-31T12:20:30.000+02:00>
	at junit.framework.Assert.fail(Assert.java:47)
	at junit.framework.Assert.failNotEquals(Assert.java:280)
	at junit.framework.Assert.assertEquals(Assert.java:64)
	at junit.framework.Assert.assertEquals(Assert.java:71)
	at org.joda.time.format.TestDateTimeFormatter.testParseDateTime_chrono(TestDateTimeFormatter.java:629)

testFormat_yearOfEraParse(org.joda.time.format.TestDateTimeFormat)  Time elapsed: 0.002 sec  <<< ERROR!
org.joda.time.IllegalFieldValueException: Cannot parse "2005-10 AD": Value 2005 for yearOfEra is not supported
	at org.joda.time.chrono.GJChronology$CutoverField.set(GJChronology.java:195)
	at org.joda.time.format.DateTimeParserBucket$SavedField.set(DateTimeParserBucket.java:568)
	at org.joda.time.format.DateTimeParserBucket.computeMillis(DateTimeParserBucket.java:447)
	at org.joda.time.format.DateTimeParserBucket.computeMillis(DateTimeParserBucket.java:411)
	at org.joda.time.format.DateTimeFormatter.parseDateTime(DateTimeFormatter.java:882)
	at org.joda.time.format.TestDateTimeFormat.testFormat_yearOfEraParse(TestDateTimeFormat.java:200)


Results :

Failed tests: 
  org.joda.time.TestDateMidnight_Basics#testMinusMonths_int AssertionFailedError
  org.joda.time.TestDateMidnight_Basics#testMinusWeeks_int AssertionFailedError ...
  org.joda.time.TestDateMidnight_Basics#testPlusMonths_int AssertionFailedError ...
  org.joda.time.TestDateMidnight_Basics#testPlus_RP AssertionFailedError expecte...
  org.joda.time.TestDateMidnight_Basics#testWithDurationAdded_RP_int AssertionFailedError
  org.joda.time.TestDateMidnight_Basics#testWithers AssertionFailedError expecte...
  org.joda.time.TestDateTime_Basics#testMinusMonths_int AssertionFailedError exp...
  org.joda.time.TestDateTime_Basics#testMinusWeeks_int AssertionFailedError expe...
  org.joda.time.TestDateTime_Basics#testPlusMonths_int AssertionFailedError expe...
  org.joda.time.TestDateTime_Basics#testPlus_RP AssertionFailedError expected:<2...
  org.joda.time.TestDateTime_Basics#testWithDurationAdded_RP_int AssertionFailedError
  org.joda.time.TestDateTime_Basics#testWithTime_LocalTime AssertionFailedError ...
  org.joda.time.TestDateTime_Basics#testWithTime_int_int_int_int AssertionFailedError
  org.joda.time.TestDateTime_Basics#testWithers AssertionFailedError expected:<6...
  org.joda.time.TestLocalDateTime_Basics#testMinusMonths_int AssertionFailedError
  org.joda.time.TestLocalDateTime_Basics#testMinusWeeks_int AssertionFailedError
  org.joda.time.TestLocalDateTime_Basics#testPlusMonths_int AssertionFailedError
  org.joda.time.TestLocalDateTime_Basics#testPlus_RP AssertionFailedError expect...
  org.joda.time.TestLocalDateTime_Basics#testToDateTime_RI AssertionFailedError ...
  org.joda.time.TestLocalDateTime_Basics#testWithers AssertionFailedError expect...
  org.joda.time.TestLocalDateTime_Constructors#testConstructor_ObjectLocalDateTime AssertionFailedError
  org.joda.time.TestLocalDateTime_Constructors#testConstructor_Object_Chronology_crossChronology AssertionFailedError
  org.joda.time.TestLocalDate_Basics#testMinusWeeks_int AssertionFailedError exp...
  org.joda.time.TestLocalDate_Basics#testMinus_RP AssertionFailedError expected:...
  org.joda.time.TestLocalDate_Basics#testWithers AssertionFailedError expected:<...
  org.joda.time.TestLocalDate_Constructors#testConstructor_ObjectLocalDate AssertionFailedError
  org.joda.time.TestLocalDate_Constructors#testConstructor_ObjectLocalDateTime AssertionFailedError
  org.joda.time.TestLocalDate_Constructors#testConstructor_ObjectYearMonthDay AssertionFailedError
  org.joda.time.TestLocalDate_Constructors#testConstructor_Object_Chronology_crossChronology AssertionFailedError
  org.joda.time.TestLocalTime_Basics#testMinusHours_int AssertionFailedError exp...
  org.joda.time.TestLocalTime_Basics#testMinusMillis_int AssertionFailedError ex...
  org.joda.time.TestLocalTime_Basics#testMinusMinutes_int AssertionFailedError e...
  org.joda.time.TestLocalTime_Basics#testMinusSeconds_int AssertionFailedError e...
  org.joda.time.TestLocalTime_Basics#testMinus_RP AssertionFailedError expected:...
  org.joda.time.TestLocalTime_Basics#testPlusHours_int AssertionFailedError expe...
  org.joda.time.TestLocalTime_Basics#testPlusMillis_int AssertionFailedError exp...
  org.joda.time.TestLocalTime_Basics#testPlusMinutes_int AssertionFailedError ex...
  org.joda.time.TestLocalTime_Basics#testPlusSeconds_int AssertionFailedError ex...
  org.joda.time.TestLocalTime_Basics#testPlus_RP AssertionFailedError expected:<...
  org.joda.time.chrono.TestBuddhistChronology#testEpoch AssertionFailedError exp...
  org.joda.time.chrono.TestBuddhistChronology#testKeyYears AssertionFailedError ...
  org.joda.time.chrono.TestGJChronology#testCutoverAddMonths AssertionFailedError
  org.joda.time.chrono.TestGJChronology#testCutoverAddWeeks AssertionFailedError
  org.joda.time.chrono.TestGJChronology#testCutoverAddYears AssertionFailedError
  org.joda.time.chrono.TestGJChronology#testMaximumValue AssertionFailedError ex...
  org.joda.time.chrono.TestGJChronology#testParseEquivalence AssertionFailedError
  org.joda.time.chrono.TestGJChronology#testPartialGetAsText ComparisonFailure e...
  org.joda.time.chrono.TestGJDate#test_plusWeekyears_positiveToNegative_crossCutover AssertionFailedError
  org.joda.time.convert.TestStringConverter#testSetIntoInterval_Object_Chronology7 AssertionFailedError
  org.joda.time.convert.TestStringConverter#testSetIntoInterval_Object_Chronology8 AssertionFailedError
  org.joda.time.format.TestDateTimeFormatter#testParseDateTime_chrono AssertionFailedError
  org.joda.time.format.TestDateTimeFormatter#testParseInto_chrono AssertionFailedError
  org.joda.time.format.TestDateTimeFormatter#testParseLocalDateTime_monthDay_feb29 AssertionFailedError
  org.joda.time.format.TestDateTimeFormatter#testParseLocalDateTime_monthDay_withDefaultYear_feb29 AssertionFailedError
  org.joda.time.format.TestDateTimeFormatter#testParseLocalDateTime_simple AssertionFailedError
  org.joda.time.format.TestDateTimeFormatter#testParseLocalDate_monthDay_feb29 AssertionFailedError
  org.joda.time.format.TestDateTimeFormatter#testParseLocalDate_monthDay_withDefaultYear_feb29 AssertionFailedError
  org.joda.time.format.TestDateTimeFormatter#testParseLocalDate_simple AssertionFailedError
  org.joda.time.format.TestDateTimeFormatter#testParseLocalDate_weekyear_month_week_2010 AssertionFailedError
  org.joda.time.format.TestDateTimeFormatter#testParseLocalDate_weekyear_month_week_2011 AssertionFailedError
  org.joda.time.format.TestDateTimeFormatter#testParseLocalDate_weekyear_month_week_2012 AssertionFailedError
  org.joda.time.format.TestDateTimeFormatter#testParseLocalDate_yearOfCentury AssertionFailedError
  org.joda.time.format.TestDateTimeFormatter#testParseLocalDate_year_month_week_2010 AssertionFailedError
  org.joda.time.format.TestDateTimeFormatter#testParseLocalDate_year_month_week_2011 AssertionFailedError
  org.joda.time.format.TestDateTimeFormatter#testParseLocalDate_year_month_week_2012 AssertionFailedError
  org.joda.time.format.TestDateTimeFormatter#testParseLocalDate_year_month_week_2013 AssertionFailedError
  org.joda.time.format.TestDateTimeFormatter#testParseLocalDate_year_month_week_2014 AssertionFailedError
  org.joda.time.format.TestDateTimeFormatter#testParseLocalDate_year_month_week_2015 AssertionFailedError
  org.joda.time.format.TestDateTimeFormatter#testParseLocalDate_year_month_week_2016 AssertionFailedError
  org.joda.time.format.TestDateTimeFormatter#testParseLocalTime_simple AssertionFailedError
  org.joda.time.format.TestDateTimeFormatter#testParseMutableDateTime_chrono AssertionFailedError
Tests in error: 
  org.joda.time.chrono.TestGJChronology#testCutoverAddWeekyears IllegalFieldValueException
  org.joda.time.chrono.TestGJChronology#testYearEndAddDays IllegalFieldValueException
  org.joda.time.chrono.TestGJDate#test_plusWeekyears_positiveToZero_crossCutover IllegalFieldValueException
  org.joda.time.format.TestDateTimeFormat#testFormat_yearOfEraParse IllegalFieldValueException
  org.joda.time.format.TestDateTimeFormatter#testParseLocalDate_yearOfEra IllegalFieldValueException

Tests run: 4157, Failures: 71, Errors: 5, Skipped: 0

[INFO] ------------------------------------------------------------------------
[INFO] BUILD FAILURE
[INFO] ------------------------------------------------------------------------
[INFO] Total time: 15.660s
[INFO] Finished at: Thu Aug 06 00:43:36 BST 2015
[INFO] Final Memory: 9M/209M
[INFO] ------------------------------------------------------------------------
[ERROR] Failed to execute goal org.apache.maven.plugins:maven-surefire-plugin:2.18.1:test (default-test) on project joda-time: There are test failures.
[ERROR] 
[ERROR] Please refer to /home/perham/Study/LittleDarwin/Cases/joda-time-2.8.1/target/surefire-reports for the individual test results.
[ERROR] -> [Help 1]
[ERROR] 
[ERROR] To see the full stack trace of the errors, re-run Maven with the -e switch.
[ERROR] Re-run Maven using the -X switch to enable full debug logging.
[ERROR] 
[ERROR] For more information about the errors and possible solutions, please read the following articles:
[ERROR] [Help 1] http://cwiki.apache.org/confluence/display/MAVEN/MojoFailureException
