[INFO] Scanning for projects...
[INFO]                                                                         
[INFO] ------------------------------------------------------------------------
[INFO] Building Joda-Time 2.8.1
[INFO] ------------------------------------------------------------------------
[INFO] 
[INFO] --- maven-resources-plugin:2.7:resources (default-resources) @ joda-time ---
[INFO] Using 'UTF-8' encoding to copy filtered resources.
[INFO] Copying 2 resources to META-INF
[INFO] Copying 10 resources
[INFO] 
[INFO] --- maven-compiler-plugin:3.3:compile (default-compile) @ joda-time ---
[INFO] Changes detected - recompiling the module!
[INFO] Compiling 166 source files to /home/perham/Study/LittleDarwin/Cases/joda-time-2.8.1/target/classes
[INFO] 
[INFO] --- exec-maven-plugin:1.4.0:java (compile-tzdb) @ joda-time ---
Writing zoneinfo files
Writing ZoneInfoMap
[INFO] 
[INFO] --- maven-resources-plugin:2.7:testResources (default-testResources) @ joda-time ---
[INFO] Using 'UTF-8' encoding to copy filtered resources.
[INFO] Copying 34 resources
[INFO] 
[INFO] --- maven-compiler-plugin:3.3:testCompile (default-testCompile) @ joda-time ---
[INFO] Nothing to compile - all classes are up to date
[INFO] 
[INFO] --- maven-surefire-plugin:2.18.1:test (default-test) @ joda-time ---
[INFO] Surefire report directory: /home/perham/Study/LittleDarwin/Cases/joda-time-2.8.1/target/surefire-reports

-------------------------------------------------------
 T E S T S
-------------------------------------------------------
Running org.joda.time.TestAllPackages

TestBuddhistChronology.testCalendar

TestCopticChronology.testCalendar

TestEthiopicChronology.testCalendar

TestIslamicChronology.testCalendar

Testing Gregorian chronology over 1000 iterations
100% complete (i=1000)

Testing Julian chronology over 1000 iterations
100% complete (i=1000)
Writing zoneinfo files
Writing ZoneInfoMap
Tests run: 4157, Failures: 31, Errors: 0, Skipped: 0, Time elapsed: 5.239 sec <<< FAILURE! - in org.joda.time.TestAllPackages
testPlusYears_int(org.joda.time.TestDateTime_Basics)  Time elapsed: 0.005 sec  <<< FAILURE!
junit.framework.AssertionFailedError: expected:<2003-05-03T01:02:03.004-00:01:15> but was:<2003-05-12T01:02:03.004-00:01:15>
	at junit.framework.Assert.fail(Assert.java:47)
	at junit.framework.Assert.failNotEquals(Assert.java:280)
	at junit.framework.Assert.assertEquals(Assert.java:64)
	at junit.framework.Assert.assertEquals(Assert.java:71)
	at org.joda.time.TestDateTime_Basics.testPlusYears_int(TestDateTime_Basics.java:1069)

testPlusMonths_int(org.joda.time.TestDateTime_Basics)  Time elapsed: 0.004 sec  <<< FAILURE!
junit.framework.AssertionFailedError: expected:<2002-06-03T01:02:03.004-00:01:15> but was:<2002-06-12T01:02:03.004-00:01:15>
	at junit.framework.Assert.fail(Assert.java:47)
	at junit.framework.Assert.failNotEquals(Assert.java:280)
	at junit.framework.Assert.assertEquals(Assert.java:64)
	at junit.framework.Assert.assertEquals(Assert.java:71)
	at org.joda.time.TestDateTime_Basics.testPlusMonths_int(TestDateTime_Basics.java:1079)

testMinusYears_int(org.joda.time.TestDateTime_Basics)  Time elapsed: 0.001 sec  <<< FAILURE!
junit.framework.AssertionFailedError: expected:<2001-05-03T01:02:03.004-00:01:15> but was:<2001-05-12T01:02:03.004-00:01:15>
	at junit.framework.Assert.fail(Assert.java:47)
	at junit.framework.Assert.failNotEquals(Assert.java:280)
	at junit.framework.Assert.assertEquals(Assert.java:64)
	at junit.framework.Assert.assertEquals(Assert.java:71)
	at org.joda.time.TestDateTime_Basics.testMinusYears_int(TestDateTime_Basics.java:1177)

testMinusMonths_int(org.joda.time.TestDateTime_Basics)  Time elapsed: 0 sec  <<< FAILURE!
junit.framework.AssertionFailedError: expected:<2002-04-03T01:02:03.004-00:01:15> but was:<2002-04-12T01:02:03.004-00:01:15>
	at junit.framework.Assert.fail(Assert.java:47)
	at junit.framework.Assert.failNotEquals(Assert.java:280)
	at junit.framework.Assert.assertEquals(Assert.java:64)
	at junit.framework.Assert.assertEquals(Assert.java:71)
	at org.joda.time.TestDateTime_Basics.testMinusMonths_int(TestDateTime_Basics.java:1187)

testPlusYears_int(org.joda.time.TestDateMidnight_Basics)  Time elapsed: 0.001 sec  <<< FAILURE!
junit.framework.AssertionFailedError: expected:<2003-05-03T00:00:00.000-00:01:15> but was:<2003-05-12T00:00:00.000-00:01:15>
	at junit.framework.Assert.fail(Assert.java:47)
	at junit.framework.Assert.failNotEquals(Assert.java:280)
	at junit.framework.Assert.assertEquals(Assert.java:64)
	at junit.framework.Assert.assertEquals(Assert.java:71)
	at org.joda.time.TestDateMidnight_Basics.testPlusYears_int(TestDateMidnight_Basics.java:882)

testPlusMonths_int(org.joda.time.TestDateMidnight_Basics)  Time elapsed: 0.001 sec  <<< FAILURE!
junit.framework.AssertionFailedError: expected:<2002-06-03T00:00:00.000-00:01:15> but was:<2002-06-12T00:00:00.000-00:01:15>
	at junit.framework.Assert.fail(Assert.java:47)
	at junit.framework.Assert.failNotEquals(Assert.java:280)
	at junit.framework.Assert.assertEquals(Assert.java:64)
	at junit.framework.Assert.assertEquals(Assert.java:71)
	at org.joda.time.TestDateMidnight_Basics.testPlusMonths_int(TestDateMidnight_Basics.java:892)

testMinusYears_int(org.joda.time.TestDateMidnight_Basics)  Time elapsed: 0 sec  <<< FAILURE!
junit.framework.AssertionFailedError: expected:<2001-05-03T00:00:00.000-00:01:15> but was:<2001-05-12T00:00:00.000-00:01:15>
	at junit.framework.Assert.fail(Assert.java:47)
	at junit.framework.Assert.failNotEquals(Assert.java:280)
	at junit.framework.Assert.assertEquals(Assert.java:64)
	at junit.framework.Assert.assertEquals(Assert.java:71)
	at org.joda.time.TestDateMidnight_Basics.testMinusYears_int(TestDateMidnight_Basics.java:950)

testMinusMonths_int(org.joda.time.TestDateMidnight_Basics)  Time elapsed: 0 sec  <<< FAILURE!
junit.framework.AssertionFailedError: expected:<2002-04-03T00:00:00.000-00:01:15> but was:<2002-04-12T00:00:00.000-00:01:15>
	at junit.framework.Assert.fail(Assert.java:47)
	at junit.framework.Assert.failNotEquals(Assert.java:280)
	at junit.framework.Assert.assertEquals(Assert.java:64)
	at junit.framework.Assert.assertEquals(Assert.java:71)
	at org.joda.time.TestDateMidnight_Basics.testMinusMonths_int(TestDateMidnight_Basics.java:960)

testPlusYears_int(org.joda.time.TestLocalDateTime_Basics)  Time elapsed: 0 sec  <<< FAILURE!
junit.framework.AssertionFailedError: expected:<2003-05-03T10:20:30.040> but was:<2003-05-12T10:20:30.040>
	at junit.framework.Assert.fail(Assert.java:47)
	at junit.framework.Assert.failNotEquals(Assert.java:280)
	at junit.framework.Assert.assertEquals(Assert.java:64)
	at junit.framework.Assert.assertEquals(Assert.java:71)
	at org.joda.time.TestLocalDateTime_Basics.testPlusYears_int(TestLocalDateTime_Basics.java:547)

testPlusMonths_int(org.joda.time.TestLocalDateTime_Basics)  Time elapsed: 0.003 sec  <<< FAILURE!
junit.framework.AssertionFailedError: expected:<2002-06-03T10:20:30.040> but was:<2002-06-12T10:20:30.040>
	at junit.framework.Assert.fail(Assert.java:47)
	at junit.framework.Assert.failNotEquals(Assert.java:280)
	at junit.framework.Assert.assertEquals(Assert.java:64)
	at junit.framework.Assert.assertEquals(Assert.java:71)
	at org.joda.time.TestLocalDateTime_Basics.testPlusMonths_int(TestLocalDateTime_Basics.java:557)

testMinusYears_int(org.joda.time.TestLocalDateTime_Basics)  Time elapsed: 0 sec  <<< FAILURE!
junit.framework.AssertionFailedError: expected:<2001-05-03T10:20:30.040> but was:<2001-05-12T10:20:30.040>
	at junit.framework.Assert.fail(Assert.java:47)
	at junit.framework.Assert.failNotEquals(Assert.java:280)
	at junit.framework.Assert.assertEquals(Assert.java:64)
	at junit.framework.Assert.assertEquals(Assert.java:71)
	at org.joda.time.TestLocalDateTime_Basics.testMinusYears_int(TestLocalDateTime_Basics.java:639)

testMinusMonths_int(org.joda.time.TestLocalDateTime_Basics)  Time elapsed: 0.001 sec  <<< FAILURE!
junit.framework.AssertionFailedError: expected:<2002-04-03T10:20:30.040> but was:<2002-04-12T10:20:30.040>
	at junit.framework.Assert.fail(Assert.java:47)
	at junit.framework.Assert.failNotEquals(Assert.java:280)
	at junit.framework.Assert.assertEquals(Assert.java:64)
	at junit.framework.Assert.assertEquals(Assert.java:71)
	at org.joda.time.TestLocalDateTime_Basics.testMinusMonths_int(TestLocalDateTime_Basics.java:649)

testPlusYears_int(org.joda.time.TestLocalDate_Basics)  Time elapsed: 0.001 sec  <<< FAILURE!
junit.framework.AssertionFailedError: expected:<2003-05-03> but was:<2003-05-12>
	at junit.framework.Assert.fail(Assert.java:47)
	at junit.framework.Assert.failNotEquals(Assert.java:280)
	at junit.framework.Assert.assertEquals(Assert.java:64)
	at junit.framework.Assert.assertEquals(Assert.java:71)
	at org.joda.time.TestLocalDate_Basics.testPlusYears_int(TestLocalDate_Basics.java:531)

testPlusMonths_int(org.joda.time.TestLocalDate_Basics)  Time elapsed: 0 sec  <<< FAILURE!
junit.framework.AssertionFailedError: expected:<2002-06-03> but was:<2002-06-12>
	at junit.framework.Assert.fail(Assert.java:47)
	at junit.framework.Assert.failNotEquals(Assert.java:280)
	at junit.framework.Assert.assertEquals(Assert.java:64)
	at junit.framework.Assert.assertEquals(Assert.java:71)
	at org.joda.time.TestLocalDate_Basics.testPlusMonths_int(TestLocalDate_Basics.java:541)

testMinusYears_int(org.joda.time.TestLocalDate_Basics)  Time elapsed: 0 sec  <<< FAILURE!
junit.framework.AssertionFailedError: expected:<2001-05-03> but was:<2001-05-12>
	at junit.framework.Assert.fail(Assert.java:47)
	at junit.framework.Assert.failNotEquals(Assert.java:280)
	at junit.framework.Assert.assertEquals(Assert.java:64)
	at junit.framework.Assert.assertEquals(Assert.java:71)
	at org.joda.time.TestLocalDate_Basics.testMinusYears_int(TestLocalDate_Basics.java:586)

testMinusMonths_int(org.joda.time.TestLocalDate_Basics)  Time elapsed: 0.002 sec  <<< FAILURE!
junit.framework.AssertionFailedError: expected:<2002-04-03> but was:<2002-04-12>
	at junit.framework.Assert.fail(Assert.java:47)
	at junit.framework.Assert.failNotEquals(Assert.java:280)
	at junit.framework.Assert.assertEquals(Assert.java:64)
	at junit.framework.Assert.assertEquals(Assert.java:71)
	at org.joda.time.TestLocalDate_Basics.testMinusMonths_int(TestLocalDate_Basics.java:596)

testCutoverAddYears(org.joda.time.chrono.TestGJChronology)  Time elapsed: 0 sec  <<< FAILURE!
junit.framework.AssertionFailedError: expected:<1583-01-01T00:00:00.000Z> but was:<1583-01-11T00:00:00.000Z>
	at junit.framework.Assert.fail(Assert.java:47)
	at junit.framework.Assert.failNotEquals(Assert.java:280)
	at junit.framework.Assert.assertEquals(Assert.java:64)
	at junit.framework.Assert.assertEquals(Assert.java:71)
	at org.joda.time.chrono.TestGJChronology.testAdd(TestGJChronology.java:484)
	at org.joda.time.chrono.TestGJChronology.testCutoverAddYears(TestGJChronology.java:381)

testCutoverAddWeekyears(org.joda.time.chrono.TestGJChronology)  Time elapsed: 0.001 sec  <<< FAILURE!
junit.framework.AssertionFailedError: expected:<1583-01-03T00:00:00.000Z> but was:<1583-01-10T00:00:00.000Z>
	at junit.framework.Assert.fail(Assert.java:47)
	at junit.framework.Assert.failNotEquals(Assert.java:280)
	at junit.framework.Assert.assertEquals(Assert.java:64)
	at junit.framework.Assert.assertEquals(Assert.java:71)
	at org.joda.time.chrono.TestGJChronology.testAdd(TestGJChronology.java:484)
	at org.joda.time.chrono.TestGJChronology.testCutoverAddWeekyears(TestGJChronology.java:401)

testCutoverAddMonths(org.joda.time.chrono.TestGJChronology)  Time elapsed: 0.001 sec  <<< FAILURE!
junit.framework.AssertionFailedError: expected:<1582-02-01T00:00:00.000Z> but was:<1582-02-11T00:00:00.000Z>
	at junit.framework.Assert.fail(Assert.java:47)
	at junit.framework.Assert.failNotEquals(Assert.java:280)
	at junit.framework.Assert.assertEquals(Assert.java:64)
	at junit.framework.Assert.assertEquals(Assert.java:71)
	at org.joda.time.chrono.TestGJChronology.testAdd(TestGJChronology.java:484)
	at org.joda.time.chrono.TestGJChronology.testCutoverAddMonths(TestGJChronology.java:422)

test_plusYears_positiveToPositive(org.joda.time.chrono.TestGJDate)  Time elapsed: 0.001 sec  <<< FAILURE!
junit.framework.AssertionFailedError: expected:<0007-06-30> but was:<0007-06-28>
	at junit.framework.Assert.fail(Assert.java:47)
	at junit.framework.Assert.failNotEquals(Assert.java:280)
	at junit.framework.Assert.assertEquals(Assert.java:64)
	at junit.framework.Assert.assertEquals(Assert.java:71)
	at org.joda.time.chrono.TestGJDate.test_plusYears_positiveToPositive(TestGJDate.java:55)

test_plusYears_positiveToZero(org.joda.time.chrono.TestGJDate)  Time elapsed: 0.001 sec  <<< FAILURE!
junit.framework.AssertionFailedError: expected:<-0001-06-30> but was:<-0001-06-28>
	at junit.framework.Assert.fail(Assert.java:47)
	at junit.framework.Assert.failNotEquals(Assert.java:280)
	at junit.framework.Assert.assertEquals(Assert.java:64)
	at junit.framework.Assert.assertEquals(Assert.java:71)
	at org.joda.time.chrono.TestGJDate.test_plusYears_positiveToZero(TestGJDate.java:61)

test_plusYears_negativeToZero(org.joda.time.chrono.TestGJDate)  Time elapsed: 0.001 sec  <<< FAILURE!
junit.framework.AssertionFailedError: expected:<0001-06-30> but was:<0001-06-28>
	at junit.framework.Assert.fail(Assert.java:47)
	at junit.framework.Assert.failNotEquals(Assert.java:280)
	at junit.framework.Assert.assertEquals(Assert.java:64)
	at junit.framework.Assert.assertEquals(Assert.java:71)
	at org.joda.time.chrono.TestGJDate.test_plusYears_negativeToZero(TestGJDate.java:80)

test_plusYears_positiveToNegative_crossCutover(org.joda.time.chrono.TestGJDate)  Time elapsed: 0 sec  <<< FAILURE!
junit.framework.AssertionFailedError: expected:<-0002-06-30> but was:<-0002-06-17>
	at junit.framework.Assert.fail(Assert.java:47)
	at junit.framework.Assert.failNotEquals(Assert.java:280)
	at junit.framework.Assert.assertEquals(Assert.java:64)
	at junit.framework.Assert.assertEquals(Assert.java:71)
	at org.joda.time.chrono.TestGJDate.test_plusYears_positiveToNegative_crossCutover(TestGJDate.java:105)

test_plusYears_negativeToPositive_crossCutover(org.joda.time.chrono.TestGJDate)  Time elapsed: 0.001 sec  <<< FAILURE!
junit.framework.AssertionFailedError: expected:<2002-06-30> but was:<2002-06-28>
	at junit.framework.Assert.fail(Assert.java:47)
	at junit.framework.Assert.failNotEquals(Assert.java:280)
	at junit.framework.Assert.assertEquals(Assert.java:64)
	at junit.framework.Assert.assertEquals(Assert.java:71)
	at org.joda.time.chrono.TestGJDate.test_plusYears_negativeToPositive_crossCutover(TestGJDate.java:111)

test_plusWeekyears_positiveToZero_crossCutover(org.joda.time.chrono.TestGJDate)  Time elapsed: 0.001 sec  <<< FAILURE!
junit.framework.AssertionFailedError: expected:<-0001-06-28> but was:<-0001-06-14>
	at junit.framework.Assert.fail(Assert.java:47)
	at junit.framework.Assert.failNotEquals(Assert.java:280)
	at junit.framework.Assert.assertEquals(Assert.java:64)
	at junit.framework.Assert.assertEquals(Assert.java:71)
	at org.joda.time.chrono.TestGJDate.test_plusWeekyears_positiveToZero_crossCutover(TestGJDate.java:118)

test_plusWeekyears_positiveToNegative_crossCutover(org.joda.time.chrono.TestGJDate)  Time elapsed: 0.001 sec  <<< FAILURE!
junit.framework.AssertionFailedError: expected:<-0002-06-30> but was:<-0002-06-16>
	at junit.framework.Assert.fail(Assert.java:47)
	at junit.framework.Assert.failNotEquals(Assert.java:280)
	at junit.framework.Assert.assertEquals(Assert.java:64)
	at junit.framework.Assert.assertEquals(Assert.java:71)
	at org.joda.time.chrono.TestGJDate.test_plusWeekyears_positiveToNegative_crossCutover(TestGJDate.java:124)

test_plusYears_positiveToNegative(org.joda.time.chrono.TestGJDate)  Time elapsed: 0.007 sec  <<< FAILURE!
junit.framework.AssertionFailedError: expected:<-0002-06-30> but was:<-0002-06-28>
	at junit.framework.Assert.fail(Assert.java:47)
	at junit.framework.Assert.failNotEquals(Assert.java:280)
	at junit.framework.Assert.assertEquals(Assert.java:64)
	at junit.framework.Assert.assertEquals(Assert.java:71)
	at org.joda.time.chrono.TestGJDate.test_plusYears_positiveToNegative(TestGJDate.java:67)

test_plusYears_negativeToNegative(org.joda.time.chrono.TestGJDate)  Time elapsed: 0 sec  <<< FAILURE!
junit.framework.AssertionFailedError: expected:<-0001-06-30> but was:<-0001-06-28>
	at junit.framework.Assert.fail(Assert.java:47)
	at junit.framework.Assert.failNotEquals(Assert.java:280)
	at junit.framework.Assert.assertEquals(Assert.java:64)
	at junit.framework.Assert.assertEquals(Assert.java:71)
	at org.joda.time.chrono.TestGJDate.test_plusYears_negativeToNegative(TestGJDate.java:74)

test_plusYears_negativeToPositive(org.joda.time.chrono.TestGJDate)  Time elapsed: 0 sec  <<< FAILURE!
junit.framework.AssertionFailedError: expected:<0002-06-30> but was:<0002-06-28>
	at junit.framework.Assert.fail(Assert.java:47)
	at junit.framework.Assert.failNotEquals(Assert.java:280)
	at junit.framework.Assert.assertEquals(Assert.java:64)
	at junit.framework.Assert.assertEquals(Assert.java:71)
	at org.joda.time.chrono.TestGJDate.test_plusYears_negativeToPositive(TestGJDate.java:86)

test_plusYears_positiveToPositive_crossCutover(org.joda.time.chrono.TestGJDate)  Time elapsed: 0 sec  <<< FAILURE!
junit.framework.AssertionFailedError: expected:<2007-06-30> but was:<2007-06-28>
	at junit.framework.Assert.fail(Assert.java:47)
	at junit.framework.Assert.failNotEquals(Assert.java:280)
	at junit.framework.Assert.assertEquals(Assert.java:64)
	at junit.framework.Assert.assertEquals(Assert.java:71)
	at org.joda.time.chrono.TestGJDate.test_plusYears_positiveToPositive_crossCutover(TestGJDate.java:93)

test_plusYears_positiveToZero_crossCutover(org.joda.time.chrono.TestGJDate)  Time elapsed: 0 sec  <<< FAILURE!
junit.framework.AssertionFailedError: expected:<-0001-06-30> but was:<-0001-06-17>
	at junit.framework.Assert.fail(Assert.java:47)
	at junit.framework.Assert.failNotEquals(Assert.java:280)
	at junit.framework.Assert.assertEquals(Assert.java:64)
	at junit.framework.Assert.assertEquals(Assert.java:71)
	at org.joda.time.chrono.TestGJDate.test_plusYears_positiveToZero_crossCutover(TestGJDate.java:99)


Results :

Failed tests: 
  org.joda.time.TestDateMidnight_Basics#testMinusMonths_int AssertionFailedError
  org.joda.time.TestDateMidnight_Basics#testMinusYears_int AssertionFailedError ...
  org.joda.time.TestDateMidnight_Basics#testPlusMonths_int AssertionFailedError ...
  org.joda.time.TestDateMidnight_Basics#testPlusYears_int AssertionFailedError e...
  org.joda.time.TestDateTime_Basics#testMinusMonths_int AssertionFailedError exp...
  org.joda.time.TestDateTime_Basics#testMinusYears_int AssertionFailedError expe...
  org.joda.time.TestDateTime_Basics#testPlusMonths_int AssertionFailedError expe...
  org.joda.time.TestDateTime_Basics#testPlusYears_int AssertionFailedError expec...
  org.joda.time.TestLocalDateTime_Basics#testMinusMonths_int AssertionFailedError
  org.joda.time.TestLocalDateTime_Basics#testMinusYears_int AssertionFailedError
  org.joda.time.TestLocalDateTime_Basics#testPlusMonths_int AssertionFailedError
  org.joda.time.TestLocalDateTime_Basics#testPlusYears_int AssertionFailedError ...
  org.joda.time.TestLocalDate_Basics#testMinusMonths_int AssertionFailedError ex...
  org.joda.time.TestLocalDate_Basics#testMinusYears_int AssertionFailedError exp...
  org.joda.time.TestLocalDate_Basics#testPlusMonths_int AssertionFailedError exp...
  org.joda.time.TestLocalDate_Basics#testPlusYears_int AssertionFailedError expe...
  org.joda.time.chrono.TestGJChronology#testCutoverAddMonths AssertionFailedError
  org.joda.time.chrono.TestGJChronology#testCutoverAddWeekyears AssertionFailedError
  org.joda.time.chrono.TestGJChronology#testCutoverAddYears AssertionFailedError
  org.joda.time.chrono.TestGJDate#test_plusWeekyears_positiveToNegative_crossCutover AssertionFailedError
  org.joda.time.chrono.TestGJDate#test_plusWeekyears_positiveToZero_crossCutover AssertionFailedError
  org.joda.time.chrono.TestGJDate#test_plusYears_negativeToNegative AssertionFailedError
  org.joda.time.chrono.TestGJDate#test_plusYears_negativeToPositive AssertionFailedError
  org.joda.time.chrono.TestGJDate#test_plusYears_negativeToPositive_crossCutover AssertionFailedError
  org.joda.time.chrono.TestGJDate#test_plusYears_negativeToZero AssertionFailedError
  org.joda.time.chrono.TestGJDate#test_plusYears_positiveToNegative AssertionFailedError
  org.joda.time.chrono.TestGJDate#test_plusYears_positiveToNegative_crossCutover AssertionFailedError
  org.joda.time.chrono.TestGJDate#test_plusYears_positiveToPositive AssertionFailedError
  org.joda.time.chrono.TestGJDate#test_plusYears_positiveToPositive_crossCutover AssertionFailedError
  org.joda.time.chrono.TestGJDate#test_plusYears_positiveToZero AssertionFailedError
  org.joda.time.chrono.TestGJDate#test_plusYears_positiveToZero_crossCutover AssertionFailedError

Tests run: 4157, Failures: 31, Errors: 0, Skipped: 0

[INFO] ------------------------------------------------------------------------
[INFO] BUILD FAILURE
[INFO] ------------------------------------------------------------------------
[INFO] Total time: 15.840s
[INFO] Finished at: Thu Aug 06 00:35:43 BST 2015
[INFO] Final Memory: 10M/338M
[INFO] ------------------------------------------------------------------------
[ERROR] Failed to execute goal org.apache.maven.plugins:maven-surefire-plugin:2.18.1:test (default-test) on project joda-time: There are test failures.
[ERROR] 
[ERROR] Please refer to /home/perham/Study/LittleDarwin/Cases/joda-time-2.8.1/target/surefire-reports for the individual test results.
[ERROR] -> [Help 1]
[ERROR] 
[ERROR] To see the full stack trace of the errors, re-run Maven with the -e switch.
[ERROR] Re-run Maven using the -X switch to enable full debug logging.
[ERROR] 
[ERROR] For more information about the errors and possible solutions, please read the following articles:
[ERROR] [Help 1] http://cwiki.apache.org/confluence/display/MAVEN/MojoFailureException
