[INFO] Scanning for projects...
[INFO]                                                                         
[INFO] ------------------------------------------------------------------------
[INFO] Building Joda-Time 2.8.1
[INFO] ------------------------------------------------------------------------
[INFO] 
[INFO] --- maven-resources-plugin:2.7:resources (default-resources) @ joda-time ---
[INFO] Using 'UTF-8' encoding to copy filtered resources.
[INFO] Copying 2 resources to META-INF
[INFO] Copying 10 resources
[INFO] 
[INFO] --- maven-compiler-plugin:3.3:compile (default-compile) @ joda-time ---
[INFO] Changes detected - recompiling the module!
[INFO] Compiling 166 source files to /home/perham/Study/LittleDarwin/Cases/joda-time-2.8.1/target/classes
[INFO] 
[INFO] --- exec-maven-plugin:1.4.0:java (compile-tzdb) @ joda-time ---
Writing zoneinfo files
Writing ZoneInfoMap
[INFO] 
[INFO] --- maven-resources-plugin:2.7:testResources (default-testResources) @ joda-time ---
[INFO] Using 'UTF-8' encoding to copy filtered resources.
[INFO] Copying 34 resources
[INFO] 
[INFO] --- maven-compiler-plugin:3.3:testCompile (default-testCompile) @ joda-time ---
[INFO] Nothing to compile - all classes are up to date
[INFO] 
[INFO] --- maven-surefire-plugin:2.18.1:test (default-test) @ joda-time ---
[INFO] Surefire report directory: /home/perham/Study/LittleDarwin/Cases/joda-time-2.8.1/target/surefire-reports

-------------------------------------------------------
 T E S T S
-------------------------------------------------------
Running org.joda.time.TestAllPackages

TestBuddhistChronology.testCalendar

TestCopticChronology.testCalendar

TestEthiopicChronology.testCalendar

TestIslamicChronology.testCalendar

Testing Gregorian chronology over 1000 iterations
100% complete (i=1000)

Testing Julian chronology over 1000 iterations
100% complete (i=1000)
Writing zoneinfo files
Writing ZoneInfoMap
Tests run: 4157, Failures: 42, Errors: 93, Skipped: 0, Time elapsed: 5.018 sec <<< FAILURE! - in org.joda.time.TestAllPackages
testToString(org.joda.time.TestChronology)  Time elapsed: 0.004 sec  <<< ERROR!
java.lang.NullPointerException
	at org.joda.time.TestChronology.testToString(TestChronology.java:239)

test_era(org.joda.time.TestDateTimeFieldType)  Time elapsed: 0 sec  <<< ERROR!
java.lang.NullPointerException
	at org.joda.time.TestDateTimeFieldType.test_era(TestDateTimeFieldType.java:60)

test_centuryOfEra(org.joda.time.TestDateTimeFieldType)  Time elapsed: 0.002 sec  <<< ERROR!
java.lang.NullPointerException
	at org.joda.time.TestDateTimeFieldType.test_centuryOfEra(TestDateTimeFieldType.java:70)

test_yearOfCentury(org.joda.time.TestDateTimeFieldType)  Time elapsed: 0.001 sec  <<< ERROR!
java.lang.NullPointerException
	at org.joda.time.TestDateTimeFieldType.test_yearOfCentury(TestDateTimeFieldType.java:80)

test_yearOfEra(org.joda.time.TestDateTimeFieldType)  Time elapsed: 0.001 sec  <<< ERROR!
java.lang.NullPointerException
	at org.joda.time.TestDateTimeFieldType.test_yearOfEra(TestDateTimeFieldType.java:90)

test_year(org.joda.time.TestDateTimeFieldType)  Time elapsed: 0.002 sec  <<< ERROR!
java.lang.NullPointerException
	at org.joda.time.TestDateTimeFieldType.test_year(TestDateTimeFieldType.java:100)

test_monthOfYear(org.joda.time.TestDateTimeFieldType)  Time elapsed: 0.001 sec  <<< ERROR!
java.lang.NullPointerException
	at org.joda.time.TestDateTimeFieldType.test_monthOfYear(TestDateTimeFieldType.java:110)

test_weekyearOfCentury(org.joda.time.TestDateTimeFieldType)  Time elapsed: 0.001 sec  <<< ERROR!
java.lang.NullPointerException
	at org.joda.time.TestDateTimeFieldType.test_weekyearOfCentury(TestDateTimeFieldType.java:120)

test_weekyear(org.joda.time.TestDateTimeFieldType)  Time elapsed: 0 sec  <<< ERROR!
java.lang.NullPointerException
	at org.joda.time.TestDateTimeFieldType.test_weekyear(TestDateTimeFieldType.java:130)

test_weekOfWeekyear(org.joda.time.TestDateTimeFieldType)  Time elapsed: 0.001 sec  <<< ERROR!
java.lang.NullPointerException
	at org.joda.time.TestDateTimeFieldType.test_weekOfWeekyear(TestDateTimeFieldType.java:140)

test_dayOfYear(org.joda.time.TestDateTimeFieldType)  Time elapsed: 0.001 sec  <<< ERROR!
java.lang.NullPointerException
	at org.joda.time.TestDateTimeFieldType.test_dayOfYear(TestDateTimeFieldType.java:150)

test_dayOfMonth(org.joda.time.TestDateTimeFieldType)  Time elapsed: 0.001 sec  <<< ERROR!
java.lang.NullPointerException
	at org.joda.time.TestDateTimeFieldType.test_dayOfMonth(TestDateTimeFieldType.java:160)

test_dayOfWeek(org.joda.time.TestDateTimeFieldType)  Time elapsed: 0.001 sec  <<< ERROR!
java.lang.NullPointerException
	at org.joda.time.TestDateTimeFieldType.test_dayOfWeek(TestDateTimeFieldType.java:170)

test_halfdayOfDay(org.joda.time.TestDateTimeFieldType)  Time elapsed: 0.001 sec  <<< ERROR!
java.lang.NullPointerException
	at org.joda.time.TestDateTimeFieldType.test_halfdayOfDay(TestDateTimeFieldType.java:180)

test_clockhourOfDay(org.joda.time.TestDateTimeFieldType)  Time elapsed: 0.001 sec  <<< ERROR!
java.lang.NullPointerException
	at org.joda.time.TestDateTimeFieldType.test_clockhourOfDay(TestDateTimeFieldType.java:190)

test_clockhourOfHalfday(org.joda.time.TestDateTimeFieldType)  Time elapsed: 0 sec  <<< ERROR!
java.lang.NullPointerException
	at org.joda.time.TestDateTimeFieldType.test_clockhourOfHalfday(TestDateTimeFieldType.java:200)

test_hourOfHalfday(org.joda.time.TestDateTimeFieldType)  Time elapsed: 0.001 sec  <<< ERROR!
java.lang.NullPointerException
	at org.joda.time.TestDateTimeFieldType.test_hourOfHalfday(TestDateTimeFieldType.java:210)

test_hourOfDay(org.joda.time.TestDateTimeFieldType)  Time elapsed: 0 sec  <<< ERROR!
java.lang.NullPointerException
	at org.joda.time.TestDateTimeFieldType.test_hourOfDay(TestDateTimeFieldType.java:220)

test_minuteOfDay(org.joda.time.TestDateTimeFieldType)  Time elapsed: 0 sec  <<< ERROR!
java.lang.NullPointerException
	at org.joda.time.TestDateTimeFieldType.test_minuteOfDay(TestDateTimeFieldType.java:230)

test_minuteOfHour(org.joda.time.TestDateTimeFieldType)  Time elapsed: 0 sec  <<< ERROR!
java.lang.NullPointerException
	at org.joda.time.TestDateTimeFieldType.test_minuteOfHour(TestDateTimeFieldType.java:240)

test_secondOfDay(org.joda.time.TestDateTimeFieldType)  Time elapsed: 0.003 sec  <<< ERROR!
java.lang.NullPointerException
	at org.joda.time.TestDateTimeFieldType.test_secondOfDay(TestDateTimeFieldType.java:250)

test_secondOfMinute(org.joda.time.TestDateTimeFieldType)  Time elapsed: 0 sec  <<< ERROR!
java.lang.NullPointerException
	at org.joda.time.TestDateTimeFieldType.test_secondOfMinute(TestDateTimeFieldType.java:260)

test_millisOfDay(org.joda.time.TestDateTimeFieldType)  Time elapsed: 0 sec  <<< ERROR!
java.lang.NullPointerException
	at org.joda.time.TestDateTimeFieldType.test_millisOfDay(TestDateTimeFieldType.java:270)

test_millisOfSecond(org.joda.time.TestDateTimeFieldType)  Time elapsed: 0 sec  <<< ERROR!
java.lang.NullPointerException
	at org.joda.time.TestDateTimeFieldType.test_millisOfSecond(TestDateTimeFieldType.java:280)

test_eras(org.joda.time.TestDurationFieldType)  Time elapsed: 0.001 sec  <<< ERROR!
java.lang.NullPointerException
	at org.joda.time.TestDurationFieldType.test_eras(TestDurationFieldType.java:58)

test_years(org.joda.time.TestDurationFieldType)  Time elapsed: 0.001 sec  <<< ERROR!
java.lang.NullPointerException
	at org.joda.time.TestDurationFieldType.test_years(TestDurationFieldType.java:74)

test_months(org.joda.time.TestDurationFieldType)  Time elapsed: 0 sec  <<< ERROR!
java.lang.NullPointerException
	at org.joda.time.TestDurationFieldType.test_months(TestDurationFieldType.java:82)

test_weekyears(org.joda.time.TestDurationFieldType)  Time elapsed: 0.001 sec  <<< ERROR!
java.lang.NullPointerException
	at org.joda.time.TestDurationFieldType.test_weekyears(TestDurationFieldType.java:90)

test_weeks(org.joda.time.TestDurationFieldType)  Time elapsed: 0 sec  <<< ERROR!
java.lang.NullPointerException
	at org.joda.time.TestDurationFieldType.test_weeks(TestDurationFieldType.java:98)

test_days(org.joda.time.TestDurationFieldType)  Time elapsed: 0 sec  <<< ERROR!
java.lang.NullPointerException
	at org.joda.time.TestDurationFieldType.test_days(TestDurationFieldType.java:106)

test_halfdays(org.joda.time.TestDurationFieldType)  Time elapsed: 0.001 sec  <<< ERROR!
java.lang.NullPointerException
	at org.joda.time.TestDurationFieldType.test_halfdays(TestDurationFieldType.java:114)

test_hours(org.joda.time.TestDurationFieldType)  Time elapsed: 0 sec  <<< ERROR!
java.lang.NullPointerException
	at org.joda.time.TestDurationFieldType.test_hours(TestDurationFieldType.java:122)

test_minutes(org.joda.time.TestDurationFieldType)  Time elapsed: 0.001 sec  <<< ERROR!
java.lang.NullPointerException
	at org.joda.time.TestDurationFieldType.test_minutes(TestDurationFieldType.java:130)

test_seconds(org.joda.time.TestDurationFieldType)  Time elapsed: 0 sec  <<< ERROR!
java.lang.NullPointerException
	at org.joda.time.TestDurationFieldType.test_seconds(TestDurationFieldType.java:138)

test_millis(org.joda.time.TestDurationFieldType)  Time elapsed: 0.001 sec  <<< ERROR!
java.lang.NullPointerException
	at org.joda.time.TestDurationFieldType.test_millis(TestDurationFieldType.java:146)

test_centuries(org.joda.time.TestDurationFieldType)  Time elapsed: 0 sec  <<< ERROR!
java.lang.NullPointerException
	at org.joda.time.TestDurationFieldType.test_centuries(TestDurationFieldType.java:66)

testPropertyEqualsHashCodeLenient(org.joda.time.TestDateTime_Properties)  Time elapsed: 0 sec  <<< ERROR!
java.lang.IllegalArgumentException: Must supply a chronology
	at org.joda.time.chrono.LenientChronology.getInstance(LenientChronology.java:46)
	at org.joda.time.TestDateTime_Properties.testPropertyEqualsHashCodeLenient(TestDateTime_Properties.java:1374)

testPropertyEqualsHashCodeStrict(org.joda.time.TestDateTime_Properties)  Time elapsed: 0 sec  <<< ERROR!
java.lang.IllegalArgumentException: Must supply a chronology
	at org.joda.time.chrono.StrictChronology.getInstance(StrictChronology.java:46)
	at org.joda.time.TestDateTime_Properties.testPropertyEqualsHashCodeStrict(TestDateTime_Properties.java:1386)

testPropertyEqualsHashCodeYear(org.joda.time.TestDateTime_Properties)  Time elapsed: 0.001 sec  <<< FAILURE!
junit.framework.AssertionFailedError: expected:<false> but was:<true>
	at junit.framework.Assert.fail(Assert.java:47)
	at junit.framework.Assert.failNotEquals(Assert.java:280)
	at junit.framework.Assert.assertEquals(Assert.java:64)
	at junit.framework.Assert.assertEquals(Assert.java:146)
	at junit.framework.Assert.assertEquals(Assert.java:152)
	at org.joda.time.TestDateTime_Properties.testPropertyEqualsHashCodeYear(TestDateTime_Properties.java:331)

testPropertyEqualsHashCodeLenient(org.joda.time.TestDateMidnight_Properties)  Time elapsed: 0 sec  <<< ERROR!
java.lang.IllegalArgumentException: Must supply a chronology
	at org.joda.time.chrono.LenientChronology.getInstance(LenientChronology.java:46)
	at org.joda.time.TestDateMidnight_Properties.testPropertyEqualsHashCodeLenient(TestDateMidnight_Properties.java:522)

testPropertyEqualsHashCodeStrict(org.joda.time.TestDateMidnight_Properties)  Time elapsed: 0 sec  <<< ERROR!
java.lang.IllegalArgumentException: Must supply a chronology
	at org.joda.time.chrono.StrictChronology.getInstance(StrictChronology.java:46)
	at org.joda.time.TestDateMidnight_Properties.testPropertyEqualsHashCodeStrict(TestDateMidnight_Properties.java:534)

testConstructor_RI_RP3(org.joda.time.TestInterval_Constructors)  Time elapsed: 0.001 sec  <<< ERROR!
java.lang.NullPointerException
	at org.joda.time.TestInterval_Constructors.testConstructor_RI_RP3(TestInterval_Constructors.java:297)

testConstructor_RP_RI3(org.joda.time.TestInterval_Constructors)  Time elapsed: 0.001 sec  <<< ERROR!
java.lang.NullPointerException
	at org.joda.time.TestInterval_Constructors.testConstructor_RP_RI3(TestInterval_Constructors.java:381)

testWithChronology3(org.joda.time.TestInterval_Basics)  Time elapsed: 0 sec  <<< FAILURE!
junit.framework.AssertionFailedError: expected same:<2002-04-05T14:24:00.000+02:00/2003-05-06T16:28:00.000+02:00> was not:<2002-04-05T14:24:00.000+02:00/2003-05-06T16:28:00.000+02:00>
	at junit.framework.Assert.fail(Assert.java:47)
	at junit.framework.Assert.failNotSame(Assert.java:276)
	at junit.framework.Assert.assertSame(Assert.java:239)
	at junit.framework.Assert.assertSame(Assert.java:246)
	at org.joda.time.TestInterval_Basics.testWithChronology3(TestInterval_Basics.java:1072)

testEqualsHashCodeLenient(org.joda.time.TestInterval_Basics)  Time elapsed: 0.001 sec  <<< ERROR!
java.lang.IllegalArgumentException: Must supply a chronology
	at org.joda.time.chrono.LenientChronology.getInstance(LenientChronology.java:46)
	at org.joda.time.TestInterval_Basics.testEqualsHashCodeLenient(TestInterval_Basics.java:203)

testEqualsHashCodeStrict(org.joda.time.TestInterval_Basics)  Time elapsed: 0 sec  <<< ERROR!
java.lang.IllegalArgumentException: Must supply a chronology
	at org.joda.time.chrono.LenientChronology.getInstance(LenientChronology.java:46)
	at org.joda.time.TestInterval_Basics.testEqualsHashCodeStrict(TestInterval_Basics.java:219)

testEqualsHashCode(org.joda.time.TestLocalDateTime_Basics)  Time elapsed: 0.002 sec  <<< ERROR!
java.lang.NullPointerException
	at org.joda.time.TestLocalDateTime_Basics$MockInstant.getFields(TestLocalDateTime_Basics.java:318)
	at org.joda.time.MockPartial.size(MockPartial.java:33)
	at org.joda.time.base.AbstractPartial.equals(AbstractPartial.java:262)
	at org.joda.time.LocalDateTime.equals(LocalDateTime.java:682)
	at org.joda.time.TestLocalDateTime_Basics.testEqualsHashCode(TestLocalDateTime_Basics.java:302)

testToDateTime_Zone(org.joda.time.TestLocalDateTime_Basics)  Time elapsed: 0.001 sec  <<< FAILURE!
junit.framework.AssertionFailedError: expected:<2005-06-09T06:07:08.009+01:00> but was:<2005-06-09T06:07:08.009+09:00>
	at junit.framework.Assert.fail(Assert.java:47)
	at junit.framework.Assert.failNotEquals(Assert.java:280)
	at junit.framework.Assert.assertEquals(Assert.java:64)
	at junit.framework.Assert.assertEquals(Assert.java:71)
	at org.joda.time.TestLocalDateTime_Basics.testToDateTime_Zone(TestLocalDateTime_Basics.java:782)

testGetField_int(org.joda.time.TestLocalDateTime_Basics)  Time elapsed: 0 sec  <<< ERROR!
java.lang.NullPointerException
	at org.joda.time.TestLocalDateTime_Basics.testGetField_int(TestLocalDateTime_Basics.java:187)

testGetFields(org.joda.time.TestLocalDateTime_Basics)  Time elapsed: 0 sec  <<< ERROR!
java.lang.NullPointerException
	at org.joda.time.TestLocalDateTime_Basics.testGetFields(TestLocalDateTime_Basics.java:202)

testPropertyEquals(org.joda.time.TestLocalDateTime_Properties)  Time elapsed: 0.001 sec  <<< FAILURE!
junit.framework.AssertionFailedError: expected:<false> but was:<true>
	at junit.framework.Assert.fail(Assert.java:47)
	at junit.framework.Assert.failNotEquals(Assert.java:280)
	at junit.framework.Assert.assertEquals(Assert.java:64)
	at junit.framework.Assert.assertEquals(Assert.java:146)
	at junit.framework.Assert.assertEquals(Assert.java:152)
	at org.joda.time.TestLocalDateTime_Properties.testPropertyEquals(TestLocalDateTime_Properties.java:518)

testEqualsHashCode(org.joda.time.TestLocalDate_Basics)  Time elapsed: 0.001 sec  <<< ERROR!
java.lang.NullPointerException
	at org.joda.time.TestLocalDate_Basics$MockInstant.getFields(TestLocalDate_Basics.java:275)
	at org.joda.time.MockPartial.size(MockPartial.java:33)
	at org.joda.time.base.AbstractPartial.equals(AbstractPartial.java:262)
	at org.joda.time.LocalDate.equals(LocalDate.java:641)
	at org.joda.time.TestLocalDate_Basics.testEqualsHashCode(TestLocalDate_Basics.java:264)

testEqualsHashCodeAPI(org.joda.time.TestLocalDate_Basics)  Time elapsed: 0 sec  <<< ERROR!
java.lang.NullPointerException
	at org.joda.time.TestLocalDate_Basics.testEqualsHashCodeAPI(TestLocalDate_Basics.java:314)

testToDateTimeAtStartOfDay_Zone(org.joda.time.TestLocalDate_Basics)  Time elapsed: 0 sec  <<< FAILURE!
junit.framework.AssertionFailedError: expected:<2005-06-09T00:00:00.000+01:00> but was:<2005-06-09T00:00:00.000+09:00>
	at junit.framework.Assert.fail(Assert.java:47)
	at junit.framework.Assert.failNotEquals(Assert.java:280)
	at junit.framework.Assert.assertEquals(Assert.java:64)
	at junit.framework.Assert.assertEquals(Assert.java:71)
	at org.joda.time.TestLocalDate_Basics.testToDateTimeAtStartOfDay_Zone(TestLocalDate_Basics.java:686)

testEqualsHashCodeLenient(org.joda.time.TestLocalDate_Basics)  Time elapsed: 0 sec  <<< ERROR!
java.lang.IllegalArgumentException: Must supply a chronology
	at org.joda.time.chrono.LenientChronology.getInstance(LenientChronology.java:46)
	at org.joda.time.TestLocalDate_Basics.testEqualsHashCodeLenient(TestLocalDate_Basics.java:287)

testGetField_int(org.joda.time.TestLocalDate_Basics)  Time elapsed: 0 sec  <<< ERROR!
java.lang.NullPointerException
	at org.joda.time.TestLocalDate_Basics.testGetField_int(TestLocalDate_Basics.java:169)

testGetFields(org.joda.time.TestLocalDate_Basics)  Time elapsed: 0.001 sec  <<< ERROR!
java.lang.NullPointerException
	at org.joda.time.TestLocalDate_Basics.testGetFields(TestLocalDate_Basics.java:183)

testToDateTimeAtMidnight_Zone(org.joda.time.TestLocalDate_Basics)  Time elapsed: 0.001 sec  <<< FAILURE!
junit.framework.AssertionFailedError: expected:<2005-06-09T00:00:00.000+01:00> but was:<2005-06-09T00:00:00.000+09:00>
	at junit.framework.Assert.fail(Assert.java:47)
	at junit.framework.Assert.failNotEquals(Assert.java:280)
	at junit.framework.Assert.assertEquals(Assert.java:64)
	at junit.framework.Assert.assertEquals(Assert.java:71)
	at org.joda.time.TestLocalDate_Basics.testToDateTimeAtMidnight_Zone(TestLocalDate_Basics.java:722)

testToDateTimeAtCurrentTime_Zone(org.joda.time.TestLocalDate_Basics)  Time elapsed: 0.001 sec  <<< FAILURE!
junit.framework.AssertionFailedError: expected:<2005-06-09T06:07:08.009+01:00> but was:<2005-06-09T14:07:08.009+09:00>
	at junit.framework.Assert.fail(Assert.java:47)
	at junit.framework.Assert.failNotEquals(Assert.java:280)
	at junit.framework.Assert.assertEquals(Assert.java:64)
	at junit.framework.Assert.assertEquals(Assert.java:71)
	at org.joda.time.TestLocalDate_Basics.testToDateTimeAtCurrentTime_Zone(TestLocalDate_Basics.java:761)

testToDateTime_LocalTime_Zone(org.joda.time.TestLocalDate_Basics)  Time elapsed: 0 sec  <<< FAILURE!
junit.framework.AssertionFailedError: expected:<2005-06-09T12:13:14.015+01:00> but was:<2005-06-09T12:13:14.015+09:00>
	at junit.framework.Assert.fail(Assert.java:47)
	at junit.framework.Assert.failNotEquals(Assert.java:280)
	at junit.framework.Assert.assertEquals(Assert.java:64)
	at junit.framework.Assert.assertEquals(Assert.java:71)
	at org.joda.time.TestLocalDate_Basics.testToDateTime_LocalTime_Zone(TestLocalDate_Basics.java:842)

testToDateTime_nullLocalTime_Zone(org.joda.time.TestLocalDate_Basics)  Time elapsed: 0 sec  <<< FAILURE!
junit.framework.AssertionFailedError: expected:<2005-06-09T12:13:14.015+01:00> but was:<2005-06-09T20:13:14.015+09:00>
	at junit.framework.Assert.fail(Assert.java:47)
	at junit.framework.Assert.failNotEquals(Assert.java:280)
	at junit.framework.Assert.assertEquals(Assert.java:64)
	at junit.framework.Assert.assertEquals(Assert.java:71)
	at org.joda.time.TestLocalDate_Basics.testToDateTime_nullLocalTime_Zone(TestLocalDate_Basics.java:863)

testToDateMidnight_Zone(org.joda.time.TestLocalDate_Basics)  Time elapsed: 0 sec  <<< FAILURE!
junit.framework.AssertionFailedError: expected:<2005-06-09T00:00:00.000+01:00> but was:<2005-06-09T00:00:00.000+09:00>
	at junit.framework.Assert.fail(Assert.java:47)
	at junit.framework.Assert.failNotEquals(Assert.java:280)
	at junit.framework.Assert.assertEquals(Assert.java:64)
	at junit.framework.Assert.assertEquals(Assert.java:71)
	at org.joda.time.TestLocalDate_Basics.testToDateMidnight_Zone(TestLocalDate_Basics.java:918)

testEqualsHashCodeStrict(org.joda.time.TestLocalDate_Basics)  Time elapsed: 0 sec  <<< ERROR!
java.lang.IllegalArgumentException: Must supply a chronology
	at org.joda.time.chrono.StrictChronology.getInstance(StrictChronology.java:46)
	at org.joda.time.TestLocalDate_Basics.testEqualsHashCodeStrict(TestLocalDate_Basics.java:299)

testPropertyEqualsHashCodeLenient(org.joda.time.TestLocalDate_Properties)  Time elapsed: 0 sec  <<< ERROR!
java.lang.IllegalArgumentException: Must supply a chronology
	at org.joda.time.chrono.LenientChronology.getInstance(LenientChronology.java:46)
	at org.joda.time.TestLocalDate_Properties.testPropertyEqualsHashCodeLenient(TestLocalDate_Properties.java:526)

testPropertyEqualsHashCodeStrict(org.joda.time.TestLocalDate_Properties)  Time elapsed: 0 sec  <<< ERROR!
java.lang.IllegalArgumentException: Must supply a chronology
	at org.joda.time.chrono.StrictChronology.getInstance(StrictChronology.java:46)
	at org.joda.time.TestLocalDate_Properties.testPropertyEqualsHashCodeStrict(TestLocalDate_Properties.java:538)

testPropertyEquals(org.joda.time.TestLocalDate_Properties)  Time elapsed: 0 sec  <<< FAILURE!
junit.framework.AssertionFailedError: expected:<false> but was:<true>
	at junit.framework.Assert.fail(Assert.java:47)
	at junit.framework.Assert.failNotEquals(Assert.java:280)
	at junit.framework.Assert.assertEquals(Assert.java:64)
	at junit.framework.Assert.assertEquals(Assert.java:146)
	at junit.framework.Assert.assertEquals(Assert.java:152)
	at org.joda.time.TestLocalDate_Properties.testPropertyEquals(TestLocalDate_Properties.java:513)

testEqualsHashCode(org.joda.time.TestLocalTime_Basics)  Time elapsed: 0.001 sec  <<< ERROR!
java.lang.NullPointerException
	at org.joda.time.TestLocalTime_Basics$MockInstant.getFields(TestLocalTime_Basics.java:300)
	at org.joda.time.MockPartial.size(MockPartial.java:33)
	at org.joda.time.base.AbstractPartial.equals(AbstractPartial.java:262)
	at org.joda.time.LocalTime.equals(LocalTime.java:691)
	at org.joda.time.TestLocalTime_Basics.testEqualsHashCode(TestLocalTime_Basics.java:291)

testToDateTimeToday_Zone(org.joda.time.TestLocalTime_Basics)  Time elapsed: 0 sec  <<< FAILURE!
junit.framework.AssertionFailedError: expected:<2004-06-09T10:20:30.040+01:00> but was:<2004-06-09T10:20:30.040+09:00>
	at junit.framework.Assert.fail(Assert.java:47)
	at junit.framework.Assert.failNotEquals(Assert.java:280)
	at junit.framework.Assert.assertEquals(Assert.java:64)
	at junit.framework.Assert.assertEquals(Assert.java:71)
	at org.joda.time.TestLocalTime_Basics.testToDateTimeToday_Zone(TestLocalTime_Basics.java:696)

testGetField_int(org.joda.time.TestLocalTime_Basics)  Time elapsed: 0 sec  <<< ERROR!
java.lang.NullPointerException
	at org.joda.time.TestLocalTime_Basics.testGetField_int(TestLocalTime_Basics.java:163)

testGetFields(org.joda.time.TestLocalTime_Basics)  Time elapsed: 0.001 sec  <<< ERROR!
java.lang.NullPointerException
	at org.joda.time.TestLocalTime_Basics.testGetFields(TestLocalTime_Basics.java:178)

testEqualsHashCode(org.joda.time.TestTimeOfDay_Basics)  Time elapsed: 0 sec  <<< ERROR!
java.lang.NullPointerException
	at org.joda.time.TestTimeOfDay_Basics$MockInstant.getFields(TestTimeOfDay_Basics.java:226)
	at org.joda.time.MockPartial.size(MockPartial.java:33)
	at org.joda.time.base.AbstractPartial.equals(AbstractPartial.java:262)
	at org.joda.time.TestTimeOfDay_Basics.testEqualsHashCode(TestTimeOfDay_Basics.java:217)

testToDateTimeToday_Zone(org.joda.time.TestTimeOfDay_Basics)  Time elapsed: 0 sec  <<< FAILURE!
junit.framework.AssertionFailedError: expected:<2004-06-09T10:20:30.040+01:00> but was:<2004-06-09T10:20:30.040+09:00>
	at junit.framework.Assert.fail(Assert.java:47)
	at junit.framework.Assert.failNotEquals(Assert.java:280)
	at junit.framework.Assert.assertEquals(Assert.java:64)
	at junit.framework.Assert.assertEquals(Assert.java:71)
	at org.joda.time.TestTimeOfDay_Basics.testToDateTimeToday_Zone(TestTimeOfDay_Basics.java:624)

testGetFields(org.joda.time.TestTimeOfDay_Basics)  Time elapsed: 0 sec  <<< ERROR!
java.lang.NullPointerException
	at org.joda.time.TestTimeOfDay_Basics.testGetFields(TestTimeOfDay_Basics.java:157)

testGetField(org.joda.time.TestTimeOfDay_Basics)  Time elapsed: 0 sec  <<< ERROR!
java.lang.NullPointerException
	at org.joda.time.TestTimeOfDay_Basics.testGetField(TestTimeOfDay_Basics.java:142)

testWithChronologyRetainFields_Chrono(org.joda.time.TestTimeOfDay_Basics)  Time elapsed: 0 sec  <<< FAILURE!
junit.framework.AssertionFailedError: expected:<null> but was:<ISOChronology[UTC]>
	at junit.framework.Assert.fail(Assert.java:47)
	at junit.framework.Assert.failNotEquals(Assert.java:280)
	at junit.framework.Assert.assertEquals(Assert.java:64)
	at junit.framework.Assert.assertEquals(Assert.java:71)
	at org.joda.time.TestTimeOfDay_Basics.testWithChronologyRetainFields_Chrono(TestTimeOfDay_Basics.java:352)

testWithChronologyRetainFields_nullChrono(org.joda.time.TestTimeOfDay_Basics)  Time elapsed: 0 sec  <<< FAILURE!
junit.framework.AssertionFailedError: expected:<null> but was:<ISOChronology[UTC]>
	at junit.framework.Assert.fail(Assert.java:47)
	at junit.framework.Assert.failNotEquals(Assert.java:280)
	at junit.framework.Assert.assertEquals(Assert.java:64)
	at junit.framework.Assert.assertEquals(Assert.java:71)
	at org.joda.time.TestTimeOfDay_Basics.testWithChronologyRetainFields_nullChrono(TestTimeOfDay_Basics.java:367)

testConstructor_todObject(org.joda.time.TestTimeOfDay_Constructors)  Time elapsed: 0 sec  <<< FAILURE!
junit.framework.AssertionFailedError: expected:<null> but was:<ISOChronology[UTC]>
	at junit.framework.Assert.fail(Assert.java:47)
	at junit.framework.Assert.failNotEquals(Assert.java:280)
	at junit.framework.Assert.assertEquals(Assert.java:64)
	at junit.framework.Assert.assertEquals(Assert.java:71)
	at org.joda.time.TestTimeOfDay_Constructors.testConstructor_todObject(TestTimeOfDay_Constructors.java:357)

testEqualsHashCode(org.joda.time.TestYearMonthDay_Basics)  Time elapsed: 0.001 sec  <<< ERROR!
java.lang.NullPointerException
	at org.joda.time.TestYearMonthDay_Basics$MockInstant.getFields(TestYearMonthDay_Basics.java:207)
	at org.joda.time.MockPartial.size(MockPartial.java:33)
	at org.joda.time.base.AbstractPartial.equals(AbstractPartial.java:262)
	at org.joda.time.TestYearMonthDay_Basics.testEqualsHashCode(TestYearMonthDay_Basics.java:198)

testGetFields(org.joda.time.TestYearMonthDay_Basics)  Time elapsed: 0.001 sec  <<< ERROR!
java.lang.NullPointerException
	at org.joda.time.TestYearMonthDay_Basics.testGetFields(TestYearMonthDay_Basics.java:142)

testToDateTimeAtMidnight_Zone(org.joda.time.TestYearMonthDay_Basics)  Time elapsed: 0.001 sec  <<< FAILURE!
junit.framework.AssertionFailedError: expected:<2005-06-09T00:00:00.000+01:00> but was:<2005-06-09T00:00:00.000+09:00>
	at junit.framework.Assert.fail(Assert.java:47)
	at junit.framework.Assert.failNotEquals(Assert.java:280)
	at junit.framework.Assert.assertEquals(Assert.java:64)
	at junit.framework.Assert.assertEquals(Assert.java:71)
	at org.joda.time.TestYearMonthDay_Basics.testToDateTimeAtMidnight_Zone(TestYearMonthDay_Basics.java:548)

testToDateTimeAtCurrentTime_Zone(org.joda.time.TestYearMonthDay_Basics)  Time elapsed: 0.001 sec  <<< FAILURE!
junit.framework.AssertionFailedError: expected:<2005-06-09T06:07:08.009+01:00> but was:<2005-06-09T14:07:08.009+09:00>
	at junit.framework.Assert.fail(Assert.java:47)
	at junit.framework.Assert.failNotEquals(Assert.java:280)
	at junit.framework.Assert.assertEquals(Assert.java:64)
	at junit.framework.Assert.assertEquals(Assert.java:71)
	at org.joda.time.TestYearMonthDay_Basics.testToDateTimeAtCurrentTime_Zone(TestYearMonthDay_Basics.java:586)

testToDateMidnight_Zone(org.joda.time.TestYearMonthDay_Basics)  Time elapsed: 0.001 sec  <<< FAILURE!
junit.framework.AssertionFailedError: expected:<2005-06-09T00:00:00.000+01:00> but was:<2005-06-09T00:00:00.000+09:00>
	at junit.framework.Assert.fail(Assert.java:47)
	at junit.framework.Assert.failNotEquals(Assert.java:280)
	at junit.framework.Assert.assertEquals(Assert.java:64)
	at junit.framework.Assert.assertEquals(Assert.java:71)
	at org.joda.time.TestYearMonthDay_Basics.testToDateMidnight_Zone(TestYearMonthDay_Basics.java:672)

testWithChronologyRetainFields_invalidInNewChrono(org.joda.time.TestYearMonthDay_Basics)  Time elapsed: 0 sec  <<< FAILURE!
junit.framework.AssertionFailedError
	at junit.framework.Assert.fail(Assert.java:47)
	at junit.framework.Assert.fail(Assert.java:53)
	at org.joda.time.TestYearMonthDay_Basics.testWithChronologyRetainFields_invalidInNewChrono(TestYearMonthDay_Basics.java:367)

testToDateTime_TOD_Zone(org.joda.time.TestYearMonthDay_Basics)  Time elapsed: 0 sec  <<< FAILURE!
junit.framework.AssertionFailedError: expected:<2005-06-09T12:13:14.015+01:00> but was:<2005-06-09T12:13:14.015+09:00>
	at junit.framework.Assert.fail(Assert.java:47)
	at junit.framework.Assert.failNotEquals(Assert.java:280)
	at junit.framework.Assert.assertEquals(Assert.java:64)
	at junit.framework.Assert.assertEquals(Assert.java:71)
	at org.joda.time.TestYearMonthDay_Basics.testToDateTime_TOD_Zone(TestYearMonthDay_Basics.java:633)

testToDateTime_nullTOD_Zone(org.joda.time.TestYearMonthDay_Basics)  Time elapsed: 0 sec  <<< FAILURE!
junit.framework.AssertionFailedError: expected:<2005-06-09T12:13:14.015+01:00> but was:<2005-06-09T20:13:14.015+09:00>
	at junit.framework.Assert.fail(Assert.java:47)
	at junit.framework.Assert.failNotEquals(Assert.java:280)
	at junit.framework.Assert.assertEquals(Assert.java:64)
	at junit.framework.Assert.assertEquals(Assert.java:71)
	at org.joda.time.TestYearMonthDay_Basics.testToDateTime_nullTOD_Zone(TestYearMonthDay_Basics.java:654)

testGetField(org.joda.time.TestYearMonthDay_Basics)  Time elapsed: 0.001 sec  <<< ERROR!
java.lang.NullPointerException
	at org.joda.time.TestYearMonthDay_Basics.testGetField(TestYearMonthDay_Basics.java:128)

testWithChronologyRetainFields_Chrono(org.joda.time.TestYearMonthDay_Basics)  Time elapsed: 0 sec  <<< FAILURE!
junit.framework.AssertionFailedError: expected:<null> but was:<ISOChronology[UTC]>
	at junit.framework.Assert.fail(Assert.java:47)
	at junit.framework.Assert.failNotEquals(Assert.java:280)
	at junit.framework.Assert.assertEquals(Assert.java:64)
	at junit.framework.Assert.assertEquals(Assert.java:71)
	at org.joda.time.TestYearMonthDay_Basics.testWithChronologyRetainFields_Chrono(TestYearMonthDay_Basics.java:343)

testWithChronologyRetainFields_nullChrono(org.joda.time.TestYearMonthDay_Basics)  Time elapsed: 0.001 sec  <<< FAILURE!
junit.framework.AssertionFailedError: expected:<null> but was:<ISOChronology[UTC]>
	at junit.framework.Assert.fail(Assert.java:47)
	at junit.framework.Assert.failNotEquals(Assert.java:280)
	at junit.framework.Assert.assertEquals(Assert.java:64)
	at junit.framework.Assert.assertEquals(Assert.java:71)
	at org.joda.time.TestYearMonthDay_Basics.testWithChronologyRetainFields_nullChrono(TestYearMonthDay_Basics.java:358)

testPropertyEqualsHashCodeLenient(org.joda.time.TestYearMonthDay_Properties)  Time elapsed: 0 sec  <<< ERROR!
java.lang.IllegalArgumentException: Must supply a chronology
	at org.joda.time.chrono.LenientChronology.getInstance(LenientChronology.java:46)
	at org.joda.time.TestYearMonthDay_Properties.testPropertyEqualsHashCodeLenient(TestYearMonthDay_Properties.java:530)

testPropertyEqualsHashCodeStrict(org.joda.time.TestYearMonthDay_Properties)  Time elapsed: 0 sec  <<< ERROR!
java.lang.IllegalArgumentException: Must supply a chronology
	at org.joda.time.chrono.StrictChronology.getInstance(StrictChronology.java:46)
	at org.joda.time.TestYearMonthDay_Properties.testPropertyEqualsHashCodeStrict(TestYearMonthDay_Properties.java:542)

testPropertyEquals(org.joda.time.TestYearMonthDay_Properties)  Time elapsed: 0 sec  <<< FAILURE!
junit.framework.AssertionFailedError: expected:<false> but was:<true>
	at junit.framework.Assert.fail(Assert.java:47)
	at junit.framework.Assert.failNotEquals(Assert.java:280)
	at junit.framework.Assert.assertEquals(Assert.java:64)
	at junit.framework.Assert.assertEquals(Assert.java:146)
	at junit.framework.Assert.assertEquals(Assert.java:152)
	at org.joda.time.TestYearMonthDay_Properties.testPropertyEquals(TestYearMonthDay_Properties.java:517)

testEqualsHashCode(org.joda.time.TestYearMonth_Basics)  Time elapsed: 0.001 sec  <<< ERROR!
java.lang.NullPointerException
	at org.joda.time.TestYearMonth_Basics$MockYM.getFields(TestYearMonth_Basics.java:207)
	at org.joda.time.MockPartial.size(MockPartial.java:33)
	at org.joda.time.base.AbstractPartial.equals(AbstractPartial.java:262)
	at org.joda.time.TestYearMonth_Basics.testEqualsHashCode(TestYearMonth_Basics.java:198)

testGetFields(org.joda.time.TestYearMonth_Basics)  Time elapsed: 0.001 sec  <<< ERROR!
java.lang.NullPointerException
	at org.joda.time.TestYearMonth_Basics.testGetFields(TestYearMonth_Basics.java:144)

testToInterval_Zone(org.joda.time.TestYearMonth_Basics)  Time elapsed: 0.001 sec  <<< FAILURE!
junit.framework.AssertionFailedError: expected:<2005-06-01T00:00:00.000+01:00/2005-07-01T00:00:00.000+01:00> but was:<2005-06-01T00:00:00.000+09:00/2005-07-01T00:00:00.000+09:00>
	at junit.framework.Assert.fail(Assert.java:47)
	at junit.framework.Assert.failNotEquals(Assert.java:280)
	at junit.framework.Assert.assertEquals(Assert.java:64)
	at junit.framework.Assert.assertEquals(Assert.java:71)
	at org.joda.time.TestYearMonth_Basics.testToInterval_Zone(TestYearMonth_Basics.java:556)

testWithChronologyRetainFields_invalidInNewChrono(org.joda.time.TestYearMonth_Basics)  Time elapsed: 0 sec  <<< ERROR!
org.joda.time.IllegalFieldValueException: Value 13 for monthOfYear must not be larger than 12
	at org.joda.time.chrono.BaseChronology.validate(BaseChronology.java:193)
	at org.joda.time.base.BasePartial.<init>(BasePartial.java:183)
	at org.joda.time.YearMonth.<init>(YearMonth.java:344)
	at org.joda.time.TestYearMonth_Basics.testWithChronologyRetainFields_invalidInNewChrono(TestYearMonth_Basics.java:358)

testGetField(org.joda.time.TestYearMonth_Basics)  Time elapsed: 0 sec  <<< ERROR!
java.lang.NullPointerException
	at org.joda.time.TestYearMonth_Basics.testGetField(TestYearMonth_Basics.java:130)

testWithChronologyRetainFields_Chrono(org.joda.time.TestYearMonth_Basics)  Time elapsed: 0 sec  <<< FAILURE!
junit.framework.AssertionFailedError: expected:<null> but was:<ISOChronology[UTC]>
	at junit.framework.Assert.fail(Assert.java:47)
	at junit.framework.Assert.failNotEquals(Assert.java:280)
	at junit.framework.Assert.assertEquals(Assert.java:64)
	at junit.framework.Assert.assertEquals(Assert.java:71)
	at org.joda.time.TestYearMonth_Basics.testWithChronologyRetainFields_Chrono(TestYearMonth_Basics.java:337)

testWithChronologyRetainFields_nullChrono(org.joda.time.TestYearMonth_Basics)  Time elapsed: 0.001 sec  <<< FAILURE!
junit.framework.AssertionFailedError: expected:<null> but was:<ISOChronology[UTC]>
	at junit.framework.Assert.fail(Assert.java:47)
	at junit.framework.Assert.failNotEquals(Assert.java:280)
	at junit.framework.Assert.assertEquals(Assert.java:64)
	at junit.framework.Assert.assertEquals(Assert.java:71)
	at org.joda.time.TestYearMonth_Basics.testWithChronologyRetainFields_nullChrono(TestYearMonth_Basics.java:352)

testPropertyEqualsHashCodeLenient(org.joda.time.TestYearMonth_Properties)  Time elapsed: 0 sec  <<< ERROR!
java.lang.IllegalArgumentException: Must supply a chronology
	at org.joda.time.chrono.LenientChronology.getInstance(LenientChronology.java:46)
	at org.joda.time.TestYearMonth_Properties.testPropertyEqualsHashCodeLenient(TestYearMonth_Properties.java:338)

testPropertyEqualsHashCodeStrict(org.joda.time.TestYearMonth_Properties)  Time elapsed: 0.001 sec  <<< ERROR!
java.lang.IllegalArgumentException: Must supply a chronology
	at org.joda.time.chrono.StrictChronology.getInstance(StrictChronology.java:46)
	at org.joda.time.TestYearMonth_Properties.testPropertyEqualsHashCodeStrict(TestYearMonth_Properties.java:350)

testPropertyEquals(org.joda.time.TestYearMonth_Properties)  Time elapsed: 0.001 sec  <<< FAILURE!
junit.framework.AssertionFailedError: expected:<false> but was:<true>
	at junit.framework.Assert.fail(Assert.java:47)
	at junit.framework.Assert.failNotEquals(Assert.java:280)
	at junit.framework.Assert.assertEquals(Assert.java:64)
	at junit.framework.Assert.assertEquals(Assert.java:146)
	at junit.framework.Assert.assertEquals(Assert.java:152)
	at org.joda.time.TestYearMonth_Properties.testPropertyEquals(TestYearMonth_Properties.java:325)

testToLocalDate(org.joda.time.TestMonthDay_Basics)  Time elapsed: 0.001 sec  <<< FAILURE!
junit.framework.AssertionFailedError
	at junit.framework.Assert.fail(Assert.java:47)
	at junit.framework.Assert.fail(Assert.java:53)
	at org.joda.time.TestMonthDay_Basics.testToLocalDate(TestMonthDay_Basics.java:705)

testEqualsHashCode(org.joda.time.TestMonthDay_Basics)  Time elapsed: 0.001 sec  <<< FAILURE!
junit.framework.AssertionFailedError: expected:<false> but was:<true>
	at junit.framework.Assert.fail(Assert.java:47)
	at junit.framework.Assert.failNotEquals(Assert.java:280)
	at junit.framework.Assert.assertEquals(Assert.java:64)
	at junit.framework.Assert.assertEquals(Assert.java:146)
	at junit.framework.Assert.assertEquals(Assert.java:152)
	at org.joda.time.TestMonthDay_Basics.testEqualsHashCode(TestMonthDay_Basics.java:189)

testGetFields(org.joda.time.TestMonthDay_Basics)  Time elapsed: 0 sec  <<< ERROR!
java.lang.NullPointerException
	at org.joda.time.TestMonthDay_Basics.testGetFields(TestMonthDay_Basics.java:143)

testGetField(org.joda.time.TestMonthDay_Basics)  Time elapsed: 0.001 sec  <<< ERROR!
java.lang.NullPointerException
	at org.joda.time.TestMonthDay_Basics.testGetField(TestMonthDay_Basics.java:129)

testWithChronologyRetainFields_Chrono(org.joda.time.TestMonthDay_Basics)  Time elapsed: 0 sec  <<< FAILURE!
junit.framework.AssertionFailedError: expected:<null> but was:<ISOChronology[UTC]>
	at junit.framework.Assert.fail(Assert.java:47)
	at junit.framework.Assert.failNotEquals(Assert.java:280)
	at junit.framework.Assert.assertEquals(Assert.java:64)
	at junit.framework.Assert.assertEquals(Assert.java:71)
	at org.joda.time.TestMonthDay_Basics.testWithChronologyRetainFields_Chrono(TestMonthDay_Basics.java:342)

testWithChronologyRetainFields_nullChrono(org.joda.time.TestMonthDay_Basics)  Time elapsed: 0.001 sec  <<< FAILURE!
junit.framework.AssertionFailedError: expected:<null> but was:<ISOChronology[UTC]>
	at junit.framework.Assert.fail(Assert.java:47)
	at junit.framework.Assert.failNotEquals(Assert.java:280)
	at junit.framework.Assert.assertEquals(Assert.java:64)
	at junit.framework.Assert.assertEquals(Assert.java:71)
	at org.joda.time.TestMonthDay_Basics.testWithChronologyRetainFields_nullChrono(TestMonthDay_Basics.java:357)

testPropertyEqualsHashCodeLenient(org.joda.time.TestMonthDay_Properties)  Time elapsed: 0 sec  <<< ERROR!
java.lang.IllegalArgumentException: Must supply a chronology
	at org.joda.time.chrono.LenientChronology.getInstance(LenientChronology.java:46)
	at org.joda.time.TestMonthDay_Properties.testPropertyEqualsHashCodeLenient(TestMonthDay_Properties.java:320)

testPropertyEqualsHashCodeStrict(org.joda.time.TestMonthDay_Properties)  Time elapsed: 0 sec  <<< ERROR!
java.lang.IllegalArgumentException: Must supply a chronology
	at org.joda.time.chrono.StrictChronology.getInstance(StrictChronology.java:46)
	at org.joda.time.TestMonthDay_Properties.testPropertyEqualsHashCodeStrict(TestMonthDay_Properties.java:332)

testPropertyEquals(org.joda.time.TestMonthDay_Properties)  Time elapsed: 0 sec  <<< FAILURE!
junit.framework.AssertionFailedError: expected:<false> but was:<true>
	at junit.framework.Assert.fail(Assert.java:47)
	at junit.framework.Assert.failNotEquals(Assert.java:280)
	at junit.framework.Assert.assertEquals(Assert.java:64)
	at junit.framework.Assert.assertEquals(Assert.java:146)
	at junit.framework.Assert.assertEquals(Assert.java:152)
	at org.joda.time.TestMonthDay_Properties.testPropertyEquals(TestMonthDay_Properties.java:307)

testGetFields(org.joda.time.TestPartial_Basics)  Time elapsed: 0 sec  <<< ERROR!
java.lang.NullPointerException
	at org.joda.time.TestPartial_Basics.testGetFields(TestPartial_Basics.java:147)

testGetField(org.joda.time.TestPartial_Basics)  Time elapsed: 0 sec  <<< ERROR!
java.lang.NullPointerException
	at org.joda.time.TestPartial_Basics.testGetField(TestPartial_Basics.java:133)

testWithChronologyRetainFields_Chrono(org.joda.time.TestPartial_Basics)  Time elapsed: 0.001 sec  <<< FAILURE!
junit.framework.AssertionFailedError: expected:<null> but was:<ISOChronology[UTC]>
	at junit.framework.Assert.fail(Assert.java:47)
	at junit.framework.Assert.failNotEquals(Assert.java:280)
	at junit.framework.Assert.assertEquals(Assert.java:64)
	at junit.framework.Assert.assertEquals(Assert.java:71)
	at org.joda.time.TestPartial_Basics.testWithChronologyRetainFields_Chrono(TestPartial_Basics.java:323)

testWithChronologyRetainFields_nullChrono(org.joda.time.TestPartial_Basics)  Time elapsed: 0 sec  <<< FAILURE!
junit.framework.AssertionFailedError: expected:<null> but was:<ISOChronology[UTC]>
	at junit.framework.Assert.fail(Assert.java:47)
	at junit.framework.Assert.failNotEquals(Assert.java:280)
	at junit.framework.Assert.assertEquals(Assert.java:64)
	at junit.framework.Assert.assertEquals(Assert.java:71)
	at org.joda.time.TestPartial_Basics.testWithChronologyRetainFields_nullChrono(TestPartial_Basics.java:338)

testGetIntervalChronology_RI_RI(org.joda.time.TestDateTimeUtils)  Time elapsed: 0 sec  <<< FAILURE!
junit.framework.AssertionFailedError: expected:<null> but was:<ISOChronology[Europe/London]>
	at junit.framework.Assert.fail(Assert.java:47)
	at junit.framework.Assert.failNotEquals(Assert.java:280)
	at junit.framework.Assert.assertEquals(Assert.java:64)
	at junit.framework.Assert.assertEquals(Assert.java:71)
	at org.joda.time.TestDateTimeUtils.testGetIntervalChronology_RI_RI(TestDateTimeUtils.java:385)

testToString(org.joda.time.chrono.TestCopticChronology)  Time elapsed: 0.001 sec  <<< ERROR!
java.lang.NullPointerException
	at org.joda.time.chrono.TestCopticChronology.testToString(TestCopticChronology.java:141)

testFactory(org.joda.time.chrono.TestCopticChronology)  Time elapsed: 0 sec  <<< ERROR!
java.lang.NullPointerException
	at org.joda.time.chrono.TestCopticChronology.testFactory(TestCopticChronology.java:104)

testSampleDate(org.joda.time.chrono.TestCopticChronology)  Time elapsed: 0.001 sec  <<< FAILURE!
junit.framework.AssertionFailedError: expected:<18> but was:<20>
	at junit.framework.Assert.fail(Assert.java:47)
	at junit.framework.Assert.failNotEquals(Assert.java:280)
	at junit.framework.Assert.assertEquals(Assert.java:64)
	at junit.framework.Assert.assertEquals(Assert.java:198)
	at junit.framework.Assert.assertEquals(Assert.java:204)
	at org.joda.time.chrono.TestCopticChronology.testSampleDate(TestCopticChronology.java:403)

testSampleDateWithZone(org.joda.time.chrono.TestCopticChronology)  Time elapsed: 0 sec  <<< FAILURE!
junit.framework.AssertionFailedError: expected:<1720> but was:<2004>
	at junit.framework.Assert.fail(Assert.java:47)
	at junit.framework.Assert.failNotEquals(Assert.java:280)
	at junit.framework.Assert.assertEquals(Assert.java:64)
	at junit.framework.Assert.assertEquals(Assert.java:198)
	at junit.framework.Assert.assertEquals(Assert.java:204)
	at org.joda.time.chrono.TestCopticChronology.testSampleDateWithZone(TestCopticChronology.java:468)

testDurationYear(org.joda.time.chrono.TestCopticChronology)  Time elapsed: 0 sec  <<< ERROR!
java.lang.NullPointerException
	at org.joda.time.chrono.TestCopticChronology.testDurationYear(TestCopticChronology.java:487)

testDurationMonth(org.joda.time.chrono.TestCopticChronology)  Time elapsed: 0.001 sec  <<< ERROR!
org.joda.time.IllegalFieldValueException: Value 13 for monthOfYear must be in the range [1,12]
	at org.joda.time.field.FieldUtils.verifyValueBounds(FieldUtils.java:252)
	at org.joda.time.chrono.BasicChronology.getDateMidnightMillis(BasicChronology.java:612)
	at org.joda.time.chrono.BasicChronology.getDateTimeMillis(BasicChronology.java:177)
	at org.joda.time.chrono.GregorianChronology.getDateTimeMillis(GregorianChronology.java:44)
	at org.joda.time.chrono.AssembledChronology.getDateTimeMillis(AssembledChronology.java:133)
	at org.joda.time.chrono.ZonedChronology.getDateTimeMillis(ZonedChronology.java:118)
	at org.joda.time.chrono.AssembledChronology.getDateTimeMillis(AssembledChronology.java:133)
	at org.joda.time.base.BaseDateTime.<init>(BaseDateTime.java:258)
	at org.joda.time.DateTime.<init>(DateTime.java:532)
	at org.joda.time.chrono.TestCopticChronology.testDurationMonth(TestCopticChronology.java:534)

testLeap_5_13(org.joda.time.chrono.TestCopticChronology)  Time elapsed: 0 sec  <<< ERROR!
org.joda.time.IllegalFieldValueException: Value 13 for monthOfYear must be in the range [1,12]
	at org.joda.time.field.FieldUtils.verifyValueBounds(FieldUtils.java:252)
	at org.joda.time.chrono.BasicChronology.getDateMidnightMillis(BasicChronology.java:612)
	at org.joda.time.chrono.BasicChronology.getDateTimeMillis(BasicChronology.java:177)
	at org.joda.time.chrono.GregorianChronology.getDateTimeMillis(GregorianChronology.java:44)
	at org.joda.time.chrono.AssembledChronology.getDateTimeMillis(AssembledChronology.java:133)
	at org.joda.time.chrono.ZonedChronology.getDateTimeMillis(ZonedChronology.java:118)
	at org.joda.time.chrono.AssembledChronology.getDateTimeMillis(AssembledChronology.java:133)
	at org.joda.time.base.BaseDateTime.<init>(BaseDateTime.java:258)
	at org.joda.time.DateTime.<init>(DateTime.java:373)
	at org.joda.time.chrono.TestCopticChronology.testLeap_5_13(TestCopticChronology.java:581)

testLeap_6_13(org.joda.time.chrono.TestCopticChronology)  Time elapsed: 0.001 sec  <<< ERROR!
org.joda.time.IllegalFieldValueException: Value 13 for monthOfYear must be in the range [1,12]
	at org.joda.time.field.FieldUtils.verifyValueBounds(FieldUtils.java:252)
	at org.joda.time.chrono.BasicChronology.getDateMidnightMillis(BasicChronology.java:612)
	at org.joda.time.chrono.BasicChronology.getDateTimeMillis(BasicChronology.java:177)
	at org.joda.time.chrono.GregorianChronology.getDateTimeMillis(GregorianChronology.java:44)
	at org.joda.time.chrono.AssembledChronology.getDateTimeMillis(AssembledChronology.java:133)
	at org.joda.time.chrono.ZonedChronology.getDateTimeMillis(ZonedChronology.java:118)
	at org.joda.time.chrono.AssembledChronology.getDateTimeMillis(AssembledChronology.java:133)
	at org.joda.time.base.BaseDateTime.<init>(BaseDateTime.java:258)
	at org.joda.time.DateTime.<init>(DateTime.java:373)
	at org.joda.time.chrono.TestCopticChronology.testLeap_6_13(TestCopticChronology.java:590)

testFactoryUTC(org.joda.time.chrono.TestCopticChronology)  Time elapsed: 0 sec  <<< ERROR!
java.lang.NullPointerException
	at org.joda.time.chrono.TestCopticChronology.testFactoryUTC(TestCopticChronology.java:99)

testFactory_Zone(org.joda.time.chrono.TestCopticChronology)  Time elapsed: 0 sec  <<< ERROR!
java.lang.NullPointerException
	at org.joda.time.chrono.TestCopticChronology.testFactory_Zone(TestCopticChronology.java:109)

testWithUTC(org.joda.time.chrono.TestCopticChronology)  Time elapsed: 0 sec  <<< ERROR!
java.lang.NullPointerException
	at org.joda.time.chrono.TestCopticChronology.testWithUTC(TestCopticChronology.java:125)

testWithZone(org.joda.time.chrono.TestCopticChronology)  Time elapsed: 0 sec  <<< ERROR!
java.lang.NullPointerException
	at org.joda.time.chrono.TestCopticChronology.testWithZone(TestCopticChronology.java:132)

testDurationFields(org.joda.time.chrono.TestCopticChronology)  Time elapsed: 0.001 sec  <<< ERROR!
java.lang.NullPointerException
	at org.joda.time.chrono.TestCopticChronology.testDurationFields(TestCopticChronology.java:150)

testDateFields(org.joda.time.chrono.TestCopticChronology)  Time elapsed: 0 sec  <<< ERROR!
java.lang.NullPointerException
	at org.joda.time.chrono.TestCopticChronology.testDateFields(TestCopticChronology.java:218)

testTimeFields(org.joda.time.chrono.TestCopticChronology)  Time elapsed: 0.001 sec  <<< ERROR!
java.lang.NullPointerException
	at org.joda.time.chrono.TestCopticChronology.testTimeFields(TestCopticChronology.java:273)

testEpoch(org.joda.time.chrono.TestCopticChronology)  Time elapsed: 0 sec  <<< FAILURE!
junit.framework.AssertionFailedError: expected:<0284-08-29T00:00:00.000Z> but was:<0001-01-03T00:01:15.000Z>
	at junit.framework.Assert.fail(Assert.java:47)
	at junit.framework.Assert.failNotEquals(Assert.java:280)
	at junit.framework.Assert.assertEquals(Assert.java:64)
	at junit.framework.Assert.assertEquals(Assert.java:71)
	at org.joda.time.chrono.TestCopticChronology.testEpoch(TestCopticChronology.java:301)

testCalendar(org.joda.time.chrono.TestCopticChronology)  Time elapsed: 0.001 sec  <<< ERROR!
java.lang.NullPointerException
	at org.joda.time.chrono.TestCopticChronology.testCalendar(TestCopticChronology.java:324)

testGetPartialValues(org.joda.time.convert.TestDateConverter)  Time elapsed: 0.001 sec  <<< ERROR!
java.lang.NullPointerException
	at org.joda.time.convert.TestDateConverter.testGetPartialValues(TestDateConverter.java:109)

testSetInto_Object_Chronology2(org.joda.time.convert.TestNullConverter)  Time elapsed: 0 sec  <<< FAILURE!
junit.framework.AssertionFailedError: expected:<null> but was:<ISOChronology[Europe/London]>
	at junit.framework.Assert.fail(Assert.java:47)
	at junit.framework.Assert.failNotEquals(Assert.java:280)
	at junit.framework.Assert.assertEquals(Assert.java:64)
	at junit.framework.Assert.assertEquals(Assert.java:71)
	at org.joda.time.convert.TestNullConverter.testSetInto_Object_Chronology2(TestNullConverter.java:183)

testSetIntoInterval_Object1(org.joda.time.convert.TestReadableIntervalConverter)  Time elapsed: 0 sec  <<< FAILURE!
junit.framework.AssertionFailedError: expected:<null> but was:<ISOChronology[Europe/London]>
	at junit.framework.Assert.fail(Assert.java:47)
	at junit.framework.Assert.failNotEquals(Assert.java:280)
	at junit.framework.Assert.assertEquals(Assert.java:64)
	at junit.framework.Assert.assertEquals(Assert.java:71)
	at org.joda.time.convert.TestReadableIntervalConverter.testSetIntoInterval_Object1(TestReadableIntervalConverter.java:145)


Results :

Failed tests: 
  org.joda.time.TestDateTimeUtils#testGetIntervalChronology_RI_RI AssertionFailedError
  org.joda.time.TestDateTime_Properties#testPropertyEqualsHashCodeYear AssertionFailedError
  org.joda.time.TestInterval_Basics#testWithChronology3 AssertionFailedError exp...
  org.joda.time.TestLocalDateTime_Basics#testToDateTime_Zone AssertionFailedError
  org.joda.time.TestLocalDateTime_Properties#testPropertyEquals AssertionFailedError
  org.joda.time.TestLocalDate_Basics#testToDateMidnight_Zone AssertionFailedError
  org.joda.time.TestLocalDate_Basics#testToDateTimeAtCurrentTime_Zone AssertionFailedError
  org.joda.time.TestLocalDate_Basics#testToDateTimeAtMidnight_Zone AssertionFailedError
  org.joda.time.TestLocalDate_Basics#testToDateTimeAtStartOfDay_Zone AssertionFailedError
  org.joda.time.TestLocalDate_Basics#testToDateTime_LocalTime_Zone AssertionFailedError
  org.joda.time.TestLocalDate_Basics#testToDateTime_nullLocalTime_Zone AssertionFailedError
  org.joda.time.TestLocalDate_Properties#testPropertyEquals AssertionFailedError
  org.joda.time.TestLocalTime_Basics#testToDateTimeToday_Zone AssertionFailedError
  org.joda.time.TestMonthDay_Basics#testEqualsHashCode AssertionFailedError expe...
  org.joda.time.TestMonthDay_Basics#testToLocalDate AssertionFailedError
  org.joda.time.TestMonthDay_Basics#testWithChronologyRetainFields_Chrono AssertionFailedError
  org.joda.time.TestMonthDay_Basics#testWithChronologyRetainFields_nullChrono AssertionFailedError
  org.joda.time.TestMonthDay_Properties#testPropertyEquals AssertionFailedError ...
  org.joda.time.TestPartial_Basics#testWithChronologyRetainFields_Chrono AssertionFailedError
  org.joda.time.TestPartial_Basics#testWithChronologyRetainFields_nullChrono AssertionFailedError
  org.joda.time.TestTimeOfDay_Basics#testToDateTimeToday_Zone AssertionFailedError
  org.joda.time.TestTimeOfDay_Basics#testWithChronologyRetainFields_Chrono AssertionFailedError
  org.joda.time.TestTimeOfDay_Basics#testWithChronologyRetainFields_nullChrono AssertionFailedError
  org.joda.time.TestTimeOfDay_Constructors#testConstructor_todObject AssertionFailedError
  org.joda.time.TestYearMonthDay_Basics#testToDateMidnight_Zone AssertionFailedError
  org.joda.time.TestYearMonthDay_Basics#testToDateTimeAtCurrentTime_Zone AssertionFailedError
  org.joda.time.TestYearMonthDay_Basics#testToDateTimeAtMidnight_Zone AssertionFailedError
  org.joda.time.TestYearMonthDay_Basics#testToDateTime_TOD_Zone AssertionFailedError
  org.joda.time.TestYearMonthDay_Basics#testToDateTime_nullTOD_Zone AssertionFailedError
  org.joda.time.TestYearMonthDay_Basics#testWithChronologyRetainFields_Chrono AssertionFailedError
  org.joda.time.TestYearMonthDay_Basics#testWithChronologyRetainFields_invalidInNewChrono AssertionFailedError
  org.joda.time.TestYearMonthDay_Basics#testWithChronologyRetainFields_nullChrono AssertionFailedError
  org.joda.time.TestYearMonthDay_Properties#testPropertyEquals AssertionFailedError
  org.joda.time.TestYearMonth_Basics#testToInterval_Zone AssertionFailedError ex...
  org.joda.time.TestYearMonth_Basics#testWithChronologyRetainFields_Chrono AssertionFailedError
  org.joda.time.TestYearMonth_Basics#testWithChronologyRetainFields_nullChrono AssertionFailedError
  org.joda.time.TestYearMonth_Properties#testPropertyEquals AssertionFailedError
  org.joda.time.chrono.TestCopticChronology#testEpoch AssertionFailedError expec...
  org.joda.time.chrono.TestCopticChronology#testSampleDate AssertionFailedError ...
  org.joda.time.chrono.TestCopticChronology#testSampleDateWithZone AssertionFailedError
  org.joda.time.convert.TestNullConverter#testSetInto_Object_Chronology2 AssertionFailedError
  org.joda.time.convert.TestReadableIntervalConverter#testSetIntoInterval_Object1 AssertionFailedError
Tests in error: 
  org.joda.time.TestChronology#testToString NullPointerException
  org.joda.time.TestDateMidnight_Properties#testPropertyEqualsHashCodeLenient IllegalArgumentException
  org.joda.time.TestDateMidnight_Properties#testPropertyEqualsHashCodeStrict IllegalArgumentException
  org.joda.time.TestDateTimeFieldType#test_centuryOfEra NullPointerException
  org.joda.time.TestDateTimeFieldType#test_clockhourOfDay NullPointerException
  org.joda.time.TestDateTimeFieldType#test_clockhourOfHalfday NullPointerException
  org.joda.time.TestDateTimeFieldType#test_dayOfMonth NullPointerException
  org.joda.time.TestDateTimeFieldType#test_dayOfWeek NullPointerException
  org.joda.time.TestDateTimeFieldType#test_dayOfYear NullPointerException
  org.joda.time.TestDateTimeFieldType#test_era NullPointerException
  org.joda.time.TestDateTimeFieldType#test_halfdayOfDay NullPointerException
  org.joda.time.TestDateTimeFieldType#test_hourOfDay NullPointerException
  org.joda.time.TestDateTimeFieldType#test_hourOfHalfday NullPointerException
  org.joda.time.TestDateTimeFieldType#test_millisOfDay NullPointerException
  org.joda.time.TestDateTimeFieldType#test_millisOfSecond NullPointerException
  org.joda.time.TestDateTimeFieldType#test_minuteOfDay NullPointerException
  org.joda.time.TestDateTimeFieldType#test_minuteOfHour NullPointerException
  org.joda.time.TestDateTimeFieldType#test_monthOfYear NullPointerException
  org.joda.time.TestDateTimeFieldType#test_secondOfDay NullPointerException
  org.joda.time.TestDateTimeFieldType#test_secondOfMinute NullPointerException
  org.joda.time.TestDateTimeFieldType#test_weekOfWeekyear NullPointerException
  org.joda.time.TestDateTimeFieldType#test_weekyear NullPointerException
  org.joda.time.TestDateTimeFieldType#test_weekyearOfCentury NullPointerException
  org.joda.time.TestDateTimeFieldType#test_year NullPointerException
  org.joda.time.TestDateTimeFieldType#test_yearOfCentury NullPointerException
  org.joda.time.TestDateTimeFieldType#test_yearOfEra NullPointerException
  org.joda.time.TestDateTime_Properties#testPropertyEqualsHashCodeLenient IllegalArgumentException
  org.joda.time.TestDateTime_Properties#testPropertyEqualsHashCodeStrict IllegalArgumentException
  org.joda.time.TestDurationFieldType#test_centuries NullPointerException
  org.joda.time.TestDurationFieldType#test_days NullPointerException
  org.joda.time.TestDurationFieldType#test_eras NullPointerException
  org.joda.time.TestDurationFieldType#test_halfdays NullPointerException
  org.joda.time.TestDurationFieldType#test_hours NullPointerException
  org.joda.time.TestDurationFieldType#test_millis NullPointerException
  org.joda.time.TestDurationFieldType#test_minutes NullPointerException
  org.joda.time.TestDurationFieldType#test_months NullPointerException
  org.joda.time.TestDurationFieldType#test_seconds NullPointerException
  org.joda.time.TestDurationFieldType#test_weeks NullPointerException
  org.joda.time.TestDurationFieldType#test_weekyears NullPointerException
  org.joda.time.TestDurationFieldType#test_years NullPointerException
  org.joda.time.TestInterval_Basics#testEqualsHashCodeLenient IllegalArgumentException
  org.joda.time.TestInterval_Basics#testEqualsHashCodeStrict IllegalArgumentException
  org.joda.time.TestInterval_Constructors#testConstructor_RI_RP3 NullPointerException
  org.joda.time.TestInterval_Constructors#testConstructor_RP_RI3 NullPointerException
  org.joda.time.TestLocalDateTime_Basics#testEqualsHashCode NullPointerException
  org.joda.time.TestLocalDateTime_Basics#testGetField_int NullPointerException
  org.joda.time.TestLocalDateTime_Basics#testGetFields NullPointerException
  org.joda.time.TestLocalDate_Basics#testEqualsHashCode NullPointerException
  org.joda.time.TestLocalDate_Basics#testEqualsHashCodeAPI NullPointerException
  org.joda.time.TestLocalDate_Basics#testEqualsHashCodeLenient IllegalArgumentException
  org.joda.time.TestLocalDate_Basics#testEqualsHashCodeStrict IllegalArgumentException
  org.joda.time.TestLocalDate_Basics#testGetField_int NullPointerException
  org.joda.time.TestLocalDate_Basics#testGetFields NullPointerException
  org.joda.time.TestLocalDate_Properties#testPropertyEqualsHashCodeLenient IllegalArgumentException
  org.joda.time.TestLocalDate_Properties#testPropertyEqualsHashCodeStrict IllegalArgumentException
  org.joda.time.TestLocalTime_Basics#testEqualsHashCode NullPointerException
  org.joda.time.TestLocalTime_Basics#testGetField_int NullPointerException
  org.joda.time.TestLocalTime_Basics#testGetFields NullPointerException
  org.joda.time.TestMonthDay_Basics#testGetField NullPointerException
  org.joda.time.TestMonthDay_Basics#testGetFields NullPointerException
  org.joda.time.TestMonthDay_Properties#testPropertyEqualsHashCodeLenient IllegalArgumentException
  org.joda.time.TestMonthDay_Properties#testPropertyEqualsHashCodeStrict IllegalArgumentException
  org.joda.time.TestPartial_Basics#testGetField NullPointerException
  org.joda.time.TestPartial_Basics#testGetFields NullPointerException
  org.joda.time.TestTimeOfDay_Basics#testEqualsHashCode NullPointerException
  org.joda.time.TestTimeOfDay_Basics#testGetField NullPointerException
  org.joda.time.TestTimeOfDay_Basics#testGetFields NullPointerException
  org.joda.time.TestYearMonthDay_Basics#testEqualsHashCode NullPointerException
  org.joda.time.TestYearMonthDay_Basics#testGetField NullPointerException
  org.joda.time.TestYearMonthDay_Basics#testGetFields NullPointerException
  org.joda.time.TestYearMonthDay_Properties#testPropertyEqualsHashCodeLenient IllegalArgumentException
  org.joda.time.TestYearMonthDay_Properties#testPropertyEqualsHashCodeStrict IllegalArgumentException
  org.joda.time.TestYearMonth_Basics#testEqualsHashCode NullPointerException
  org.joda.time.TestYearMonth_Basics#testGetField NullPointerException
  org.joda.time.TestYearMonth_Basics#testGetFields NullPointerException
  org.joda.time.TestYearMonth_Basics#testWithChronologyRetainFields_invalidInNewChrono IllegalFieldValueException
  org.joda.time.TestYearMonth_Properties#testPropertyEqualsHashCodeLenient IllegalArgumentException
  org.joda.time.TestYearMonth_Properties#testPropertyEqualsHashCodeStrict IllegalArgumentException
  org.joda.time.chrono.TestCopticChronology#testCalendar NullPointerException
  org.joda.time.chrono.TestCopticChronology#testDateFields NullPointerException
  org.joda.time.chrono.TestCopticChronology#testDurationFields NullPointerException
  org.joda.time.chrono.TestCopticChronology#testDurationMonth IllegalFieldValueException
  org.joda.time.chrono.TestCopticChronology#testDurationYear NullPointerException
  org.joda.time.chrono.TestCopticChronology#testFactory NullPointerException
  org.joda.time.chrono.TestCopticChronology#testFactoryUTC NullPointerException
  org.joda.time.chrono.TestCopticChronology#testFactory_Zone NullPointerException
  org.joda.time.chrono.TestCopticChronology#testLeap_5_13 IllegalFieldValueException
  org.joda.time.chrono.TestCopticChronology#testLeap_6_13 IllegalFieldValueException
  org.joda.time.chrono.TestCopticChronology#testTimeFields NullPointerException
  org.joda.time.chrono.TestCopticChronology#testToString NullPointerException
  org.joda.time.chrono.TestCopticChronology#testWithUTC NullPointerException
  org.joda.time.chrono.TestCopticChronology#testWithZone NullPointerException
  org.joda.time.convert.TestDateConverter#testGetPartialValues NullPointerException

Tests run: 4157, Failures: 42, Errors: 93, Skipped: 0

[INFO] ------------------------------------------------------------------------
[INFO] BUILD FAILURE
[INFO] ------------------------------------------------------------------------
[INFO] Total time: 15.366s
[INFO] Finished at: Thu Aug 06 00:04:35 BST 2015
[INFO] Final Memory: 9M/214M
[INFO] ------------------------------------------------------------------------
[ERROR] Failed to execute goal org.apache.maven.plugins:maven-surefire-plugin:2.18.1:test (default-test) on project joda-time: There are test failures.
[ERROR] 
[ERROR] Please refer to /home/perham/Study/LittleDarwin/Cases/joda-time-2.8.1/target/surefire-reports for the individual test results.
[ERROR] -> [Help 1]
[ERROR] 
[ERROR] To see the full stack trace of the errors, re-run Maven with the -e switch.
[ERROR] Re-run Maven using the -X switch to enable full debug logging.
[ERROR] 
[ERROR] For more information about the errors and possible solutions, please read the following articles:
[ERROR] [Help 1] http://cwiki.apache.org/confluence/display/MAVEN/MojoFailureException
