[INFO] Scanning for projects...
[INFO]                                                                         
[INFO] ------------------------------------------------------------------------
[INFO] Building Joda-Time 2.8.1
[INFO] ------------------------------------------------------------------------
[INFO] 
[INFO] --- maven-resources-plugin:2.7:resources (default-resources) @ joda-time ---
[INFO] Using 'UTF-8' encoding to copy filtered resources.
[INFO] Copying 2 resources to META-INF
[INFO] Copying 10 resources
[INFO] 
[INFO] --- maven-compiler-plugin:3.3:compile (default-compile) @ joda-time ---
[INFO] Changes detected - recompiling the module!
[INFO] Compiling 166 source files to /home/perham/Study/LittleDarwin/Cases/joda-time-2.8.1/target/classes
[INFO] 
[INFO] --- exec-maven-plugin:1.4.0:java (compile-tzdb) @ joda-time ---
Writing zoneinfo files
Writing ZoneInfoMap
[INFO] 
[INFO] --- maven-resources-plugin:2.7:testResources (default-testResources) @ joda-time ---
[INFO] Using 'UTF-8' encoding to copy filtered resources.
[INFO] Copying 34 resources
[INFO] 
[INFO] --- maven-compiler-plugin:3.3:testCompile (default-testCompile) @ joda-time ---
[INFO] Nothing to compile - all classes are up to date
[INFO] 
[INFO] --- maven-surefire-plugin:2.18.1:test (default-test) @ joda-time ---
[INFO] Surefire report directory: /home/perham/Study/LittleDarwin/Cases/joda-time-2.8.1/target/surefire-reports

-------------------------------------------------------
 T E S T S
-------------------------------------------------------
Running org.joda.time.TestAllPackages

TestBuddhistChronology.testCalendar

TestCopticChronology.testCalendar

TestEthiopicChronology.testCalendar

TestIslamicChronology.testCalendar

Testing Gregorian chronology over 1000 iterations
100% complete (i=1000)

Testing Julian chronology over 1000 iterations
100% complete (i=1000)
Writing zoneinfo files
Writing ZoneInfoMap
Tests run: 4157, Failures: 16, Errors: 0, Skipped: 0, Time elapsed: 5.217 sec <<< FAILURE! - in org.joda.time.TestAllPackages
testToDateTime_Zone(org.joda.time.TestLocalDateTime_Basics)  Time elapsed: 0.003 sec  <<< FAILURE!
junit.framework.AssertionFailedError: expected:<2005-06-09T06:07:08.009+09:00> but was:<2005-06-09T06:07:08.009Z>
	at junit.framework.Assert.fail(Assert.java:47)
	at junit.framework.Assert.failNotEquals(Assert.java:280)
	at junit.framework.Assert.assertEquals(Assert.java:64)
	at junit.framework.Assert.assertEquals(Assert.java:71)
	at org.joda.time.TestLocalDateTime_Basics.testToDateTime_Zone(TestLocalDateTime_Basics.java:782)

testToDateTimeAtStartOfDay_Zone(org.joda.time.TestLocalDate_Basics)  Time elapsed: 0.001 sec  <<< FAILURE!
junit.framework.AssertionFailedError: expected:<2005-06-09T00:00:00.000+09:00> but was:<2005-06-08T00:00:00.000Z>
	at junit.framework.Assert.fail(Assert.java:47)
	at junit.framework.Assert.failNotEquals(Assert.java:280)
	at junit.framework.Assert.assertEquals(Assert.java:64)
	at junit.framework.Assert.assertEquals(Assert.java:71)
	at org.joda.time.TestLocalDate_Basics.testToDateTimeAtStartOfDay_Zone(TestLocalDate_Basics.java:686)

testToDateTimeAtMidnight_Zone(org.joda.time.TestLocalDate_Basics)  Time elapsed: 0.001 sec  <<< FAILURE!
junit.framework.AssertionFailedError: expected:<2005-06-09T00:00:00.000+09:00> but was:<2005-06-09T00:00:00.000Z>
	at junit.framework.Assert.fail(Assert.java:47)
	at junit.framework.Assert.failNotEquals(Assert.java:280)
	at junit.framework.Assert.assertEquals(Assert.java:64)
	at junit.framework.Assert.assertEquals(Assert.java:71)
	at org.joda.time.TestLocalDate_Basics.testToDateTimeAtMidnight_Zone(TestLocalDate_Basics.java:722)

testToDateTimeAtCurrentTime_Zone(org.joda.time.TestLocalDate_Basics)  Time elapsed: 0.001 sec  <<< FAILURE!
junit.framework.AssertionFailedError: expected:<2005-06-09T14:07:08.009+09:00> but was:<2005-06-09T06:07:08.009Z>
	at junit.framework.Assert.fail(Assert.java:47)
	at junit.framework.Assert.failNotEquals(Assert.java:280)
	at junit.framework.Assert.assertEquals(Assert.java:64)
	at junit.framework.Assert.assertEquals(Assert.java:71)
	at org.joda.time.TestLocalDate_Basics.testToDateTimeAtCurrentTime_Zone(TestLocalDate_Basics.java:761)

testToDateTime_LocalTime_Zone(org.joda.time.TestLocalDate_Basics)  Time elapsed: 0.001 sec  <<< FAILURE!
junit.framework.AssertionFailedError: expected:<2005-06-09T12:13:14.015+09:00> but was:<2005-06-09T12:13:14.015Z>
	at junit.framework.Assert.fail(Assert.java:47)
	at junit.framework.Assert.failNotEquals(Assert.java:280)
	at junit.framework.Assert.assertEquals(Assert.java:64)
	at junit.framework.Assert.assertEquals(Assert.java:71)
	at org.joda.time.TestLocalDate_Basics.testToDateTime_LocalTime_Zone(TestLocalDate_Basics.java:842)

testToDateTime_nullLocalTime_Zone(org.joda.time.TestLocalDate_Basics)  Time elapsed: 0.001 sec  <<< FAILURE!
junit.framework.AssertionFailedError: expected:<2005-06-09T12:13:14.015+09:00> but was:<2005-06-09T03:13:14.015Z>
	at junit.framework.Assert.fail(Assert.java:47)
	at junit.framework.Assert.failNotEquals(Assert.java:280)
	at junit.framework.Assert.assertEquals(Assert.java:64)
	at junit.framework.Assert.assertEquals(Assert.java:71)
	at org.joda.time.TestLocalDate_Basics.testToDateTime_nullLocalTime_Zone(TestLocalDate_Basics.java:863)

testToDateMidnight_Zone(org.joda.time.TestLocalDate_Basics)  Time elapsed: 0 sec  <<< FAILURE!
junit.framework.AssertionFailedError: expected:<2005-06-09T00:00:00.000+09:00> but was:<2005-06-09T00:00:00.000Z>
	at junit.framework.Assert.fail(Assert.java:47)
	at junit.framework.Assert.failNotEquals(Assert.java:280)
	at junit.framework.Assert.assertEquals(Assert.java:64)
	at junit.framework.Assert.assertEquals(Assert.java:71)
	at org.joda.time.TestLocalDate_Basics.testToDateMidnight_Zone(TestLocalDate_Basics.java:918)

testToDateTimeToday_Zone(org.joda.time.TestLocalTime_Basics)  Time elapsed: 0.001 sec  <<< FAILURE!
junit.framework.AssertionFailedError: expected:<1720-10-02T10:20:30.040+09:00> but was:<1720-10-02T10:20:30.040+01:00>
	at junit.framework.Assert.fail(Assert.java:47)
	at junit.framework.Assert.failNotEquals(Assert.java:280)
	at junit.framework.Assert.assertEquals(Assert.java:64)
	at junit.framework.Assert.assertEquals(Assert.java:71)
	at org.joda.time.TestLocalTime_Basics.testToDateTimeToday_Zone(TestLocalTime_Basics.java:696)

testToDateTimeToday_Zone(org.joda.time.TestTimeOfDay_Basics)  Time elapsed: 0 sec  <<< FAILURE!
junit.framework.AssertionFailedError: expected:<1720-10-02T10:20:30.040+09:00> but was:<1720-10-02T10:20:30.040+01:00>
	at junit.framework.Assert.fail(Assert.java:47)
	at junit.framework.Assert.failNotEquals(Assert.java:280)
	at junit.framework.Assert.assertEquals(Assert.java:64)
	at junit.framework.Assert.assertEquals(Assert.java:71)
	at org.joda.time.TestTimeOfDay_Basics.testToDateTimeToday_Zone(TestTimeOfDay_Basics.java:624)

testToDateTimeAtMidnight_Zone(org.joda.time.TestYearMonthDay_Basics)  Time elapsed: 0.001 sec  <<< FAILURE!
junit.framework.AssertionFailedError: expected:<2005-06-09T00:00:00.000+09:00> but was:<2005-06-09T00:00:00.000Z>
	at junit.framework.Assert.fail(Assert.java:47)
	at junit.framework.Assert.failNotEquals(Assert.java:280)
	at junit.framework.Assert.assertEquals(Assert.java:64)
	at junit.framework.Assert.assertEquals(Assert.java:71)
	at org.joda.time.TestYearMonthDay_Basics.testToDateTimeAtMidnight_Zone(TestYearMonthDay_Basics.java:548)

testToDateTimeAtCurrentTime_Zone(org.joda.time.TestYearMonthDay_Basics)  Time elapsed: 0.001 sec  <<< FAILURE!
junit.framework.AssertionFailedError: expected:<2005-06-09T14:07:08.009+09:00> but was:<2005-06-09T06:07:08.009Z>
	at junit.framework.Assert.fail(Assert.java:47)
	at junit.framework.Assert.failNotEquals(Assert.java:280)
	at junit.framework.Assert.assertEquals(Assert.java:64)
	at junit.framework.Assert.assertEquals(Assert.java:71)
	at org.joda.time.TestYearMonthDay_Basics.testToDateTimeAtCurrentTime_Zone(TestYearMonthDay_Basics.java:586)

testToDateMidnight_Zone(org.joda.time.TestYearMonthDay_Basics)  Time elapsed: 0.011 sec  <<< FAILURE!
junit.framework.AssertionFailedError: expected:<2005-06-09T00:00:00.000+09:00> but was:<2005-06-09T00:00:00.000Z>
	at junit.framework.Assert.fail(Assert.java:47)
	at junit.framework.Assert.failNotEquals(Assert.java:280)
	at junit.framework.Assert.assertEquals(Assert.java:64)
	at junit.framework.Assert.assertEquals(Assert.java:71)
	at org.joda.time.TestYearMonthDay_Basics.testToDateMidnight_Zone(TestYearMonthDay_Basics.java:672)

testToDateTime_TOD_Zone(org.joda.time.TestYearMonthDay_Basics)  Time elapsed: 0.001 sec  <<< FAILURE!
junit.framework.AssertionFailedError: expected:<2005-06-09T12:13:14.015+09:00> but was:<2005-06-09T12:13:14.015Z>
	at junit.framework.Assert.fail(Assert.java:47)
	at junit.framework.Assert.failNotEquals(Assert.java:280)
	at junit.framework.Assert.assertEquals(Assert.java:64)
	at junit.framework.Assert.assertEquals(Assert.java:71)
	at org.joda.time.TestYearMonthDay_Basics.testToDateTime_TOD_Zone(TestYearMonthDay_Basics.java:633)

testToDateTime_nullTOD_Zone(org.joda.time.TestYearMonthDay_Basics)  Time elapsed: 0.001 sec  <<< FAILURE!
junit.framework.AssertionFailedError: expected:<2005-06-09T12:13:14.015+09:00> but was:<2005-06-09T03:13:14.015Z>
	at junit.framework.Assert.fail(Assert.java:47)
	at junit.framework.Assert.failNotEquals(Assert.java:280)
	at junit.framework.Assert.assertEquals(Assert.java:64)
	at junit.framework.Assert.assertEquals(Assert.java:71)
	at org.joda.time.TestYearMonthDay_Basics.testToDateTime_nullTOD_Zone(TestYearMonthDay_Basics.java:654)

testToInterval_Zone(org.joda.time.TestYearMonth_Basics)  Time elapsed: 0.001 sec  <<< FAILURE!
junit.framework.AssertionFailedError: expected:<2005-06-01T00:00:00.000+09:00/2005-07-01T00:00:00.000+09:00> but was:<2005-05-30T00:00:00.000Z/2005-06-30T00:00:00.000Z>
	at junit.framework.Assert.fail(Assert.java:47)
	at junit.framework.Assert.failNotEquals(Assert.java:280)
	at junit.framework.Assert.assertEquals(Assert.java:64)
	at junit.framework.Assert.assertEquals(Assert.java:71)
	at org.joda.time.TestYearMonth_Basics.testToInterval_Zone(TestYearMonth_Basics.java:556)

testWithZone(org.joda.time.chrono.TestCopticChronology)  Time elapsed: 0 sec  <<< FAILURE!
junit.framework.AssertionFailedError: expected same:<CopticChronology[Asia/Tokyo]> was not:<CopticChronology[Europe/London]>
	at junit.framework.Assert.fail(Assert.java:47)
	at junit.framework.Assert.failNotSame(Assert.java:276)
	at junit.framework.Assert.assertSame(Assert.java:239)
	at junit.framework.Assert.assertSame(Assert.java:246)
	at org.joda.time.chrono.TestCopticChronology.testWithZone(TestCopticChronology.java:132)


Results :

Failed tests: 
  org.joda.time.TestLocalDateTime_Basics#testToDateTime_Zone AssertionFailedError
  org.joda.time.TestLocalDate_Basics#testToDateMidnight_Zone AssertionFailedError
  org.joda.time.TestLocalDate_Basics#testToDateTimeAtCurrentTime_Zone AssertionFailedError
  org.joda.time.TestLocalDate_Basics#testToDateTimeAtMidnight_Zone AssertionFailedError
  org.joda.time.TestLocalDate_Basics#testToDateTimeAtStartOfDay_Zone AssertionFailedError
  org.joda.time.TestLocalDate_Basics#testToDateTime_LocalTime_Zone AssertionFailedError
  org.joda.time.TestLocalDate_Basics#testToDateTime_nullLocalTime_Zone AssertionFailedError
  org.joda.time.TestLocalTime_Basics#testToDateTimeToday_Zone AssertionFailedError
  org.joda.time.TestTimeOfDay_Basics#testToDateTimeToday_Zone AssertionFailedError
  org.joda.time.TestYearMonthDay_Basics#testToDateMidnight_Zone AssertionFailedError
  org.joda.time.TestYearMonthDay_Basics#testToDateTimeAtCurrentTime_Zone AssertionFailedError
  org.joda.time.TestYearMonthDay_Basics#testToDateTimeAtMidnight_Zone AssertionFailedError
  org.joda.time.TestYearMonthDay_Basics#testToDateTime_TOD_Zone AssertionFailedError
  org.joda.time.TestYearMonthDay_Basics#testToDateTime_nullTOD_Zone AssertionFailedError
  org.joda.time.TestYearMonth_Basics#testToInterval_Zone AssertionFailedError ex...
  org.joda.time.chrono.TestCopticChronology#testWithZone AssertionFailedError ex...

Tests run: 4157, Failures: 16, Errors: 0, Skipped: 0

[INFO] ------------------------------------------------------------------------
[INFO] BUILD FAILURE
[INFO] ------------------------------------------------------------------------
[INFO] Total time: 15.257s
[INFO] Finished at: Thu Aug 06 00:03:12 BST 2015
[INFO] Final Memory: 9M/209M
[INFO] ------------------------------------------------------------------------
[ERROR] Failed to execute goal org.apache.maven.plugins:maven-surefire-plugin:2.18.1:test (default-test) on project joda-time: There are test failures.
[ERROR] 
[ERROR] Please refer to /home/perham/Study/LittleDarwin/Cases/joda-time-2.8.1/target/surefire-reports for the individual test results.
[ERROR] -> [Help 1]
[ERROR] 
[ERROR] To see the full stack trace of the errors, re-run Maven with the -e switch.
[ERROR] Re-run Maven using the -X switch to enable full debug logging.
[ERROR] 
[ERROR] For more information about the errors and possible solutions, please read the following articles:
[ERROR] [Help 1] http://cwiki.apache.org/confluence/display/MAVEN/MojoFailureException
