[INFO] Scanning for projects...
[INFO]                                                                         
[INFO] ------------------------------------------------------------------------
[INFO] Building Joda-Time 2.8.1
[INFO] ------------------------------------------------------------------------
[INFO] 
[INFO] --- maven-resources-plugin:2.7:resources (default-resources) @ joda-time ---
[INFO] Using 'UTF-8' encoding to copy filtered resources.
[INFO] Copying 2 resources to META-INF
[INFO] Copying 10 resources
[INFO] 
[INFO] --- maven-compiler-plugin:3.3:compile (default-compile) @ joda-time ---
[INFO] Changes detected - recompiling the module!
[INFO] Compiling 166 source files to /home/perham/Study/LittleDarwin/Cases/joda-time-2.8.1/target/classes
[INFO] 
[INFO] --- exec-maven-plugin:1.4.0:java (compile-tzdb) @ joda-time ---
Writing zoneinfo files
Writing ZoneInfoMap
[INFO] 
[INFO] --- maven-resources-plugin:2.7:testResources (default-testResources) @ joda-time ---
[INFO] Using 'UTF-8' encoding to copy filtered resources.
[INFO] Copying 34 resources
[INFO] 
[INFO] --- maven-compiler-plugin:3.3:testCompile (default-testCompile) @ joda-time ---
[INFO] Nothing to compile - all classes are up to date
[INFO] 
[INFO] --- maven-surefire-plugin:2.18.1:test (default-test) @ joda-time ---
[INFO] Surefire report directory: /home/perham/Study/LittleDarwin/Cases/joda-time-2.8.1/target/surefire-reports

-------------------------------------------------------
 T E S T S
-------------------------------------------------------
Running org.joda.time.TestAllPackages

TestBuddhistChronology.testCalendar

TestCopticChronology.testCalendar

TestEthiopicChronology.testCalendar

TestIslamicChronology.testCalendar

Testing Gregorian chronology over 1000 iterations
100% complete (i=1000)

Testing Julian chronology over 1000 iterations
100% complete (i=1000)
Writing zoneinfo files
Writing ZoneInfoMap
Tests run: 4157, Failures: 27, Errors: 33, Skipped: 0, Time elapsed: 5.195 sec <<< FAILURE! - in org.joda.time.TestAllPackages
testConstructor_RI_RP3(org.joda.time.TestInterval_Constructors)  Time elapsed: 0.004 sec  <<< ERROR!
java.lang.IllegalArgumentException: The end instant must be greater or equal to the start
	at org.joda.time.base.AbstractInterval.checkInterval(AbstractInterval.java:63)
	at org.joda.time.base.BaseInterval.<init>(BaseInterval.java:153)
	at org.joda.time.Interval.<init>(Interval.java:161)
	at org.joda.time.TestInterval_Constructors.testConstructor_RI_RP3(TestInterval_Constructors.java:301)

testWithPeriodAfterStart1(org.joda.time.TestInterval_Basics)  Time elapsed: 0.001 sec  <<< ERROR!
java.lang.IllegalArgumentException: The end instant must be greater or equal to the start
	at org.joda.time.base.AbstractInterval.checkInterval(AbstractInterval.java:63)
	at org.joda.time.base.BaseInterval.<init>(BaseInterval.java:73)
	at org.joda.time.Interval.<init>(Interval.java:109)
	at org.joda.time.Interval.withPeriodAfterStart(Interval.java:465)
	at org.joda.time.TestInterval_Basics.testWithPeriodAfterStart1(TestInterval_Basics.java:1229)

testEqualsHashCode(org.joda.time.TestLocalDateTime_Basics)  Time elapsed: 0.002 sec  <<< FAILURE!
junit.framework.AssertionFailedError: expected:<true> but was:<false>
	at junit.framework.Assert.fail(Assert.java:47)
	at junit.framework.Assert.failNotEquals(Assert.java:280)
	at junit.framework.Assert.assertEquals(Assert.java:64)
	at junit.framework.Assert.assertEquals(Assert.java:146)
	at junit.framework.Assert.assertEquals(Assert.java:152)
	at org.joda.time.TestLocalDateTime_Basics.testEqualsHashCode(TestLocalDateTime_Basics.java:302)

testToDateTime(org.joda.time.TestLocalDateTime_Basics)  Time elapsed: 0.001 sec  <<< ERROR!
org.joda.time.IllegalFieldValueException: Value 20521 for monthOfYear must be in the range [1,13]
	at org.joda.time.field.FieldUtils.verifyValueBounds(FieldUtils.java:252)
	at org.joda.time.chrono.BasicChronology.getDateMidnightMillis(BasicChronology.java:612)
	at org.joda.time.chrono.BasicChronology.getDateTimeMillis(BasicChronology.java:177)
	at org.joda.time.chrono.CopticChronology.getDateTimeMillis(CopticChronology.java:16)
	at org.joda.time.chrono.LimitChronology.getDateTimeMillis(LimitChronology.java:187)
	at org.joda.time.chrono.BasicChronology.getDateTimeMillis(BasicChronology.java:168)
	at org.joda.time.chrono.CopticChronology.getDateTimeMillis(CopticChronology.java:16)
	at org.joda.time.chrono.ZonedChronology.getDateTimeMillis(ZonedChronology.java:118)
	at org.joda.time.chrono.BasicChronology.getDateTimeMillis(BasicChronology.java:168)
	at org.joda.time.chrono.CopticChronology.getDateTimeMillis(CopticChronology.java:16)
	at org.joda.time.base.BaseDateTime.<init>(BaseDateTime.java:258)
	at org.joda.time.DateTime.<init>(DateTime.java:532)
	at org.joda.time.LocalDateTime.toDateTime(LocalDateTime.java:750)
	at org.joda.time.LocalDateTime.toDateTime(LocalDateTime.java:731)
	at org.joda.time.TestLocalDateTime_Basics.testToDateTime(TestLocalDateTime_Basics.java:769)

testToDateTime_Zone(org.joda.time.TestLocalDateTime_Basics)  Time elapsed: 0.001 sec  <<< ERROR!
org.joda.time.IllegalFieldValueException: Value 20521 for monthOfYear must be in the range [1,13]
	at org.joda.time.field.FieldUtils.verifyValueBounds(FieldUtils.java:252)
	at org.joda.time.chrono.BasicChronology.getDateMidnightMillis(BasicChronology.java:612)
	at org.joda.time.chrono.BasicChronology.getDateTimeMillis(BasicChronology.java:177)
	at org.joda.time.chrono.CopticChronology.getDateTimeMillis(CopticChronology.java:16)
	at org.joda.time.chrono.LimitChronology.getDateTimeMillis(LimitChronology.java:187)
	at org.joda.time.chrono.BasicChronology.getDateTimeMillis(BasicChronology.java:168)
	at org.joda.time.chrono.CopticChronology.getDateTimeMillis(CopticChronology.java:16)
	at org.joda.time.chrono.ZonedChronology.getDateTimeMillis(ZonedChronology.java:118)
	at org.joda.time.chrono.BasicChronology.getDateTimeMillis(BasicChronology.java:168)
	at org.joda.time.chrono.CopticChronology.getDateTimeMillis(CopticChronology.java:16)
	at org.joda.time.base.BaseDateTime.<init>(BaseDateTime.java:258)
	at org.joda.time.DateTime.<init>(DateTime.java:532)
	at org.joda.time.LocalDateTime.toDateTime(LocalDateTime.java:750)
	at org.joda.time.TestLocalDateTime_Basics.testToDateTime_Zone(TestLocalDateTime_Basics.java:779)

testToDateTime_nullZone(org.joda.time.TestLocalDateTime_Basics)  Time elapsed: 0 sec  <<< ERROR!
org.joda.time.IllegalFieldValueException: Value 20521 for monthOfYear must be in the range [1,13]
	at org.joda.time.field.FieldUtils.verifyValueBounds(FieldUtils.java:252)
	at org.joda.time.chrono.BasicChronology.getDateMidnightMillis(BasicChronology.java:612)
	at org.joda.time.chrono.BasicChronology.getDateTimeMillis(BasicChronology.java:177)
	at org.joda.time.chrono.CopticChronology.getDateTimeMillis(CopticChronology.java:16)
	at org.joda.time.chrono.LimitChronology.getDateTimeMillis(LimitChronology.java:187)
	at org.joda.time.chrono.BasicChronology.getDateTimeMillis(BasicChronology.java:168)
	at org.joda.time.chrono.CopticChronology.getDateTimeMillis(CopticChronology.java:16)
	at org.joda.time.chrono.ZonedChronology.getDateTimeMillis(ZonedChronology.java:118)
	at org.joda.time.chrono.BasicChronology.getDateTimeMillis(BasicChronology.java:168)
	at org.joda.time.chrono.CopticChronology.getDateTimeMillis(CopticChronology.java:16)
	at org.joda.time.base.BaseDateTime.<init>(BaseDateTime.java:258)
	at org.joda.time.DateTime.<init>(DateTime.java:532)
	at org.joda.time.LocalDateTime.toDateTime(LocalDateTime.java:750)
	at org.joda.time.TestLocalDateTime_Basics.testToDateTime_nullZone(TestLocalDateTime_Basics.java:788)

testToDateTime_RI(org.joda.time.TestLocalDateTime_Basics)  Time elapsed: 0.001 sec  <<< ERROR!
org.joda.time.IllegalFieldValueException: Value 20521 for monthOfYear must be in the range [1,12]
	at org.joda.time.field.FieldUtils.verifyValueBounds(FieldUtils.java:234)
	at org.joda.time.chrono.BasicMonthOfYearDateTimeField.set(BasicMonthOfYearDateTimeField.java:299)
	at org.joda.time.chrono.GJChronology$CutoverField.set(GJChronology.java:740)
	at org.joda.time.chrono.ZonedChronology$ZonedDateTimeField.set(ZonedChronology.java:482)
	at org.joda.time.chrono.LimitChronology$LimitDateTimeField.set(LimitChronology.java:511)
	at org.joda.time.chrono.BaseChronology.set(BaseChronology.java:240)
	at org.joda.time.base.AbstractPartial.toDateTime(AbstractPartial.java:242)
	at org.joda.time.TestLocalDateTime_Basics.testToDateTime_RI(TestLocalDateTime_Basics.java:834)

testToDateTime_nullRI(org.joda.time.TestLocalDateTime_Basics)  Time elapsed: 0.001 sec  <<< ERROR!
org.joda.time.IllegalFieldValueException: Value 20521 for monthOfYear must be in the range [1,12]
	at org.joda.time.field.FieldUtils.verifyValueBounds(FieldUtils.java:234)
	at org.joda.time.chrono.BasicMonthOfYearDateTimeField.set(BasicMonthOfYearDateTimeField.java:299)
	at org.joda.time.chrono.ZonedChronology$ZonedDateTimeField.set(ZonedChronology.java:482)
	at org.joda.time.chrono.BaseChronology.set(BaseChronology.java:240)
	at org.joda.time.base.AbstractPartial.toDateTime(AbstractPartial.java:242)
	at org.joda.time.TestLocalDateTime_Basics.testToDateTime_nullRI(TestLocalDateTime_Basics.java:843)

testToDate_summer(org.joda.time.TestLocalDateTime_Basics)  Time elapsed: 0.001 sec  <<< FAILURE!
junit.framework.AssertionFailedError: expected:<2005> but was:<320>
	at junit.framework.Assert.fail(Assert.java:47)
	at junit.framework.Assert.failNotEquals(Assert.java:280)
	at junit.framework.Assert.assertEquals(Assert.java:64)
	at junit.framework.Assert.assertEquals(Assert.java:198)
	at junit.framework.Assert.assertEquals(Assert.java:204)
	at org.joda.time.TestLocalDateTime_Basics.check(TestLocalDateTime_Basics.java:1101)
	at org.joda.time.TestLocalDateTime_Basics.testToDate_summer(TestLocalDateTime_Basics.java:854)

testToDate_winter(org.joda.time.TestLocalDateTime_Basics)  Time elapsed: 0 sec  <<< FAILURE!
junit.framework.AssertionFailedError: expected:<2005> but was:<320>
	at junit.framework.Assert.fail(Assert.java:47)
	at junit.framework.Assert.failNotEquals(Assert.java:280)
	at junit.framework.Assert.assertEquals(Assert.java:64)
	at junit.framework.Assert.assertEquals(Assert.java:198)
	at junit.framework.Assert.assertEquals(Assert.java:204)
	at org.joda.time.TestLocalDateTime_Basics.check(TestLocalDateTime_Basics.java:1101)
	at org.joda.time.TestLocalDateTime_Basics.testToDate_winter(TestLocalDateTime_Basics.java:872)

testToDate_summer_Zone(org.joda.time.TestLocalDateTime_Basics)  Time elapsed: 0 sec  <<< FAILURE!
junit.framework.AssertionFailedError: expected:<2005> but was:<320>
	at junit.framework.Assert.fail(Assert.java:47)
	at junit.framework.Assert.failNotEquals(Assert.java:280)
	at junit.framework.Assert.assertEquals(Assert.java:64)
	at junit.framework.Assert.assertEquals(Assert.java:198)
	at junit.framework.Assert.assertEquals(Assert.java:204)
	at org.joda.time.TestLocalDateTime_Basics.check(TestLocalDateTime_Basics.java:1101)
	at org.joda.time.TestLocalDateTime_Basics.testToDate_summer_Zone(TestLocalDateTime_Basics.java:939)

testToDate_winter_Zone(org.joda.time.TestLocalDateTime_Basics)  Time elapsed: 0.001 sec  <<< FAILURE!
junit.framework.AssertionFailedError: expected:<2005> but was:<320>
	at junit.framework.Assert.fail(Assert.java:47)
	at junit.framework.Assert.failNotEquals(Assert.java:280)
	at junit.framework.Assert.assertEquals(Assert.java:64)
	at junit.framework.Assert.assertEquals(Assert.java:198)
	at junit.framework.Assert.assertEquals(Assert.java:204)
	at org.joda.time.TestLocalDateTime_Basics.check(TestLocalDateTime_Basics.java:1101)
	at org.joda.time.TestLocalDateTime_Basics.testToDate_winter_Zone(TestLocalDateTime_Basics.java:957)

testEqualsHashCode(org.joda.time.TestLocalDate_Basics)  Time elapsed: 0.001 sec  <<< FAILURE!
junit.framework.AssertionFailedError: expected:<true> but was:<false>
	at junit.framework.Assert.fail(Assert.java:47)
	at junit.framework.Assert.failNotEquals(Assert.java:280)
	at junit.framework.Assert.assertEquals(Assert.java:64)
	at junit.framework.Assert.assertEquals(Assert.java:146)
	at junit.framework.Assert.assertEquals(Assert.java:152)
	at org.joda.time.TestLocalDate_Basics.testEqualsHashCode(TestLocalDate_Basics.java:264)

testToDateMidnight(org.joda.time.TestLocalDate_Basics)  Time elapsed: 0.001 sec  <<< ERROR!
org.joda.time.IllegalFieldValueException: Value 20521 for monthOfYear must be in the range [1,13]
	at org.joda.time.field.FieldUtils.verifyValueBounds(FieldUtils.java:252)
	at org.joda.time.chrono.BasicChronology.getDateMidnightMillis(BasicChronology.java:612)
	at org.joda.time.chrono.BasicChronology.getDateTimeMillis(BasicChronology.java:177)
	at org.joda.time.chrono.CopticChronology.getDateTimeMillis(CopticChronology.java:16)
	at org.joda.time.chrono.LimitChronology.getDateTimeMillis(LimitChronology.java:187)
	at org.joda.time.chrono.BasicChronology.getDateTimeMillis(BasicChronology.java:168)
	at org.joda.time.chrono.CopticChronology.getDateTimeMillis(CopticChronology.java:16)
	at org.joda.time.chrono.ZonedChronology.getDateTimeMillis(ZonedChronology.java:118)
	at org.joda.time.chrono.BasicChronology.getDateTimeMillis(BasicChronology.java:168)
	at org.joda.time.chrono.CopticChronology.getDateTimeMillis(CopticChronology.java:16)
	at org.joda.time.base.BaseDateTime.<init>(BaseDateTime.java:258)
	at org.joda.time.DateMidnight.<init>(DateMidnight.java:350)
	at org.joda.time.LocalDate.toDateMidnight(LocalDate.java:867)
	at org.joda.time.LocalDate.toDateMidnight(LocalDate.java:842)
	at org.joda.time.TestLocalDate_Basics.testToDateMidnight(TestLocalDate_Basics.java:906)

testToInterval(org.joda.time.TestLocalDate_Basics)  Time elapsed: 0 sec  <<< FAILURE!
junit.framework.AssertionFailedError: expected:<2005> but was:<320>
	at junit.framework.Assert.fail(Assert.java:47)
	at junit.framework.Assert.failNotEquals(Assert.java:280)
	at junit.framework.Assert.assertEquals(Assert.java:64)
	at junit.framework.Assert.assertEquals(Assert.java:198)
	at junit.framework.Assert.assertEquals(Assert.java:204)
	at org.joda.time.TestLocalDate_Basics.check(TestLocalDate_Basics.java:1155)
	at org.joda.time.TestLocalDate_Basics.testToInterval(TestLocalDate_Basics.java:962)

testEqualsHashCodeAPI(org.joda.time.TestLocalDate_Basics)  Time elapsed: 0 sec  <<< FAILURE!
junit.framework.AssertionFailedError: expected:<2011952710> but was:<6255260>
	at junit.framework.Assert.fail(Assert.java:47)
	at junit.framework.Assert.failNotEquals(Assert.java:280)
	at junit.framework.Assert.assertEquals(Assert.java:64)
	at junit.framework.Assert.assertEquals(Assert.java:198)
	at junit.framework.Assert.assertEquals(Assert.java:204)
	at org.joda.time.TestLocalDate_Basics.testEqualsHashCodeAPI(TestLocalDate_Basics.java:320)

testToDateTime_RI(org.joda.time.TestLocalDate_Basics)  Time elapsed: 0.001 sec  <<< ERROR!
org.joda.time.IllegalFieldValueException: Value 20521 for monthOfYear must be in the range [1,12]
	at org.joda.time.field.FieldUtils.verifyValueBounds(FieldUtils.java:234)
	at org.joda.time.chrono.BasicMonthOfYearDateTimeField.set(BasicMonthOfYearDateTimeField.java:299)
	at org.joda.time.chrono.ZonedChronology$ZonedDateTimeField.set(ZonedChronology.java:482)
	at org.joda.time.chrono.BaseChronology.set(BaseChronology.java:240)
	at org.joda.time.base.AbstractPartial.toDateTime(AbstractPartial.java:242)
	at org.joda.time.TestLocalDate_Basics.testToDateTime_RI(TestLocalDate_Basics.java:935)

testToDate_summer(org.joda.time.TestLocalDate_Basics)  Time elapsed: 0 sec  <<< FAILURE!
junit.framework.AssertionFailedError: expected:<2005> but was:<320>
	at junit.framework.Assert.fail(Assert.java:47)
	at junit.framework.Assert.failNotEquals(Assert.java:280)
	at junit.framework.Assert.assertEquals(Assert.java:64)
	at junit.framework.Assert.assertEquals(Assert.java:198)
	at junit.framework.Assert.assertEquals(Assert.java:204)
	at org.joda.time.TestLocalDate_Basics.check(TestLocalDate_Basics.java:1155)
	at org.joda.time.TestLocalDate_Basics.testToDate_summer(TestLocalDate_Basics.java:1006)

testToDate_winter(org.joda.time.TestLocalDate_Basics)  Time elapsed: 0.001 sec  <<< FAILURE!
junit.framework.AssertionFailedError: expected:<2005> but was:<320>
	at junit.framework.Assert.fail(Assert.java:47)
	at junit.framework.Assert.failNotEquals(Assert.java:280)
	at junit.framework.Assert.assertEquals(Assert.java:64)
	at junit.framework.Assert.assertEquals(Assert.java:198)
	at junit.framework.Assert.assertEquals(Assert.java:204)
	at org.joda.time.TestLocalDate_Basics.check(TestLocalDate_Basics.java:1155)
	at org.joda.time.TestLocalDate_Basics.testToDate_winter(TestLocalDate_Basics.java:1020)

testToDateMidnight_Zone(org.joda.time.TestLocalDate_Basics)  Time elapsed: 0.001 sec  <<< ERROR!
org.joda.time.IllegalFieldValueException: Value 20521 for monthOfYear must be in the range [1,13]
	at org.joda.time.field.FieldUtils.verifyValueBounds(FieldUtils.java:252)
	at org.joda.time.chrono.BasicChronology.getDateMidnightMillis(BasicChronology.java:612)
	at org.joda.time.chrono.BasicChronology.getDateTimeMillis(BasicChronology.java:177)
	at org.joda.time.chrono.CopticChronology.getDateTimeMillis(CopticChronology.java:16)
	at org.joda.time.chrono.LimitChronology.getDateTimeMillis(LimitChronology.java:187)
	at org.joda.time.chrono.BasicChronology.getDateTimeMillis(BasicChronology.java:168)
	at org.joda.time.chrono.CopticChronology.getDateTimeMillis(CopticChronology.java:16)
	at org.joda.time.chrono.ZonedChronology.getDateTimeMillis(ZonedChronology.java:118)
	at org.joda.time.chrono.BasicChronology.getDateTimeMillis(BasicChronology.java:168)
	at org.joda.time.chrono.CopticChronology.getDateTimeMillis(CopticChronology.java:16)
	at org.joda.time.base.BaseDateTime.<init>(BaseDateTime.java:258)
	at org.joda.time.DateMidnight.<init>(DateMidnight.java:350)
	at org.joda.time.LocalDate.toDateMidnight(LocalDate.java:867)
	at org.joda.time.TestLocalDate_Basics.testToDateMidnight_Zone(TestLocalDate_Basics.java:916)

testToDateMidnight_nullZone(org.joda.time.TestLocalDate_Basics)  Time elapsed: 0.001 sec  <<< ERROR!
org.joda.time.IllegalFieldValueException: Value 20521 for monthOfYear must be in the range [1,13]
	at org.joda.time.field.FieldUtils.verifyValueBounds(FieldUtils.java:252)
	at org.joda.time.chrono.BasicChronology.getDateMidnightMillis(BasicChronology.java:612)
	at org.joda.time.chrono.BasicChronology.getDateTimeMillis(BasicChronology.java:177)
	at org.joda.time.chrono.CopticChronology.getDateTimeMillis(CopticChronology.java:16)
	at org.joda.time.chrono.LimitChronology.getDateTimeMillis(LimitChronology.java:187)
	at org.joda.time.chrono.BasicChronology.getDateTimeMillis(BasicChronology.java:168)
	at org.joda.time.chrono.CopticChronology.getDateTimeMillis(CopticChronology.java:16)
	at org.joda.time.chrono.ZonedChronology.getDateTimeMillis(ZonedChronology.java:118)
	at org.joda.time.chrono.BasicChronology.getDateTimeMillis(BasicChronology.java:168)
	at org.joda.time.chrono.CopticChronology.getDateTimeMillis(CopticChronology.java:16)
	at org.joda.time.base.BaseDateTime.<init>(BaseDateTime.java:258)
	at org.joda.time.DateMidnight.<init>(DateMidnight.java:350)
	at org.joda.time.LocalDate.toDateMidnight(LocalDate.java:867)
	at org.joda.time.TestLocalDate_Basics.testToDateMidnight_nullZone(TestLocalDate_Basics.java:925)

testToInterval_Zone(org.joda.time.TestLocalDate_Basics)  Time elapsed: 0 sec  <<< FAILURE!
junit.framework.AssertionFailedError: expected:<2005> but was:<320>
	at junit.framework.Assert.fail(Assert.java:47)
	at junit.framework.Assert.failNotEquals(Assert.java:280)
	at junit.framework.Assert.assertEquals(Assert.java:64)
	at junit.framework.Assert.assertEquals(Assert.java:198)
	at junit.framework.Assert.assertEquals(Assert.java:204)
	at org.joda.time.TestLocalDate_Basics.check(TestLocalDate_Basics.java:1155)
	at org.joda.time.TestLocalDate_Basics.testToInterval_Zone(TestLocalDate_Basics.java:973)

testToInterval_nullZone(org.joda.time.TestLocalDate_Basics)  Time elapsed: 0.001 sec  <<< FAILURE!
junit.framework.AssertionFailedError: expected:<2005> but was:<320>
	at junit.framework.Assert.fail(Assert.java:47)
	at junit.framework.Assert.failNotEquals(Assert.java:280)
	at junit.framework.Assert.assertEquals(Assert.java:64)
	at junit.framework.Assert.assertEquals(Assert.java:198)
	at junit.framework.Assert.assertEquals(Assert.java:204)
	at org.joda.time.TestLocalDate_Basics.check(TestLocalDate_Basics.java:1155)
	at org.joda.time.TestLocalDate_Basics.testToInterval_nullZone(TestLocalDate_Basics.java:994)

testToDateTimeAtStartOfDay(org.joda.time.TestLocalDate_Basics)  Time elapsed: 0 sec  <<< FAILURE!
junit.framework.AssertionFailedError: expected:<2005> but was:<320>
	at junit.framework.Assert.fail(Assert.java:47)
	at junit.framework.Assert.failNotEquals(Assert.java:280)
	at junit.framework.Assert.assertEquals(Assert.java:64)
	at junit.framework.Assert.assertEquals(Assert.java:198)
	at junit.framework.Assert.assertEquals(Assert.java:204)
	at org.joda.time.TestLocalDate_Basics.check(TestLocalDate_Basics.java:1155)
	at org.joda.time.TestLocalDate_Basics.testToDateTimeAtStartOfDay(TestLocalDate_Basics.java:667)

testToDateTimeAtStartOfDay_Zone(org.joda.time.TestLocalDate_Basics)  Time elapsed: 0.001 sec  <<< FAILURE!
junit.framework.AssertionFailedError: expected:<2005> but was:<320>
	at junit.framework.Assert.fail(Assert.java:47)
	at junit.framework.Assert.failNotEquals(Assert.java:280)
	at junit.framework.Assert.assertEquals(Assert.java:64)
	at junit.framework.Assert.assertEquals(Assert.java:198)
	at junit.framework.Assert.assertEquals(Assert.java:204)
	at org.joda.time.TestLocalDate_Basics.check(TestLocalDate_Basics.java:1155)
	at org.joda.time.TestLocalDate_Basics.testToDateTimeAtStartOfDay_Zone(TestLocalDate_Basics.java:685)

testToDateTimeAtStartOfDay_nullZone(org.joda.time.TestLocalDate_Basics)  Time elapsed: 0.001 sec  <<< FAILURE!
junit.framework.AssertionFailedError: expected:<2005> but was:<320>
	at junit.framework.Assert.fail(Assert.java:47)
	at junit.framework.Assert.failNotEquals(Assert.java:280)
	at junit.framework.Assert.assertEquals(Assert.java:64)
	at junit.framework.Assert.assertEquals(Assert.java:198)
	at junit.framework.Assert.assertEquals(Assert.java:204)
	at org.joda.time.TestLocalDate_Basics.check(TestLocalDate_Basics.java:1155)
	at org.joda.time.TestLocalDate_Basics.testToDateTimeAtStartOfDay_nullZone(TestLocalDate_Basics.java:701)

testToDateTimeAtMidnight(org.joda.time.TestLocalDate_Basics)  Time elapsed: 0 sec  <<< ERROR!
org.joda.time.IllegalFieldValueException: Value 20521 for monthOfYear must be in the range [1,13]
	at org.joda.time.field.FieldUtils.verifyValueBounds(FieldUtils.java:252)
	at org.joda.time.chrono.BasicChronology.getDateMidnightMillis(BasicChronology.java:612)
	at org.joda.time.chrono.BasicChronology.getDateTimeMillis(BasicChronology.java:177)
	at org.joda.time.chrono.CopticChronology.getDateTimeMillis(CopticChronology.java:16)
	at org.joda.time.chrono.LimitChronology.getDateTimeMillis(LimitChronology.java:187)
	at org.joda.time.chrono.BasicChronology.getDateTimeMillis(BasicChronology.java:168)
	at org.joda.time.chrono.CopticChronology.getDateTimeMillis(CopticChronology.java:16)
	at org.joda.time.chrono.ZonedChronology.getDateTimeMillis(ZonedChronology.java:118)
	at org.joda.time.chrono.BasicChronology.getDateTimeMillis(BasicChronology.java:168)
	at org.joda.time.chrono.CopticChronology.getDateTimeMillis(CopticChronology.java:16)
	at org.joda.time.base.BaseDateTime.<init>(BaseDateTime.java:258)
	at org.joda.time.DateTime.<init>(DateTime.java:532)
	at org.joda.time.LocalDate.toDateTimeAtMidnight(LocalDate.java:778)
	at org.joda.time.LocalDate.toDateTimeAtMidnight(LocalDate.java:753)
	at org.joda.time.TestLocalDate_Basics.testToDateTimeAtMidnight(TestLocalDate_Basics.java:710)

testToDateTimeAtMidnight_Zone(org.joda.time.TestLocalDate_Basics)  Time elapsed: 0.001 sec  <<< ERROR!
org.joda.time.IllegalFieldValueException: Value 20521 for monthOfYear must be in the range [1,13]
	at org.joda.time.field.FieldUtils.verifyValueBounds(FieldUtils.java:252)
	at org.joda.time.chrono.BasicChronology.getDateMidnightMillis(BasicChronology.java:612)
	at org.joda.time.chrono.BasicChronology.getDateTimeMillis(BasicChronology.java:177)
	at org.joda.time.chrono.CopticChronology.getDateTimeMillis(CopticChronology.java:16)
	at org.joda.time.chrono.LimitChronology.getDateTimeMillis(LimitChronology.java:187)
	at org.joda.time.chrono.BasicChronology.getDateTimeMillis(BasicChronology.java:168)
	at org.joda.time.chrono.CopticChronology.getDateTimeMillis(CopticChronology.java:16)
	at org.joda.time.chrono.ZonedChronology.getDateTimeMillis(ZonedChronology.java:118)
	at org.joda.time.chrono.BasicChronology.getDateTimeMillis(BasicChronology.java:168)
	at org.joda.time.chrono.CopticChronology.getDateTimeMillis(CopticChronology.java:16)
	at org.joda.time.base.BaseDateTime.<init>(BaseDateTime.java:258)
	at org.joda.time.DateTime.<init>(DateTime.java:532)
	at org.joda.time.LocalDate.toDateTimeAtMidnight(LocalDate.java:778)
	at org.joda.time.TestLocalDate_Basics.testToDateTimeAtMidnight_Zone(TestLocalDate_Basics.java:720)

testToDateTimeAtMidnight_nullZone(org.joda.time.TestLocalDate_Basics)  Time elapsed: 0 sec  <<< ERROR!
org.joda.time.IllegalFieldValueException: Value 20521 for monthOfYear must be in the range [1,13]
	at org.joda.time.field.FieldUtils.verifyValueBounds(FieldUtils.java:252)
	at org.joda.time.chrono.BasicChronology.getDateMidnightMillis(BasicChronology.java:612)
	at org.joda.time.chrono.BasicChronology.getDateTimeMillis(BasicChronology.java:177)
	at org.joda.time.chrono.CopticChronology.getDateTimeMillis(CopticChronology.java:16)
	at org.joda.time.chrono.LimitChronology.getDateTimeMillis(LimitChronology.java:187)
	at org.joda.time.chrono.BasicChronology.getDateTimeMillis(BasicChronology.java:168)
	at org.joda.time.chrono.CopticChronology.getDateTimeMillis(CopticChronology.java:16)
	at org.joda.time.chrono.ZonedChronology.getDateTimeMillis(ZonedChronology.java:118)
	at org.joda.time.chrono.BasicChronology.getDateTimeMillis(BasicChronology.java:168)
	at org.joda.time.chrono.CopticChronology.getDateTimeMillis(CopticChronology.java:16)
	at org.joda.time.base.BaseDateTime.<init>(BaseDateTime.java:258)
	at org.joda.time.DateTime.<init>(DateTime.java:532)
	at org.joda.time.LocalDate.toDateTimeAtMidnight(LocalDate.java:778)
	at org.joda.time.TestLocalDate_Basics.testToDateTimeAtMidnight_nullZone(TestLocalDate_Basics.java:729)

testToDateTimeAtCurrentTime(org.joda.time.TestLocalDate_Basics)  Time elapsed: 0 sec  <<< ERROR!
org.joda.time.IllegalFieldValueException: Value 20521 for monthOfYear must be in the range [1,13]
	at org.joda.time.field.FieldUtils.verifyValueBounds(FieldUtils.java:234)
	at org.joda.time.chrono.BasicMonthOfYearDateTimeField.set(BasicMonthOfYearDateTimeField.java:299)
	at org.joda.time.chrono.LimitChronology$LimitDateTimeField.set(LimitChronology.java:511)
	at org.joda.time.chrono.ZonedChronology$ZonedDateTimeField.set(ZonedChronology.java:482)
	at org.joda.time.chrono.BaseChronology.set(BaseChronology.java:240)
	at org.joda.time.LocalDate.toDateTimeAtCurrentTime(LocalDate.java:818)
	at org.joda.time.LocalDate.toDateTimeAtCurrentTime(LocalDate.java:795)
	at org.joda.time.TestLocalDate_Basics.testToDateTimeAtCurrentTime(TestLocalDate_Basics.java:740)

testToDateTimeAtCurrentTime_Zone(org.joda.time.TestLocalDate_Basics)  Time elapsed: 0.001 sec  <<< ERROR!
org.joda.time.IllegalFieldValueException: Value 20521 for monthOfYear must be in the range [1,13]
	at org.joda.time.field.FieldUtils.verifyValueBounds(FieldUtils.java:234)
	at org.joda.time.chrono.BasicMonthOfYearDateTimeField.set(BasicMonthOfYearDateTimeField.java:299)
	at org.joda.time.chrono.LimitChronology$LimitDateTimeField.set(LimitChronology.java:511)
	at org.joda.time.chrono.ZonedChronology$ZonedDateTimeField.set(ZonedChronology.java:482)
	at org.joda.time.chrono.BaseChronology.set(BaseChronology.java:240)
	at org.joda.time.LocalDate.toDateTimeAtCurrentTime(LocalDate.java:818)
	at org.joda.time.TestLocalDate_Basics.testToDateTimeAtCurrentTime_Zone(TestLocalDate_Basics.java:755)

testToDateTimeAtCurrentTime_nullZone(org.joda.time.TestLocalDate_Basics)  Time elapsed: 0 sec  <<< ERROR!
org.joda.time.IllegalFieldValueException: Value 20521 for monthOfYear must be in the range [1,13]
	at org.joda.time.field.FieldUtils.verifyValueBounds(FieldUtils.java:234)
	at org.joda.time.chrono.BasicMonthOfYearDateTimeField.set(BasicMonthOfYearDateTimeField.java:299)
	at org.joda.time.chrono.LimitChronology$LimitDateTimeField.set(LimitChronology.java:511)
	at org.joda.time.chrono.ZonedChronology$ZonedDateTimeField.set(ZonedChronology.java:482)
	at org.joda.time.chrono.BaseChronology.set(BaseChronology.java:240)
	at org.joda.time.LocalDate.toDateTimeAtCurrentTime(LocalDate.java:818)
	at org.joda.time.TestLocalDate_Basics.testToDateTimeAtCurrentTime_nullZone(TestLocalDate_Basics.java:769)

testToLocalDateTime_LocalTime(org.joda.time.TestLocalDate_Basics)  Time elapsed: 0.001 sec  <<< FAILURE!
junit.framework.AssertionFailedError: expected:<2005> but was:<320>
	at junit.framework.Assert.fail(Assert.java:47)
	at junit.framework.Assert.failNotEquals(Assert.java:280)
	at junit.framework.Assert.assertEquals(Assert.java:64)
	at junit.framework.Assert.assertEquals(Assert.java:198)
	at junit.framework.Assert.assertEquals(Assert.java:204)
	at org.joda.time.TestLocalDate_Basics.check(TestLocalDate_Basics.java:1155)
	at org.joda.time.TestLocalDate_Basics.testToLocalDateTime_LocalTime(TestLocalDate_Basics.java:784)

testToDateTime_LocalTime(org.joda.time.TestLocalDate_Basics)  Time elapsed: 0.001 sec  <<< ERROR!
org.joda.time.IllegalFieldValueException: Value 20521 for monthOfYear must be in the range [1,13]
	at org.joda.time.field.FieldUtils.verifyValueBounds(FieldUtils.java:252)
	at org.joda.time.chrono.BasicChronology.getDateMidnightMillis(BasicChronology.java:612)
	at org.joda.time.chrono.BasicChronology.getDateTimeMillis(BasicChronology.java:177)
	at org.joda.time.chrono.CopticChronology.getDateTimeMillis(CopticChronology.java:16)
	at org.joda.time.chrono.LimitChronology.getDateTimeMillis(LimitChronology.java:187)
	at org.joda.time.chrono.BasicChronology.getDateTimeMillis(BasicChronology.java:168)
	at org.joda.time.chrono.CopticChronology.getDateTimeMillis(CopticChronology.java:16)
	at org.joda.time.chrono.ZonedChronology.getDateTimeMillis(ZonedChronology.java:118)
	at org.joda.time.chrono.BasicChronology.getDateTimeMillis(BasicChronology.java:168)
	at org.joda.time.chrono.CopticChronology.getDateTimeMillis(CopticChronology.java:16)
	at org.joda.time.base.BaseDateTime.<init>(BaseDateTime.java:258)
	at org.joda.time.DateTime.<init>(DateTime.java:532)
	at org.joda.time.LocalDate.toDateTime(LocalDate.java:958)
	at org.joda.time.LocalDate.toDateTime(LocalDate.java:923)
	at org.joda.time.TestLocalDate_Basics.testToDateTime_LocalTime(TestLocalDate_Basics.java:817)

testToDateTime_nullLocalTime(org.joda.time.TestLocalDate_Basics)  Time elapsed: 0 sec  <<< ERROR!
org.joda.time.IllegalFieldValueException: Value 20521 for monthOfYear must be in the range [1,13]
	at org.joda.time.field.FieldUtils.verifyValueBounds(FieldUtils.java:234)
	at org.joda.time.chrono.BasicMonthOfYearDateTimeField.set(BasicMonthOfYearDateTimeField.java:299)
	at org.joda.time.chrono.LimitChronology$LimitDateTimeField.set(LimitChronology.java:511)
	at org.joda.time.chrono.ZonedChronology$ZonedDateTimeField.set(ZonedChronology.java:482)
	at org.joda.time.chrono.BaseChronology.set(BaseChronology.java:240)
	at org.joda.time.LocalDate.toDateTimeAtCurrentTime(LocalDate.java:818)
	at org.joda.time.LocalDate.toDateTime(LocalDate.java:952)
	at org.joda.time.LocalDate.toDateTime(LocalDate.java:923)
	at org.joda.time.TestLocalDate_Basics.testToDateTime_nullLocalTime(TestLocalDate_Basics.java:828)

testToDateTime_LocalTime_Zone(org.joda.time.TestLocalDate_Basics)  Time elapsed: 0 sec  <<< ERROR!
org.joda.time.IllegalFieldValueException: Value 20521 for monthOfYear must be in the range [1,13]
	at org.joda.time.field.FieldUtils.verifyValueBounds(FieldUtils.java:252)
	at org.joda.time.chrono.BasicChronology.getDateMidnightMillis(BasicChronology.java:612)
	at org.joda.time.chrono.BasicChronology.getDateTimeMillis(BasicChronology.java:177)
	at org.joda.time.chrono.CopticChronology.getDateTimeMillis(CopticChronology.java:16)
	at org.joda.time.chrono.LimitChronology.getDateTimeMillis(LimitChronology.java:187)
	at org.joda.time.chrono.BasicChronology.getDateTimeMillis(BasicChronology.java:168)
	at org.joda.time.chrono.CopticChronology.getDateTimeMillis(CopticChronology.java:16)
	at org.joda.time.chrono.ZonedChronology.getDateTimeMillis(ZonedChronology.java:118)
	at org.joda.time.chrono.BasicChronology.getDateTimeMillis(BasicChronology.java:168)
	at org.joda.time.chrono.CopticChronology.getDateTimeMillis(CopticChronology.java:16)
	at org.joda.time.base.BaseDateTime.<init>(BaseDateTime.java:258)
	at org.joda.time.DateTime.<init>(DateTime.java:532)
	at org.joda.time.LocalDate.toDateTime(LocalDate.java:958)
	at org.joda.time.TestLocalDate_Basics.testToDateTime_LocalTime_Zone(TestLocalDate_Basics.java:839)

testToDateTime_LocalTime_nullZone(org.joda.time.TestLocalDate_Basics)  Time elapsed: 0.001 sec  <<< ERROR!
org.joda.time.IllegalFieldValueException: Value 20521 for monthOfYear must be in the range [1,13]
	at org.joda.time.field.FieldUtils.verifyValueBounds(FieldUtils.java:252)
	at org.joda.time.chrono.BasicChronology.getDateMidnightMillis(BasicChronology.java:612)
	at org.joda.time.chrono.BasicChronology.getDateTimeMillis(BasicChronology.java:177)
	at org.joda.time.chrono.CopticChronology.getDateTimeMillis(CopticChronology.java:16)
	at org.joda.time.chrono.LimitChronology.getDateTimeMillis(LimitChronology.java:187)
	at org.joda.time.chrono.BasicChronology.getDateTimeMillis(BasicChronology.java:168)
	at org.joda.time.chrono.CopticChronology.getDateTimeMillis(CopticChronology.java:16)
	at org.joda.time.chrono.ZonedChronology.getDateTimeMillis(ZonedChronology.java:118)
	at org.joda.time.chrono.BasicChronology.getDateTimeMillis(BasicChronology.java:168)
	at org.joda.time.chrono.CopticChronology.getDateTimeMillis(CopticChronology.java:16)
	at org.joda.time.base.BaseDateTime.<init>(BaseDateTime.java:258)
	at org.joda.time.DateTime.<init>(DateTime.java:532)
	at org.joda.time.LocalDate.toDateTime(LocalDate.java:958)
	at org.joda.time.TestLocalDate_Basics.testToDateTime_LocalTime_nullZone(TestLocalDate_Basics.java:849)

testToDateTime_nullLocalTime_Zone(org.joda.time.TestLocalDate_Basics)  Time elapsed: 0 sec  <<< ERROR!
org.joda.time.IllegalFieldValueException: Value 20521 for monthOfYear must be in the range [1,13]
	at org.joda.time.field.FieldUtils.verifyValueBounds(FieldUtils.java:234)
	at org.joda.time.chrono.BasicMonthOfYearDateTimeField.set(BasicMonthOfYearDateTimeField.java:299)
	at org.joda.time.chrono.LimitChronology$LimitDateTimeField.set(LimitChronology.java:511)
	at org.joda.time.chrono.ZonedChronology$ZonedDateTimeField.set(ZonedChronology.java:482)
	at org.joda.time.chrono.BaseChronology.set(BaseChronology.java:240)
	at org.joda.time.LocalDate.toDateTimeAtCurrentTime(LocalDate.java:818)
	at org.joda.time.LocalDate.toDateTime(LocalDate.java:952)
	at org.joda.time.TestLocalDate_Basics.testToDateTime_nullLocalTime_Zone(TestLocalDate_Basics.java:860)

testConstructor_long_long_PeriodType_Chronology1(org.joda.time.TestPeriod_Constructors)  Time elapsed: 0 sec  <<< FAILURE!
junit.framework.AssertionFailedError: expected:<0> but was:<5579>
	at junit.framework.Assert.fail(Assert.java:47)
	at junit.framework.Assert.failNotEquals(Assert.java:280)
	at junit.framework.Assert.assertEquals(Assert.java:64)
	at junit.framework.Assert.assertEquals(Assert.java:198)
	at junit.framework.Assert.assertEquals(Assert.java:204)
	at org.joda.time.TestPeriod_Constructors.testConstructor_long_long_PeriodType_Chronology1(TestPeriod_Constructors.java:593)

testConstructor_long_long_Chronology1(org.joda.time.TestPeriod_Constructors)  Time elapsed: 0.001 sec  <<< FAILURE!
junit.framework.AssertionFailedError: expected:<0> but was:<5579>
	at junit.framework.Assert.fail(Assert.java:47)
	at junit.framework.Assert.failNotEquals(Assert.java:280)
	at junit.framework.Assert.assertEquals(Assert.java:64)
	at junit.framework.Assert.assertEquals(Assert.java:198)
	at junit.framework.Assert.assertEquals(Assert.java:204)
	at org.joda.time.TestPeriod_Constructors.testConstructor_long_long_Chronology1(TestPeriod_Constructors.java:562)

testConstructor_long_long_PeriodType_Chronology1(org.joda.time.TestMutablePeriod_Constructors)  Time elapsed: 0.006 sec  <<< FAILURE!
junit.framework.AssertionFailedError: expected:<0> but was:<5579>
	at junit.framework.Assert.fail(Assert.java:47)
	at junit.framework.Assert.failNotEquals(Assert.java:280)
	at junit.framework.Assert.assertEquals(Assert.java:64)
	at junit.framework.Assert.assertEquals(Assert.java:198)
	at junit.framework.Assert.assertEquals(Assert.java:204)
	at org.joda.time.TestMutablePeriod_Constructors.testConstructor_long_long_PeriodType_Chronology1(TestMutablePeriod_Constructors.java:583)

testConstructor_long_long_Chronology1(org.joda.time.TestMutablePeriod_Constructors)  Time elapsed: 0 sec  <<< FAILURE!
junit.framework.AssertionFailedError: expected:<0> but was:<5579>
	at junit.framework.Assert.fail(Assert.java:47)
	at junit.framework.Assert.failNotEquals(Assert.java:280)
	at junit.framework.Assert.assertEquals(Assert.java:64)
	at junit.framework.Assert.assertEquals(Assert.java:198)
	at junit.framework.Assert.assertEquals(Assert.java:204)
	at org.joda.time.TestMutablePeriod_Constructors.testConstructor_long_long_Chronology1(TestMutablePeriod_Constructors.java:552)

testToInterval(org.joda.time.TestYearMonthDay_Basics)  Time elapsed: 0.001 sec  <<< ERROR!
org.joda.time.IllegalFieldValueException: Value 6 for monthOfYear is not supported: Illegal instant due to time zone offset transition (daylight savings time 'gap'): 2289-03-08T01:00:00.000 (Europe/London)
	at org.joda.time.chrono.ZonedChronology$ZonedDateTimeField.set(ZonedChronology.java:486)
	at org.joda.time.chrono.BaseChronology.set(BaseChronology.java:240)
	at org.joda.time.YearMonthDay.toDateTime(YearMonthDay.java:772)
	at org.joda.time.YearMonthDay.toDateTime(YearMonthDay.java:753)
	at org.joda.time.TestYearMonthDay_Basics.testToInterval(TestYearMonthDay_Basics.java:716)
Caused by: org.joda.time.IllegalInstantException: Illegal instant due to time zone offset transition (daylight savings time 'gap'): 2289-03-08T01:00:00.000 (Europe/London)
	at org.joda.time.chrono.ZonedChronology$ZonedDateTimeField.set(ZonedChronology.java:485)
	... 30 more

testToDateTime_TOD(org.joda.time.TestYearMonthDay_Basics)  Time elapsed: 0.001 sec  <<< ERROR!
org.joda.time.IllegalFieldValueException: Value 6 for monthOfYear is not supported: Illegal instant due to time zone offset transition (daylight savings time 'gap'): 2289-03-08T01:00:00.000 (Europe/London)
	at org.joda.time.chrono.ZonedChronology$ZonedDateTimeField.set(ZonedChronology.java:486)
	at org.joda.time.chrono.BaseChronology.set(BaseChronology.java:240)
	at org.joda.time.YearMonthDay.toDateTime(YearMonthDay.java:772)
	at org.joda.time.YearMonthDay.toDateTime(YearMonthDay.java:753)
	at org.joda.time.TestYearMonthDay_Basics.testToDateTime_TOD(TestYearMonthDay_Basics.java:608)
Caused by: org.joda.time.IllegalInstantException: Illegal instant due to time zone offset transition (daylight savings time 'gap'): 2289-03-08T01:00:00.000 (Europe/London)
	at org.joda.time.chrono.ZonedChronology$ZonedDateTimeField.set(ZonedChronology.java:485)
	... 30 more

testToDateTime_nullTOD(org.joda.time.TestYearMonthDay_Basics)  Time elapsed: 0 sec  <<< ERROR!
org.joda.time.IllegalFieldValueException: Value 6 for monthOfYear is not supported: Illegal instant due to time zone offset transition (daylight savings time 'gap'): 2289-02-13T12:13:14.015 (Europe/London)
	at org.joda.time.chrono.ZonedChronology$ZonedDateTimeField.set(ZonedChronology.java:486)
	at org.joda.time.chrono.BaseChronology.set(BaseChronology.java:240)
	at org.joda.time.YearMonthDay.toDateTime(YearMonthDay.java:772)
	at org.joda.time.YearMonthDay.toDateTime(YearMonthDay.java:753)
	at org.joda.time.TestYearMonthDay_Basics.testToDateTime_nullTOD(TestYearMonthDay_Basics.java:619)
Caused by: org.joda.time.IllegalInstantException: Illegal instant due to time zone offset transition (daylight savings time 'gap'): 2289-02-13T12:13:14.015 (Europe/London)
	at org.joda.time.chrono.ZonedChronology$ZonedDateTimeField.set(ZonedChronology.java:485)
	... 30 more

testToDateTime_TOD_Zone(org.joda.time.TestYearMonthDay_Basics)  Time elapsed: 0 sec  <<< ERROR!
org.joda.time.IllegalFieldValueException: Value 6 for monthOfYear is not supported: Illegal instant due to time zone offset transition (daylight savings time 'gap'): 2289-03-08T09:00:00.000 (Asia/Tokyo)
	at org.joda.time.chrono.ZonedChronology$ZonedDateTimeField.set(ZonedChronology.java:486)
	at org.joda.time.chrono.BaseChronology.set(BaseChronology.java:240)
	at org.joda.time.YearMonthDay.toDateTime(YearMonthDay.java:772)
	at org.joda.time.TestYearMonthDay_Basics.testToDateTime_TOD_Zone(TestYearMonthDay_Basics.java:630)
Caused by: org.joda.time.IllegalInstantException: Illegal instant due to time zone offset transition (daylight savings time 'gap'): 2289-03-08T09:00:00.000 (Asia/Tokyo)
	at org.joda.time.chrono.ZonedChronology$ZonedDateTimeField.set(ZonedChronology.java:485)
	... 29 more

testToDateTime_TOD_nullZone(org.joda.time.TestYearMonthDay_Basics)  Time elapsed: 0.001 sec  <<< ERROR!
org.joda.time.IllegalFieldValueException: Value 6 for monthOfYear is not supported: Illegal instant due to time zone offset transition (daylight savings time 'gap'): 2289-03-08T01:00:00.000 (Europe/London)
	at org.joda.time.chrono.ZonedChronology$ZonedDateTimeField.set(ZonedChronology.java:486)
	at org.joda.time.chrono.BaseChronology.set(BaseChronology.java:240)
	at org.joda.time.YearMonthDay.toDateTime(YearMonthDay.java:772)
	at org.joda.time.TestYearMonthDay_Basics.testToDateTime_TOD_nullZone(TestYearMonthDay_Basics.java:640)
Caused by: org.joda.time.IllegalInstantException: Illegal instant due to time zone offset transition (daylight savings time 'gap'): 2289-03-08T01:00:00.000 (Europe/London)
	at org.joda.time.chrono.ZonedChronology$ZonedDateTimeField.set(ZonedChronology.java:485)
	... 29 more

testToDateTime_nullTOD_Zone(org.joda.time.TestYearMonthDay_Basics)  Time elapsed: 0 sec  <<< ERROR!
org.joda.time.IllegalFieldValueException: Value 6 for monthOfYear is not supported: Illegal instant due to time zone offset transition (daylight savings time 'gap'): 2289-02-13T12:13:14.015 (Asia/Tokyo)
	at org.joda.time.chrono.ZonedChronology$ZonedDateTimeField.set(ZonedChronology.java:486)
	at org.joda.time.chrono.BaseChronology.set(BaseChronology.java:240)
	at org.joda.time.YearMonthDay.toDateTime(YearMonthDay.java:772)
	at org.joda.time.TestYearMonthDay_Basics.testToDateTime_nullTOD_Zone(TestYearMonthDay_Basics.java:651)
Caused by: org.joda.time.IllegalInstantException: Illegal instant due to time zone offset transition (daylight savings time 'gap'): 2289-02-13T12:13:14.015 (Asia/Tokyo)
	at org.joda.time.chrono.ZonedChronology$ZonedDateTimeField.set(ZonedChronology.java:485)
	... 29 more

testToInterval_Zone(org.joda.time.TestYearMonthDay_Basics)  Time elapsed: 0 sec  <<< ERROR!
org.joda.time.IllegalFieldValueException: Value 6 for monthOfYear is not supported: Illegal instant due to time zone offset transition (daylight savings time 'gap'): 2289-03-08T09:00:00.000 (Asia/Tokyo)
	at org.joda.time.chrono.ZonedChronology$ZonedDateTimeField.set(ZonedChronology.java:486)
	at org.joda.time.chrono.BaseChronology.set(BaseChronology.java:240)
	at org.joda.time.YearMonthDay.toDateTime(YearMonthDay.java:772)
	at org.joda.time.TestYearMonthDay_Basics.testToInterval_Zone(TestYearMonthDay_Basics.java:727)
Caused by: org.joda.time.IllegalInstantException: Illegal instant due to time zone offset transition (daylight savings time 'gap'): 2289-03-08T09:00:00.000 (Asia/Tokyo)
	at org.joda.time.chrono.ZonedChronology$ZonedDateTimeField.set(ZonedChronology.java:485)
	... 29 more

testToInterval_nullZone(org.joda.time.TestYearMonthDay_Basics)  Time elapsed: 0.001 sec  <<< ERROR!
org.joda.time.IllegalFieldValueException: Value 6 for monthOfYear is not supported: Illegal instant due to time zone offset transition (daylight savings time 'gap'): 2289-03-08T01:00:00.000 (Europe/London)
	at org.joda.time.chrono.ZonedChronology$ZonedDateTimeField.set(ZonedChronology.java:486)
	at org.joda.time.chrono.BaseChronology.set(BaseChronology.java:240)
	at org.joda.time.YearMonthDay.toDateTime(YearMonthDay.java:772)
	at org.joda.time.TestYearMonthDay_Basics.testToInterval_nullZone(TestYearMonthDay_Basics.java:737)
Caused by: org.joda.time.IllegalInstantException: Illegal instant due to time zone offset transition (daylight savings time 'gap'): 2289-03-08T01:00:00.000 (Europe/London)
	at org.joda.time.chrono.ZonedChronology$ZonedDateTimeField.set(ZonedChronology.java:485)
	... 29 more

testToDateTimeAtCurrentTime(org.joda.time.TestYearMonthDay_Basics)  Time elapsed: 0.001 sec  <<< ERROR!
org.joda.time.IllegalFieldValueException: Value 6 for monthOfYear is not supported: Illegal instant due to time zone offset transition (daylight savings time 'gap'): 2289-03-09T06:07:08.009 (Europe/London)
	at org.joda.time.chrono.ZonedChronology$ZonedDateTimeField.set(ZonedChronology.java:486)
	at org.joda.time.chrono.BaseChronology.set(BaseChronology.java:240)
	at org.joda.time.YearMonthDay.toDateTimeAtCurrentTime(YearMonthDay.java:714)
	at org.joda.time.YearMonthDay.toDateTimeAtCurrentTime(YearMonthDay.java:697)
	at org.joda.time.TestYearMonthDay_Basics.testToDateTimeAtCurrentTime(TestYearMonthDay_Basics.java:565)
Caused by: org.joda.time.IllegalInstantException: Illegal instant due to time zone offset transition (daylight savings time 'gap'): 2289-03-09T06:07:08.009 (Europe/London)
	at org.joda.time.chrono.ZonedChronology$ZonedDateTimeField.set(ZonedChronology.java:485)
	... 30 more

testToDateTimeAtCurrentTime_Zone(org.joda.time.TestYearMonthDay_Basics)  Time elapsed: 0.001 sec  <<< ERROR!
org.joda.time.IllegalFieldValueException: Value 6 for monthOfYear is not supported: Illegal instant due to time zone offset transition (daylight savings time 'gap'): 2289-03-09T14:07:08.009 (Asia/Tokyo)
	at org.joda.time.chrono.ZonedChronology$ZonedDateTimeField.set(ZonedChronology.java:486)
	at org.joda.time.chrono.BaseChronology.set(BaseChronology.java:240)
	at org.joda.time.YearMonthDay.toDateTimeAtCurrentTime(YearMonthDay.java:714)
	at org.joda.time.TestYearMonthDay_Basics.testToDateTimeAtCurrentTime_Zone(TestYearMonthDay_Basics.java:580)
Caused by: org.joda.time.IllegalInstantException: Illegal instant due to time zone offset transition (daylight savings time 'gap'): 2289-03-09T14:07:08.009 (Asia/Tokyo)
	at org.joda.time.chrono.ZonedChronology$ZonedDateTimeField.set(ZonedChronology.java:485)
	... 29 more

testToDateTimeAtCurrentTime_nullZone(org.joda.time.TestYearMonthDay_Basics)  Time elapsed: 0 sec  <<< ERROR!
org.joda.time.IllegalFieldValueException: Value 6 for monthOfYear is not supported: Illegal instant due to time zone offset transition (daylight savings time 'gap'): 2289-03-09T06:07:08.009 (Europe/London)
	at org.joda.time.chrono.ZonedChronology$ZonedDateTimeField.set(ZonedChronology.java:486)
	at org.joda.time.chrono.BaseChronology.set(BaseChronology.java:240)
	at org.joda.time.YearMonthDay.toDateTimeAtCurrentTime(YearMonthDay.java:714)
	at org.joda.time.TestYearMonthDay_Basics.testToDateTimeAtCurrentTime_nullZone(TestYearMonthDay_Basics.java:594)
Caused by: org.joda.time.IllegalInstantException: Illegal instant due to time zone offset transition (daylight savings time 'gap'): 2289-03-09T06:07:08.009 (Europe/London)
	at org.joda.time.chrono.ZonedChronology$ZonedDateTimeField.set(ZonedChronology.java:485)
	... 29 more

testLeap_6_13(org.joda.time.chrono.TestCopticChronology)  Time elapsed: 0.001 sec  <<< FAILURE!
junit.framework.AssertionFailedError: expected:<true> but was:<false>
	at junit.framework.Assert.fail(Assert.java:47)
	at junit.framework.Assert.failNotEquals(Assert.java:280)
	at junit.framework.Assert.assertEquals(Assert.java:64)
	at junit.framework.Assert.assertEquals(Assert.java:146)
	at junit.framework.Assert.assertEquals(Assert.java:152)
	at org.joda.time.chrono.TestCopticChronology.testLeap_6_13(TestCopticChronology.java:591)

testCalendar(org.joda.time.chrono.TestCopticChronology)  Time elapsed: 0.001 sec  <<< FAILURE!
junit.framework.AssertionFailedError: Bad month: -53184211200000
	at junit.framework.Assert.fail(Assert.java:47)
	at org.joda.time.chrono.TestCopticChronology.testCalendar(TestCopticChronology.java:345)

testSampleDate(org.joda.time.chrono.TestCopticChronology)  Time elapsed: 0 sec  <<< FAILURE!
junit.framework.AssertionFailedError: expected:<18> but was:<1>
	at junit.framework.Assert.fail(Assert.java:47)
	at junit.framework.Assert.failNotEquals(Assert.java:280)
	at junit.framework.Assert.assertEquals(Assert.java:64)
	at junit.framework.Assert.assertEquals(Assert.java:198)
	at junit.framework.Assert.assertEquals(Assert.java:204)
	at org.joda.time.chrono.TestCopticChronology.testSampleDate(TestCopticChronology.java:403)

testSampleDateWithZone(org.joda.time.chrono.TestCopticChronology)  Time elapsed: 0 sec  <<< FAILURE!
junit.framework.AssertionFailedError: expected:<1720> but was:<35>
	at junit.framework.Assert.fail(Assert.java:47)
	at junit.framework.Assert.failNotEquals(Assert.java:280)
	at junit.framework.Assert.assertEquals(Assert.java:64)
	at junit.framework.Assert.assertEquals(Assert.java:198)
	at junit.framework.Assert.assertEquals(Assert.java:204)
	at org.joda.time.chrono.TestCopticChronology.testSampleDateWithZone(TestCopticChronology.java:468)

testDurationYear(org.joda.time.chrono.TestCopticChronology)  Time elapsed: 0 sec  <<< FAILURE!
junit.framework.AssertionFailedError: expected:<1> but was:<0>
	at junit.framework.Assert.fail(Assert.java:47)
	at junit.framework.Assert.failNotEquals(Assert.java:280)
	at junit.framework.Assert.assertEquals(Assert.java:64)
	at junit.framework.Assert.assertEquals(Assert.java:198)
	at junit.framework.Assert.assertEquals(Assert.java:204)
	at org.joda.time.chrono.TestCopticChronology.testDurationYear(TestCopticChronology.java:507)

testDurationMonth(org.joda.time.chrono.TestCopticChronology)  Time elapsed: 0 sec  <<< FAILURE!
junit.framework.AssertionFailedError: expected:<2592000000> but was:<-3371760000000>
	at junit.framework.Assert.fail(Assert.java:47)
	at junit.framework.Assert.failNotEquals(Assert.java:280)
	at junit.framework.Assert.assertEquals(Assert.java:64)
	at junit.framework.Assert.assertEquals(Assert.java:133)
	at junit.framework.Assert.assertEquals(Assert.java:139)
	at org.joda.time.chrono.TestCopticChronology.testDurationMonth(TestCopticChronology.java:539)

testLeap_5_13(org.joda.time.chrono.TestCopticChronology)  Time elapsed: 0.001 sec  <<< FAILURE!
junit.framework.AssertionFailedError: expected:<true> but was:<false>
	at junit.framework.Assert.fail(Assert.java:47)
	at junit.framework.Assert.failNotEquals(Assert.java:280)
	at junit.framework.Assert.assertEquals(Assert.java:64)
	at junit.framework.Assert.assertEquals(Assert.java:146)
	at junit.framework.Assert.assertEquals(Assert.java:152)
	at org.joda.time.chrono.TestCopticChronology.testLeap_5_13(TestCopticChronology.java:582)


Results :

Failed tests: 
  org.joda.time.TestLocalDateTime_Basics#testEqualsHashCode AssertionFailedError
  org.joda.time.TestLocalDateTime_Basics#testToDate_summer AssertionFailedError ...
  org.joda.time.TestLocalDateTime_Basics#testToDate_summer_Zone AssertionFailedError
  org.joda.time.TestLocalDateTime_Basics#testToDate_winter AssertionFailedError ...
  org.joda.time.TestLocalDateTime_Basics#testToDate_winter_Zone AssertionFailedError
  org.joda.time.TestLocalDate_Basics#testEqualsHashCode AssertionFailedError exp...
  org.joda.time.TestLocalDate_Basics#testEqualsHashCodeAPI AssertionFailedError ...
  org.joda.time.TestLocalDate_Basics#testToDateTimeAtStartOfDay AssertionFailedError
  org.joda.time.TestLocalDate_Basics#testToDateTimeAtStartOfDay_Zone AssertionFailedError
  org.joda.time.TestLocalDate_Basics#testToDateTimeAtStartOfDay_nullZone AssertionFailedError
  org.joda.time.TestLocalDate_Basics#testToDate_summer AssertionFailedError expe...
  org.joda.time.TestLocalDate_Basics#testToDate_winter AssertionFailedError expe...
  org.joda.time.TestLocalDate_Basics#testToInterval AssertionFailedError expecte...
  org.joda.time.TestLocalDate_Basics#testToInterval_Zone AssertionFailedError ex...
  org.joda.time.TestLocalDate_Basics#testToInterval_nullZone AssertionFailedError
  org.joda.time.TestLocalDate_Basics#testToLocalDateTime_LocalTime AssertionFailedError
  org.joda.time.TestMutablePeriod_Constructors#testConstructor_long_long_Chronology1 AssertionFailedError
  org.joda.time.TestMutablePeriod_Constructors#testConstructor_long_long_PeriodType_Chronology1 AssertionFailedError
  org.joda.time.TestPeriod_Constructors#testConstructor_long_long_Chronology1 AssertionFailedError
  org.joda.time.TestPeriod_Constructors#testConstructor_long_long_PeriodType_Chronology1 AssertionFailedError
  org.joda.time.chrono.TestCopticChronology#testCalendar AssertionFailedError Ba...
  org.joda.time.chrono.TestCopticChronology#testDurationMonth AssertionFailedError
  org.joda.time.chrono.TestCopticChronology#testDurationYear AssertionFailedError
  org.joda.time.chrono.TestCopticChronology#testLeap_5_13 AssertionFailedError e...
  org.joda.time.chrono.TestCopticChronology#testLeap_6_13 AssertionFailedError e...
  org.joda.time.chrono.TestCopticChronology#testSampleDate AssertionFailedError ...
  org.joda.time.chrono.TestCopticChronology#testSampleDateWithZone AssertionFailedError
Tests in error: 
  org.joda.time.TestInterval_Basics#testWithPeriodAfterStart1 IllegalArgumentException
  org.joda.time.TestInterval_Constructors#testConstructor_RI_RP3 IllegalArgumentException
  org.joda.time.TestLocalDateTime_Basics#testToDateTime IllegalFieldValueException
  org.joda.time.TestLocalDateTime_Basics#testToDateTime_RI IllegalFieldValueException
  org.joda.time.TestLocalDateTime_Basics#testToDateTime_Zone IllegalFieldValueException
  org.joda.time.TestLocalDateTime_Basics#testToDateTime_nullRI IllegalFieldValueException
  org.joda.time.TestLocalDateTime_Basics#testToDateTime_nullZone IllegalFieldValueException
  org.joda.time.TestLocalDate_Basics#testToDateMidnight IllegalFieldValueException
  org.joda.time.TestLocalDate_Basics#testToDateMidnight_Zone IllegalFieldValueException
  org.joda.time.TestLocalDate_Basics#testToDateMidnight_nullZone IllegalFieldValueException
  org.joda.time.TestLocalDate_Basics#testToDateTimeAtCurrentTime IllegalFieldValueException
  org.joda.time.TestLocalDate_Basics#testToDateTimeAtCurrentTime_Zone IllegalFieldValueException
  org.joda.time.TestLocalDate_Basics#testToDateTimeAtCurrentTime_nullZone IllegalFieldValueException
  org.joda.time.TestLocalDate_Basics#testToDateTimeAtMidnight IllegalFieldValueException
  org.joda.time.TestLocalDate_Basics#testToDateTimeAtMidnight_Zone IllegalFieldValueException
  org.joda.time.TestLocalDate_Basics#testToDateTimeAtMidnight_nullZone IllegalFieldValueException
  org.joda.time.TestLocalDate_Basics#testToDateTime_LocalTime IllegalFieldValueException
  org.joda.time.TestLocalDate_Basics#testToDateTime_LocalTime_Zone IllegalFieldValueException
  org.joda.time.TestLocalDate_Basics#testToDateTime_LocalTime_nullZone IllegalFieldValueException
  org.joda.time.TestLocalDate_Basics#testToDateTime_RI IllegalFieldValueException
  org.joda.time.TestLocalDate_Basics#testToDateTime_nullLocalTime IllegalFieldValueException
  org.joda.time.TestLocalDate_Basics#testToDateTime_nullLocalTime_Zone IllegalFieldValueException
  org.joda.time.TestYearMonthDay_Basics#testToDateTimeAtCurrentTime IllegalFieldValueException
  org.joda.time.TestYearMonthDay_Basics#testToDateTimeAtCurrentTime_Zone IllegalFieldValueException
  org.joda.time.TestYearMonthDay_Basics#testToDateTimeAtCurrentTime_nullZone IllegalFieldValueException
  org.joda.time.TestYearMonthDay_Basics#testToDateTime_TOD IllegalFieldValueException
  org.joda.time.TestYearMonthDay_Basics#testToDateTime_TOD_Zone IllegalFieldValueException
  org.joda.time.TestYearMonthDay_Basics#testToDateTime_TOD_nullZone IllegalFieldValueException
  org.joda.time.TestYearMonthDay_Basics#testToDateTime_nullTOD IllegalFieldValueException
  org.joda.time.TestYearMonthDay_Basics#testToDateTime_nullTOD_Zone IllegalFieldValueException
  org.joda.time.TestYearMonthDay_Basics#testToInterval IllegalFieldValueException
  org.joda.time.TestYearMonthDay_Basics#testToInterval_Zone IllegalFieldValueException
  org.joda.time.TestYearMonthDay_Basics#testToInterval_nullZone IllegalFieldValueException

Tests run: 4157, Failures: 27, Errors: 33, Skipped: 0

[INFO] ------------------------------------------------------------------------
[INFO] BUILD FAILURE
[INFO] ------------------------------------------------------------------------
[INFO] Total time: 16.442s
[INFO] Finished at: Wed Aug 05 23:54:19 BST 2015
[INFO] Final Memory: 8M/211M
[INFO] ------------------------------------------------------------------------
[ERROR] Failed to execute goal org.apache.maven.plugins:maven-surefire-plugin:2.18.1:test (default-test) on project joda-time: There are test failures.
[ERROR] 
[ERROR] Please refer to /home/perham/Study/LittleDarwin/Cases/joda-time-2.8.1/target/surefire-reports for the individual test results.
[ERROR] -> [Help 1]
[ERROR] 
[ERROR] To see the full stack trace of the errors, re-run Maven with the -e switch.
[ERROR] Re-run Maven using the -X switch to enable full debug logging.
[ERROR] 
[ERROR] For more information about the errors and possible solutions, please read the following articles:
[ERROR] [Help 1] http://cwiki.apache.org/confluence/display/MAVEN/MojoFailureException
