[INFO] Scanning for projects...
[INFO]                                                                         
[INFO] ------------------------------------------------------------------------
[INFO] Building Joda-Time 2.8.1
[INFO] ------------------------------------------------------------------------
[INFO] 
[INFO] --- maven-resources-plugin:2.7:resources (default-resources) @ joda-time ---
[INFO] Using 'UTF-8' encoding to copy filtered resources.
[INFO] Copying 2 resources to META-INF
[INFO] Copying 10 resources
[INFO] 
[INFO] --- maven-compiler-plugin:3.3:compile (default-compile) @ joda-time ---
[INFO] Changes detected - recompiling the module!
[INFO] Compiling 166 source files to /home/perham/Study/LittleDarwin/Cases/joda-time-2.8.1/target/classes
[INFO] 
[INFO] --- exec-maven-plugin:1.4.0:java (compile-tzdb) @ joda-time ---
Writing zoneinfo files
Writing ZoneInfoMap
[INFO] 
[INFO] --- maven-resources-plugin:2.7:testResources (default-testResources) @ joda-time ---
[INFO] Using 'UTF-8' encoding to copy filtered resources.
[INFO] Copying 34 resources
[INFO] 
[INFO] --- maven-compiler-plugin:3.3:testCompile (default-testCompile) @ joda-time ---
[INFO] Nothing to compile - all classes are up to date
[INFO] 
[INFO] --- maven-surefire-plugin:2.18.1:test (default-test) @ joda-time ---
[INFO] Surefire report directory: /home/perham/Study/LittleDarwin/Cases/joda-time-2.8.1/target/surefire-reports

-------------------------------------------------------
 T E S T S
-------------------------------------------------------
Running org.joda.time.TestAllPackages

TestBuddhistChronology.testCalendar

TestCopticChronology.testCalendar

TestEthiopicChronology.testCalendar

TestIslamicChronology.testCalendar

Testing Gregorian chronology over 1000 iterations
100% complete (i=1000)

Testing Julian chronology over 1000 iterations
100% complete (i=1000)
Writing zoneinfo files
Writing ZoneInfoMap
Tests run: 4157, Failures: 41, Errors: 64, Skipped: 0, Time elapsed: 5.573 sec <<< FAILURE! - in org.joda.time.TestAllPackages
testPropertyEqualsHashCodeLenient(org.joda.time.TestDateTime_Properties)  Time elapsed: 0.005 sec  <<< ERROR!
IllegalArgumentException: The instant is below the supported minimum of 1686-01-01T00:00:00.���Z (CopticChronology[UTC])
	at org.joda.time.chrono.LimitChronology.checkLimits(LimitChronology.java:286)
	at org.joda.time.chrono.LimitChronology$LimitDateTimeField.get(LimitChronology.java:462)
	at org.joda.time.chrono.ZonedChronology$ZonedDateTimeField.get(ZonedChronology.java:423)
	at org.joda.time.field.DelegatedDateTimeField.get(DelegatedDateTimeField.java:110)
	at org.joda.time.field.LenientDateTimeField.set(LenientDateTimeField.java:73)
	at org.joda.time.chrono.BaseChronology.getDateTimeMillis(BaseChronology.java:132)
	at org.joda.time.chrono.AssembledChronology.getDateTimeMillis(AssembledChronology.java:136)
	at org.joda.time.base.BaseDateTime.<init>(BaseDateTime.java:258)
	at org.joda.time.DateTime.<init>(DateTime.java:532)
	at org.joda.time.TestDateTime_Properties.testPropertyEqualsHashCodeLenient(TestDateTime_Properties.java:1374)

testPropertyEqualsHashCodeLenient(org.joda.time.TestDateMidnight_Properties)  Time elapsed: 0.003 sec  <<< ERROR!
IllegalArgumentException: The instant is below the supported minimum of 1686-01-01T00:00:00.���Z (CopticChronology[UTC])
	at org.joda.time.chrono.LimitChronology.checkLimits(LimitChronology.java:286)
	at org.joda.time.chrono.LimitChronology$LimitDateTimeField.get(LimitChronology.java:462)
	at org.joda.time.chrono.ZonedChronology$ZonedDateTimeField.get(ZonedChronology.java:423)
	at org.joda.time.field.DelegatedDateTimeField.get(DelegatedDateTimeField.java:110)
	at org.joda.time.field.LenientDateTimeField.set(LenientDateTimeField.java:73)
	at org.joda.time.chrono.BaseChronology.getDateTimeMillis(BaseChronology.java:132)
	at org.joda.time.chrono.AssembledChronology.getDateTimeMillis(AssembledChronology.java:136)
	at org.joda.time.base.BaseDateTime.<init>(BaseDateTime.java:258)
	at org.joda.time.DateMidnight.<init>(DateMidnight.java:350)
	at org.joda.time.TestDateMidnight_Properties.testPropertyEqualsHashCodeLenient(TestDateMidnight_Properties.java:522)

testConstructor_RI_RP3(org.joda.time.TestInterval_Constructors)  Time elapsed: 0.001 sec  <<< ERROR!
java.lang.IllegalArgumentException: The end instant must be greater or equal to the start
	at org.joda.time.base.AbstractInterval.checkInterval(AbstractInterval.java:63)
	at org.joda.time.base.BaseInterval.<init>(BaseInterval.java:153)
	at org.joda.time.Interval.<init>(Interval.java:161)
	at org.joda.time.TestInterval_Constructors.testConstructor_RI_RP3(TestInterval_Constructors.java:301)

testWithPeriodAfterStart1(org.joda.time.TestInterval_Basics)  Time elapsed: 0 sec  <<< ERROR!
java.lang.IllegalArgumentException: The end instant must be greater or equal to the start
	at org.joda.time.base.AbstractInterval.checkInterval(AbstractInterval.java:63)
	at org.joda.time.base.BaseInterval.<init>(BaseInterval.java:73)
	at org.joda.time.Interval.<init>(Interval.java:109)
	at org.joda.time.Interval.withPeriodAfterStart(Interval.java:465)
	at org.joda.time.TestInterval_Basics.testWithPeriodAfterStart1(TestInterval_Basics.java:1229)

testToDateTime(org.joda.time.TestLocalDateTime_Basics)  Time elapsed: 0 sec  <<< FAILURE!
junit.framework.AssertionFailedError: expected:<2005> but was:<1687>
	at junit.framework.Assert.fail(Assert.java:47)
	at junit.framework.Assert.failNotEquals(Assert.java:280)
	at junit.framework.Assert.assertEquals(Assert.java:64)
	at junit.framework.Assert.assertEquals(Assert.java:198)
	at junit.framework.Assert.assertEquals(Assert.java:204)
	at org.joda.time.TestLocalDateTime_Basics.check(TestLocalDateTime_Basics.java:1101)
	at org.joda.time.TestLocalDateTime_Basics.testToDateTime(TestLocalDateTime_Basics.java:770)

testToLocalTime(org.joda.time.TestLocalDateTime_Basics)  Time elapsed: 0.001 sec  <<< ERROR!
IllegalArgumentException: The instant is below the supported minimum of 1686-01-01T00:00:00.���Z (CopticChronology[UTC])
	at org.joda.time.chrono.LimitChronology.checkLimits(LimitChronology.java:286)
	at org.joda.time.chrono.LimitChronology.getDateTimeMillis(LimitChronology.java:199)
	at org.joda.time.chrono.AssembledChronology.getDateTimeMillis(AssembledChronology.java:148)
	at org.joda.time.LocalTime.<init>(LocalTime.java:506)
	at org.joda.time.TestLocalDateTime_Basics.testToLocalTime(TestLocalDateTime_Basics.java:825)

testEqualsHashCode(org.joda.time.TestLocalDateTime_Basics)  Time elapsed: 0.001 sec  <<< FAILURE!
junit.framework.AssertionFailedError: expected:<true> but was:<false>
	at junit.framework.Assert.fail(Assert.java:47)
	at junit.framework.Assert.failNotEquals(Assert.java:280)
	at junit.framework.Assert.assertEquals(Assert.java:64)
	at junit.framework.Assert.assertEquals(Assert.java:146)
	at junit.framework.Assert.assertEquals(Assert.java:152)
	at org.joda.time.TestLocalDateTime_Basics.testEqualsHashCode(TestLocalDateTime_Basics.java:302)

testToDateTime_Zone(org.joda.time.TestLocalDateTime_Basics)  Time elapsed: 0 sec  <<< FAILURE!
junit.framework.AssertionFailedError: expected:<2005> but was:<1687>
	at junit.framework.Assert.fail(Assert.java:47)
	at junit.framework.Assert.failNotEquals(Assert.java:280)
	at junit.framework.Assert.assertEquals(Assert.java:64)
	at junit.framework.Assert.assertEquals(Assert.java:198)
	at junit.framework.Assert.assertEquals(Assert.java:204)
	at org.joda.time.TestLocalDateTime_Basics.check(TestLocalDateTime_Basics.java:1101)
	at org.joda.time.TestLocalDateTime_Basics.testToDateTime_Zone(TestLocalDateTime_Basics.java:780)

testToDateTime_nullZone(org.joda.time.TestLocalDateTime_Basics)  Time elapsed: 0 sec  <<< FAILURE!
junit.framework.AssertionFailedError: expected:<2005> but was:<1687>
	at junit.framework.Assert.fail(Assert.java:47)
	at junit.framework.Assert.failNotEquals(Assert.java:280)
	at junit.framework.Assert.assertEquals(Assert.java:64)
	at junit.framework.Assert.assertEquals(Assert.java:198)
	at junit.framework.Assert.assertEquals(Assert.java:204)
	at org.joda.time.TestLocalDateTime_Basics.check(TestLocalDateTime_Basics.java:1101)
	at org.joda.time.TestLocalDateTime_Basics.testToDateTime_nullZone(TestLocalDateTime_Basics.java:789)

testToDateTime_RI(org.joda.time.TestLocalDateTime_Basics)  Time elapsed: 0.001 sec  <<< FAILURE!
junit.framework.AssertionFailedError: expected:<2005> but was:<1687>
	at junit.framework.Assert.fail(Assert.java:47)
	at junit.framework.Assert.failNotEquals(Assert.java:280)
	at junit.framework.Assert.assertEquals(Assert.java:64)
	at junit.framework.Assert.assertEquals(Assert.java:198)
	at junit.framework.Assert.assertEquals(Assert.java:204)
	at org.joda.time.TestLocalDateTime_Basics.check(TestLocalDateTime_Basics.java:1101)
	at org.joda.time.TestLocalDateTime_Basics.testToDateTime_RI(TestLocalDateTime_Basics.java:835)

testToDateTime_nullRI(org.joda.time.TestLocalDateTime_Basics)  Time elapsed: 0.001 sec  <<< FAILURE!
junit.framework.AssertionFailedError: expected:<2005> but was:<1687>
	at junit.framework.Assert.fail(Assert.java:47)
	at junit.framework.Assert.failNotEquals(Assert.java:280)
	at junit.framework.Assert.assertEquals(Assert.java:64)
	at junit.framework.Assert.assertEquals(Assert.java:198)
	at junit.framework.Assert.assertEquals(Assert.java:204)
	at org.joda.time.TestLocalDateTime_Basics.check(TestLocalDateTime_Basics.java:1101)
	at org.joda.time.TestLocalDateTime_Basics.testToDateTime_nullRI(TestLocalDateTime_Basics.java:844)

testToDate_summer(org.joda.time.TestLocalDateTime_Basics)  Time elapsed: 0.004 sec  <<< FAILURE!
junit.framework.AssertionFailedError: expected:<2005> but was:<1687>
	at junit.framework.Assert.fail(Assert.java:47)
	at junit.framework.Assert.failNotEquals(Assert.java:280)
	at junit.framework.Assert.assertEquals(Assert.java:64)
	at junit.framework.Assert.assertEquals(Assert.java:198)
	at junit.framework.Assert.assertEquals(Assert.java:204)
	at org.joda.time.TestLocalDateTime_Basics.check(TestLocalDateTime_Basics.java:1101)
	at org.joda.time.TestLocalDateTime_Basics.testToDate_summer(TestLocalDateTime_Basics.java:854)

testToDate_winter(org.joda.time.TestLocalDateTime_Basics)  Time elapsed: 0 sec  <<< FAILURE!
junit.framework.AssertionFailedError: expected:<2005> but was:<1687>
	at junit.framework.Assert.fail(Assert.java:47)
	at junit.framework.Assert.failNotEquals(Assert.java:280)
	at junit.framework.Assert.assertEquals(Assert.java:64)
	at junit.framework.Assert.assertEquals(Assert.java:198)
	at junit.framework.Assert.assertEquals(Assert.java:204)
	at org.joda.time.TestLocalDateTime_Basics.check(TestLocalDateTime_Basics.java:1101)
	at org.joda.time.TestLocalDateTime_Basics.testToDate_winter(TestLocalDateTime_Basics.java:872)

testToDate_summer_Zone(org.joda.time.TestLocalDateTime_Basics)  Time elapsed: 0.001 sec  <<< FAILURE!
junit.framework.AssertionFailedError: expected:<2005> but was:<1687>
	at junit.framework.Assert.fail(Assert.java:47)
	at junit.framework.Assert.failNotEquals(Assert.java:280)
	at junit.framework.Assert.assertEquals(Assert.java:64)
	at junit.framework.Assert.assertEquals(Assert.java:198)
	at junit.framework.Assert.assertEquals(Assert.java:204)
	at org.joda.time.TestLocalDateTime_Basics.check(TestLocalDateTime_Basics.java:1101)
	at org.joda.time.TestLocalDateTime_Basics.testToDate_summer_Zone(TestLocalDateTime_Basics.java:939)

testToDate_winter_Zone(org.joda.time.TestLocalDateTime_Basics)  Time elapsed: 0.001 sec  <<< FAILURE!
junit.framework.AssertionFailedError: expected:<2005> but was:<1687>
	at junit.framework.Assert.fail(Assert.java:47)
	at junit.framework.Assert.failNotEquals(Assert.java:280)
	at junit.framework.Assert.assertEquals(Assert.java:64)
	at junit.framework.Assert.assertEquals(Assert.java:198)
	at junit.framework.Assert.assertEquals(Assert.java:204)
	at org.joda.time.TestLocalDateTime_Basics.check(TestLocalDateTime_Basics.java:1101)
	at org.joda.time.TestLocalDateTime_Basics.testToDate_winter_Zone(TestLocalDateTime_Basics.java:957)

testIsSupported_DateTimeFieldType(org.joda.time.TestLocalDate_Basics)  Time elapsed: 0 sec  <<< ERROR!
IllegalArgumentException: The instant is below the supported minimum of 1686-01-01T00:00:00.���Z (CopticChronology[UTC])
	at org.joda.time.chrono.LimitChronology.checkLimits(LimitChronology.java:286)
	at org.joda.time.chrono.LimitChronology$LimitDateTimeField.roundFloor(LimitChronology.java:546)
	at org.joda.time.LocalDate.<init>(LocalDate.java:340)
	at org.joda.time.LocalDate.<init>(LocalDate.java:295)
	at org.joda.time.TestLocalDate_Basics.testIsSupported_DateTimeFieldType(TestLocalDate_Basics.java:212)

testToDateMidnight(org.joda.time.TestLocalDate_Basics)  Time elapsed: 0.002 sec  <<< FAILURE!
junit.framework.AssertionFailedError: expected:<2005> but was:<1687>
	at junit.framework.Assert.fail(Assert.java:47)
	at junit.framework.Assert.failNotEquals(Assert.java:280)
	at junit.framework.Assert.assertEquals(Assert.java:64)
	at junit.framework.Assert.assertEquals(Assert.java:198)
	at junit.framework.Assert.assertEquals(Assert.java:204)
	at org.joda.time.TestLocalDate_Basics.check(TestLocalDate_Basics.java:1155)
	at org.joda.time.TestLocalDate_Basics.testToDateMidnight(TestLocalDate_Basics.java:907)

testEqualsHashCode(org.joda.time.TestLocalDate_Basics)  Time elapsed: 0.001 sec  <<< FAILURE!
junit.framework.AssertionFailedError: expected:<true> but was:<false>
	at junit.framework.Assert.fail(Assert.java:47)
	at junit.framework.Assert.failNotEquals(Assert.java:280)
	at junit.framework.Assert.assertEquals(Assert.java:64)
	at junit.framework.Assert.assertEquals(Assert.java:146)
	at junit.framework.Assert.assertEquals(Assert.java:152)
	at org.joda.time.TestLocalDate_Basics.testEqualsHashCode(TestLocalDate_Basics.java:264)

testGetFieldType_int(org.joda.time.TestLocalDate_Basics)  Time elapsed: 0.002 sec  <<< ERROR!
IllegalArgumentException: The instant is below the supported minimum of 1686-01-01T00:00:00.���Z (CopticChronology[UTC])
	at org.joda.time.chrono.LimitChronology.checkLimits(LimitChronology.java:286)
	at org.joda.time.chrono.LimitChronology$LimitDateTimeField.roundFloor(LimitChronology.java:546)
	at org.joda.time.LocalDate.<init>(LocalDate.java:340)
	at org.joda.time.LocalDate.<init>(LocalDate.java:295)
	at org.joda.time.TestLocalDate_Basics.testGetFieldType_int(TestLocalDate_Basics.java:146)

testGetFieldTypes(org.joda.time.TestLocalDate_Basics)  Time elapsed: 0 sec  <<< ERROR!
IllegalArgumentException: The instant is below the supported minimum of 1686-01-01T00:00:00.���Z (CopticChronology[UTC])
	at org.joda.time.chrono.LimitChronology.checkLimits(LimitChronology.java:286)
	at org.joda.time.chrono.LimitChronology$LimitDateTimeField.roundFloor(LimitChronology.java:546)
	at org.joda.time.LocalDate.<init>(LocalDate.java:340)
	at org.joda.time.LocalDate.<init>(LocalDate.java:295)
	at org.joda.time.TestLocalDate_Basics.testGetFieldTypes(TestLocalDate_Basics.java:159)

testGetField_int(org.joda.time.TestLocalDate_Basics)  Time elapsed: 0.001 sec  <<< ERROR!
IllegalArgumentException: The instant is below the supported minimum of 1686-01-01T00:00:00.���Z (CopticChronology[UTC])
	at org.joda.time.chrono.LimitChronology.checkLimits(LimitChronology.java:286)
	at org.joda.time.chrono.LimitChronology$LimitDateTimeField.roundFloor(LimitChronology.java:546)
	at org.joda.time.LocalDate.<init>(LocalDate.java:340)
	at org.joda.time.LocalDate.<init>(LocalDate.java:295)
	at org.joda.time.TestLocalDate_Basics.testGetField_int(TestLocalDate_Basics.java:168)

testGetFields(org.joda.time.TestLocalDate_Basics)  Time elapsed: 0.001 sec  <<< ERROR!
IllegalArgumentException: The instant is below the supported minimum of 1686-01-01T00:00:00.���Z (CopticChronology[UTC])
	at org.joda.time.chrono.LimitChronology.checkLimits(LimitChronology.java:286)
	at org.joda.time.chrono.LimitChronology$LimitDateTimeField.roundFloor(LimitChronology.java:546)
	at org.joda.time.LocalDate.<init>(LocalDate.java:340)
	at org.joda.time.LocalDate.<init>(LocalDate.java:295)
	at org.joda.time.TestLocalDate_Basics.testGetFields(TestLocalDate_Basics.java:181)

testToInterval(org.joda.time.TestLocalDate_Basics)  Time elapsed: 0.003 sec  <<< FAILURE!
junit.framework.AssertionFailedError: expected:<2005> but was:<1687>
	at junit.framework.Assert.fail(Assert.java:47)
	at junit.framework.Assert.failNotEquals(Assert.java:280)
	at junit.framework.Assert.assertEquals(Assert.java:64)
	at junit.framework.Assert.assertEquals(Assert.java:198)
	at junit.framework.Assert.assertEquals(Assert.java:204)
	at org.joda.time.TestLocalDate_Basics.check(TestLocalDate_Basics.java:1155)
	at org.joda.time.TestLocalDate_Basics.testToInterval(TestLocalDate_Basics.java:962)

testEqualsHashCodeAPI(org.joda.time.TestLocalDate_Basics)  Time elapsed: 0 sec  <<< FAILURE!
junit.framework.AssertionFailedError: expected:<2011952710> but was:<190467641>
	at junit.framework.Assert.fail(Assert.java:47)
	at junit.framework.Assert.failNotEquals(Assert.java:280)
	at junit.framework.Assert.assertEquals(Assert.java:64)
	at junit.framework.Assert.assertEquals(Assert.java:198)
	at junit.framework.Assert.assertEquals(Assert.java:204)
	at org.joda.time.TestLocalDate_Basics.testEqualsHashCodeAPI(TestLocalDate_Basics.java:320)

testToDateTimeAtStartOfDay(org.joda.time.TestLocalDate_Basics)  Time elapsed: 0 sec  <<< FAILURE!
junit.framework.AssertionFailedError: expected:<2005> but was:<1687>
	at junit.framework.Assert.fail(Assert.java:47)
	at junit.framework.Assert.failNotEquals(Assert.java:280)
	at junit.framework.Assert.assertEquals(Assert.java:64)
	at junit.framework.Assert.assertEquals(Assert.java:198)
	at junit.framework.Assert.assertEquals(Assert.java:204)
	at org.joda.time.TestLocalDate_Basics.check(TestLocalDate_Basics.java:1155)
	at org.joda.time.TestLocalDate_Basics.testToDateTimeAtStartOfDay(TestLocalDate_Basics.java:667)

testToDateTimeAtStartOfDay_Zone(org.joda.time.TestLocalDate_Basics)  Time elapsed: 0.001 sec  <<< FAILURE!
junit.framework.AssertionFailedError: expected:<2005> but was:<1687>
	at junit.framework.Assert.fail(Assert.java:47)
	at junit.framework.Assert.failNotEquals(Assert.java:280)
	at junit.framework.Assert.assertEquals(Assert.java:64)
	at junit.framework.Assert.assertEquals(Assert.java:198)
	at junit.framework.Assert.assertEquals(Assert.java:204)
	at org.joda.time.TestLocalDate_Basics.check(TestLocalDate_Basics.java:1155)
	at org.joda.time.TestLocalDate_Basics.testToDateTimeAtStartOfDay_Zone(TestLocalDate_Basics.java:685)

testToDateTimeAtStartOfDay_nullZone(org.joda.time.TestLocalDate_Basics)  Time elapsed: 0.001 sec  <<< FAILURE!
junit.framework.AssertionFailedError: expected:<2005> but was:<1687>
	at junit.framework.Assert.fail(Assert.java:47)
	at junit.framework.Assert.failNotEquals(Assert.java:280)
	at junit.framework.Assert.assertEquals(Assert.java:64)
	at junit.framework.Assert.assertEquals(Assert.java:198)
	at junit.framework.Assert.assertEquals(Assert.java:204)
	at org.joda.time.TestLocalDate_Basics.check(TestLocalDate_Basics.java:1155)
	at org.joda.time.TestLocalDate_Basics.testToDateTimeAtStartOfDay_nullZone(TestLocalDate_Basics.java:701)

testToDateTimeAtMidnight(org.joda.time.TestLocalDate_Basics)  Time elapsed: 0 sec  <<< FAILURE!
junit.framework.AssertionFailedError: expected:<2005> but was:<1687>
	at junit.framework.Assert.fail(Assert.java:47)
	at junit.framework.Assert.failNotEquals(Assert.java:280)
	at junit.framework.Assert.assertEquals(Assert.java:64)
	at junit.framework.Assert.assertEquals(Assert.java:198)
	at junit.framework.Assert.assertEquals(Assert.java:204)
	at org.joda.time.TestLocalDate_Basics.check(TestLocalDate_Basics.java:1155)
	at org.joda.time.TestLocalDate_Basics.testToDateTimeAtMidnight(TestLocalDate_Basics.java:711)

testToDateTimeAtMidnight_Zone(org.joda.time.TestLocalDate_Basics)  Time elapsed: 0.003 sec  <<< FAILURE!
junit.framework.AssertionFailedError: expected:<2005> but was:<1687>
	at junit.framework.Assert.fail(Assert.java:47)
	at junit.framework.Assert.failNotEquals(Assert.java:280)
	at junit.framework.Assert.assertEquals(Assert.java:64)
	at junit.framework.Assert.assertEquals(Assert.java:198)
	at junit.framework.Assert.assertEquals(Assert.java:204)
	at org.joda.time.TestLocalDate_Basics.check(TestLocalDate_Basics.java:1155)
	at org.joda.time.TestLocalDate_Basics.testToDateTimeAtMidnight_Zone(TestLocalDate_Basics.java:721)

testToDateTimeAtMidnight_nullZone(org.joda.time.TestLocalDate_Basics)  Time elapsed: 0.003 sec  <<< FAILURE!
junit.framework.AssertionFailedError: expected:<2005> but was:<1687>
	at junit.framework.Assert.fail(Assert.java:47)
	at junit.framework.Assert.failNotEquals(Assert.java:280)
	at junit.framework.Assert.assertEquals(Assert.java:64)
	at junit.framework.Assert.assertEquals(Assert.java:198)
	at junit.framework.Assert.assertEquals(Assert.java:204)
	at org.joda.time.TestLocalDate_Basics.check(TestLocalDate_Basics.java:1155)
	at org.joda.time.TestLocalDate_Basics.testToDateTimeAtMidnight_nullZone(TestLocalDate_Basics.java:730)

testToDateTimeAtCurrentTime(org.joda.time.TestLocalDate_Basics)  Time elapsed: 0.001 sec  <<< ERROR!
org.joda.time.IllegalFieldValueException: Value 1687 for year is not supported: Illegal instant due to time zone offset transition (daylight savings time 'gap'): 2004-06-09T06:07:08.009 (Europe/London)
	at org.joda.time.chrono.ZonedChronology$ZonedDateTimeField.set(ZonedChronology.java:486)
	at org.joda.time.chrono.BaseChronology.set(BaseChronology.java:240)
	at org.joda.time.LocalDate.toDateTimeAtCurrentTime(LocalDate.java:818)
	at org.joda.time.LocalDate.toDateTimeAtCurrentTime(LocalDate.java:795)
	at org.joda.time.TestLocalDate_Basics.testToDateTimeAtCurrentTime(TestLocalDate_Basics.java:740)
Caused by: org.joda.time.IllegalInstantException: Illegal instant due to time zone offset transition (daylight savings time 'gap'): 2004-06-09T06:07:08.009 (Europe/London)
	at org.joda.time.chrono.ZonedChronology$ZonedDateTimeField.set(ZonedChronology.java:485)
	... 30 more

testToDateTimeAtCurrentTime_Zone(org.joda.time.TestLocalDate_Basics)  Time elapsed: 0 sec  <<< ERROR!
org.joda.time.IllegalFieldValueException: Value 1687 for year is not supported: Illegal instant due to time zone offset transition (daylight savings time 'gap'): 2004-06-09T14:07:08.009 (Asia/Tokyo)
	at org.joda.time.chrono.ZonedChronology$ZonedDateTimeField.set(ZonedChronology.java:486)
	at org.joda.time.chrono.BaseChronology.set(BaseChronology.java:240)
	at org.joda.time.LocalDate.toDateTimeAtCurrentTime(LocalDate.java:818)
	at org.joda.time.TestLocalDate_Basics.testToDateTimeAtCurrentTime_Zone(TestLocalDate_Basics.java:755)
Caused by: org.joda.time.IllegalInstantException: Illegal instant due to time zone offset transition (daylight savings time 'gap'): 2004-06-09T14:07:08.009 (Asia/Tokyo)
	at org.joda.time.chrono.ZonedChronology$ZonedDateTimeField.set(ZonedChronology.java:485)
	... 29 more

testToDateTimeAtCurrentTime_nullZone(org.joda.time.TestLocalDate_Basics)  Time elapsed: 0 sec  <<< ERROR!
org.joda.time.IllegalFieldValueException: Value 1687 for year is not supported: Illegal instant due to time zone offset transition (daylight savings time 'gap'): 2004-06-09T06:07:08.009 (Europe/London)
	at org.joda.time.chrono.ZonedChronology$ZonedDateTimeField.set(ZonedChronology.java:486)
	at org.joda.time.chrono.BaseChronology.set(BaseChronology.java:240)
	at org.joda.time.LocalDate.toDateTimeAtCurrentTime(LocalDate.java:818)
	at org.joda.time.TestLocalDate_Basics.testToDateTimeAtCurrentTime_nullZone(TestLocalDate_Basics.java:769)
Caused by: org.joda.time.IllegalInstantException: Illegal instant due to time zone offset transition (daylight savings time 'gap'): 2004-06-09T06:07:08.009 (Europe/London)
	at org.joda.time.chrono.ZonedChronology$ZonedDateTimeField.set(ZonedChronology.java:485)
	... 29 more

testToLocalDateTime_LocalTime(org.joda.time.TestLocalDate_Basics)  Time elapsed: 0 sec  <<< ERROR!
IllegalArgumentException: The instant is below the supported minimum of 1686-01-01T00:00:00.���Z (CopticChronology[UTC])
	at org.joda.time.chrono.LimitChronology.checkLimits(LimitChronology.java:286)
	at org.joda.time.chrono.LimitChronology.getDateTimeMillis(LimitChronology.java:199)
	at org.joda.time.chrono.AssembledChronology.getDateTimeMillis(AssembledChronology.java:148)
	at org.joda.time.LocalTime.<init>(LocalTime.java:506)
	at org.joda.time.TestLocalDate_Basics.testToLocalDateTime_LocalTime(TestLocalDate_Basics.java:781)

testToDateTime_LocalTime(org.joda.time.TestLocalDate_Basics)  Time elapsed: 0 sec  <<< ERROR!
IllegalArgumentException: The instant is below the supported minimum of 1686-01-01T00:00:00.���Z (CopticChronology[UTC])
	at org.joda.time.chrono.LimitChronology.checkLimits(LimitChronology.java:286)
	at org.joda.time.chrono.LimitChronology.getDateTimeMillis(LimitChronology.java:199)
	at org.joda.time.chrono.AssembledChronology.getDateTimeMillis(AssembledChronology.java:148)
	at org.joda.time.LocalTime.<init>(LocalTime.java:506)
	at org.joda.time.TestLocalDate_Basics.testToDateTime_LocalTime(TestLocalDate_Basics.java:815)

testToDateTime_nullLocalTime(org.joda.time.TestLocalDate_Basics)  Time elapsed: 0.001 sec  <<< FAILURE!
junit.framework.AssertionFailedError: expected:<2005> but was:<1687>
	at junit.framework.Assert.fail(Assert.java:47)
	at junit.framework.Assert.failNotEquals(Assert.java:280)
	at junit.framework.Assert.assertEquals(Assert.java:64)
	at junit.framework.Assert.assertEquals(Assert.java:198)
	at junit.framework.Assert.assertEquals(Assert.java:204)
	at org.joda.time.TestLocalDate_Basics.check(TestLocalDate_Basics.java:1155)
	at org.joda.time.TestLocalDate_Basics.testToDateTime_nullLocalTime(TestLocalDate_Basics.java:829)

testToDateTime_LocalTime_Zone(org.joda.time.TestLocalDate_Basics)  Time elapsed: 0.001 sec  <<< ERROR!
IllegalArgumentException: The instant is below the supported minimum of 1686-01-01T00:00:00.���Z (CopticChronology[UTC])
	at org.joda.time.chrono.LimitChronology.checkLimits(LimitChronology.java:286)
	at org.joda.time.chrono.LimitChronology.getDateTimeMillis(LimitChronology.java:199)
	at org.joda.time.chrono.AssembledChronology.getDateTimeMillis(AssembledChronology.java:148)
	at org.joda.time.LocalTime.<init>(LocalTime.java:506)
	at org.joda.time.TestLocalDate_Basics.testToDateTime_LocalTime_Zone(TestLocalDate_Basics.java:837)

testToDateTime_LocalTime_nullZone(org.joda.time.TestLocalDate_Basics)  Time elapsed: 0.001 sec  <<< ERROR!
IllegalArgumentException: The instant is below the supported minimum of 1686-01-01T00:00:00.���Z (CopticChronology[UTC])
	at org.joda.time.chrono.LimitChronology.checkLimits(LimitChronology.java:286)
	at org.joda.time.chrono.LimitChronology.getDateTimeMillis(LimitChronology.java:199)
	at org.joda.time.chrono.AssembledChronology.getDateTimeMillis(AssembledChronology.java:148)
	at org.joda.time.LocalTime.<init>(LocalTime.java:506)
	at org.joda.time.TestLocalDate_Basics.testToDateTime_LocalTime_nullZone(TestLocalDate_Basics.java:847)

testToDateTime_nullLocalTime_Zone(org.joda.time.TestLocalDate_Basics)  Time elapsed: 0 sec  <<< FAILURE!
junit.framework.AssertionFailedError: expected:<2005> but was:<1687>
	at junit.framework.Assert.fail(Assert.java:47)
	at junit.framework.Assert.failNotEquals(Assert.java:280)
	at junit.framework.Assert.assertEquals(Assert.java:64)
	at junit.framework.Assert.assertEquals(Assert.java:198)
	at junit.framework.Assert.assertEquals(Assert.java:204)
	at org.joda.time.TestLocalDate_Basics.check(TestLocalDate_Basics.java:1155)
	at org.joda.time.TestLocalDate_Basics.testToDateTime_nullLocalTime_Zone(TestLocalDate_Basics.java:861)

testToDateMidnight_Zone(org.joda.time.TestLocalDate_Basics)  Time elapsed: 0.001 sec  <<< FAILURE!
junit.framework.AssertionFailedError: expected:<2005> but was:<1687>
	at junit.framework.Assert.fail(Assert.java:47)
	at junit.framework.Assert.failNotEquals(Assert.java:280)
	at junit.framework.Assert.assertEquals(Assert.java:64)
	at junit.framework.Assert.assertEquals(Assert.java:198)
	at junit.framework.Assert.assertEquals(Assert.java:204)
	at org.joda.time.TestLocalDate_Basics.check(TestLocalDate_Basics.java:1155)
	at org.joda.time.TestLocalDate_Basics.testToDateMidnight_Zone(TestLocalDate_Basics.java:917)

testToDateMidnight_nullZone(org.joda.time.TestLocalDate_Basics)  Time elapsed: 0.001 sec  <<< FAILURE!
junit.framework.AssertionFailedError: expected:<2005> but was:<1687>
	at junit.framework.Assert.fail(Assert.java:47)
	at junit.framework.Assert.failNotEquals(Assert.java:280)
	at junit.framework.Assert.assertEquals(Assert.java:64)
	at junit.framework.Assert.assertEquals(Assert.java:198)
	at junit.framework.Assert.assertEquals(Assert.java:204)
	at org.joda.time.TestLocalDate_Basics.check(TestLocalDate_Basics.java:1155)
	at org.joda.time.TestLocalDate_Basics.testToDateMidnight_nullZone(TestLocalDate_Basics.java:926)

testToInterval_Zone(org.joda.time.TestLocalDate_Basics)  Time elapsed: 0.003 sec  <<< FAILURE!
junit.framework.AssertionFailedError: expected:<2005> but was:<1687>
	at junit.framework.Assert.fail(Assert.java:47)
	at junit.framework.Assert.failNotEquals(Assert.java:280)
	at junit.framework.Assert.assertEquals(Assert.java:64)
	at junit.framework.Assert.assertEquals(Assert.java:198)
	at junit.framework.Assert.assertEquals(Assert.java:204)
	at org.joda.time.TestLocalDate_Basics.check(TestLocalDate_Basics.java:1155)
	at org.joda.time.TestLocalDate_Basics.testToInterval_Zone(TestLocalDate_Basics.java:973)

testToInterval_nullZone(org.joda.time.TestLocalDate_Basics)  Time elapsed: 0 sec  <<< FAILURE!
junit.framework.AssertionFailedError: expected:<2005> but was:<1687>
	at junit.framework.Assert.fail(Assert.java:47)
	at junit.framework.Assert.failNotEquals(Assert.java:280)
	at junit.framework.Assert.assertEquals(Assert.java:64)
	at junit.framework.Assert.assertEquals(Assert.java:198)
	at junit.framework.Assert.assertEquals(Assert.java:204)
	at org.joda.time.TestLocalDate_Basics.check(TestLocalDate_Basics.java:1155)
	at org.joda.time.TestLocalDate_Basics.testToInterval_nullZone(TestLocalDate_Basics.java:994)

testEqualsHashCodeLenient(org.joda.time.TestLocalDate_Basics)  Time elapsed: 0.003 sec  <<< ERROR!
IllegalArgumentException: The instant is below the supported minimum of 1686-01-01T00:00:00.���Z (CopticChronology[UTC])
	at org.joda.time.chrono.LimitChronology.checkLimits(LimitChronology.java:286)
	at org.joda.time.chrono.LimitChronology$LimitDateTimeField.get(LimitChronology.java:462)
	at org.joda.time.field.DelegatedDateTimeField.get(DelegatedDateTimeField.java:110)
	at org.joda.time.field.LenientDateTimeField.set(LenientDateTimeField.java:73)
	at org.joda.time.chrono.BaseChronology.getDateTimeMillis(BaseChronology.java:102)
	at org.joda.time.chrono.AssembledChronology.getDateTimeMillis(AssembledChronology.java:122)
	at org.joda.time.LocalDate.<init>(LocalDate.java:457)
	at org.joda.time.TestLocalDate_Basics.testEqualsHashCodeLenient(TestLocalDate_Basics.java:287)

testToDateTime_RI(org.joda.time.TestLocalDate_Basics)  Time elapsed: 0 sec  <<< FAILURE!
junit.framework.AssertionFailedError: expected:<2005> but was:<1687>
	at junit.framework.Assert.fail(Assert.java:47)
	at junit.framework.Assert.failNotEquals(Assert.java:280)
	at junit.framework.Assert.assertEquals(Assert.java:64)
	at junit.framework.Assert.assertEquals(Assert.java:198)
	at junit.framework.Assert.assertEquals(Assert.java:204)
	at org.joda.time.TestLocalDate_Basics.check(TestLocalDate_Basics.java:1155)
	at org.joda.time.TestLocalDate_Basics.testToDateTime_RI(TestLocalDate_Basics.java:936)

testToDate_summer(org.joda.time.TestLocalDate_Basics)  Time elapsed: 0 sec  <<< FAILURE!
junit.framework.AssertionFailedError: expected:<2005> but was:<1687>
	at junit.framework.Assert.fail(Assert.java:47)
	at junit.framework.Assert.failNotEquals(Assert.java:280)
	at junit.framework.Assert.assertEquals(Assert.java:64)
	at junit.framework.Assert.assertEquals(Assert.java:198)
	at junit.framework.Assert.assertEquals(Assert.java:204)
	at org.joda.time.TestLocalDate_Basics.check(TestLocalDate_Basics.java:1155)
	at org.joda.time.TestLocalDate_Basics.testToDate_summer(TestLocalDate_Basics.java:1006)

testToDate_winter(org.joda.time.TestLocalDate_Basics)  Time elapsed: 0.007 sec  <<< FAILURE!
junit.framework.AssertionFailedError: expected:<2005> but was:<1687>
	at junit.framework.Assert.fail(Assert.java:47)
	at junit.framework.Assert.failNotEquals(Assert.java:280)
	at junit.framework.Assert.assertEquals(Assert.java:64)
	at junit.framework.Assert.assertEquals(Assert.java:198)
	at junit.framework.Assert.assertEquals(Assert.java:204)
	at org.joda.time.TestLocalDate_Basics.check(TestLocalDate_Basics.java:1155)
	at org.joda.time.TestLocalDate_Basics.testToDate_winter(TestLocalDate_Basics.java:1020)

testPropertyEqualsHashCodeLenient(org.joda.time.TestLocalDate_Properties)  Time elapsed: 0 sec  <<< ERROR!
IllegalArgumentException: The instant is below the supported minimum of 1686-01-01T00:00:00.���Z (CopticChronology[UTC])
	at org.joda.time.chrono.LimitChronology.checkLimits(LimitChronology.java:286)
	at org.joda.time.chrono.LimitChronology$LimitDateTimeField.get(LimitChronology.java:462)
	at org.joda.time.field.DelegatedDateTimeField.get(DelegatedDateTimeField.java:110)
	at org.joda.time.field.LenientDateTimeField.set(LenientDateTimeField.java:73)
	at org.joda.time.chrono.BaseChronology.getDateTimeMillis(BaseChronology.java:102)
	at org.joda.time.chrono.AssembledChronology.getDateTimeMillis(AssembledChronology.java:122)
	at org.joda.time.LocalDate.<init>(LocalDate.java:457)
	at org.joda.time.TestLocalDate_Properties.testPropertyEqualsHashCodeLenient(TestLocalDate_Properties.java:526)

testSerialization(org.joda.time.TestLocalTime_Basics)  Time elapsed: 0 sec  <<< ERROR!
IllegalArgumentException: The instant is below the supported minimum of 1686-01-01T00:00:00.���Z (CopticChronology[UTC])
	at org.joda.time.chrono.LimitChronology.checkLimits(LimitChronology.java:286)
	at org.joda.time.chrono.LimitChronology.getDateTimeMillis(LimitChronology.java:199)
	at org.joda.time.chrono.AssembledChronology.getDateTimeMillis(AssembledChronology.java:148)
	at org.joda.time.LocalTime.<init>(LocalTime.java:506)
	at org.joda.time.TestLocalTime_Basics.testSerialization(TestLocalTime_Basics.java:764)

testEqualsHashCode(org.joda.time.TestLocalTime_Basics)  Time elapsed: 0 sec  <<< ERROR!
IllegalArgumentException: The instant is below the supported minimum of 1686-01-01T00:00:00.���Z (CopticChronology[UTC])
	at org.joda.time.chrono.LimitChronology.checkLimits(LimitChronology.java:286)
	at org.joda.time.chrono.LimitChronology.getDateTimeMillis(LimitChronology.java:199)
	at org.joda.time.chrono.AssembledChronology.getDateTimeMillis(AssembledChronology.java:148)
	at org.joda.time.LocalTime.<init>(LocalTime.java:506)
	at org.joda.time.TestLocalTime_Basics.testEqualsHashCode(TestLocalTime_Basics.java:270)

testGetField_int(org.joda.time.TestLocalTime_Basics)  Time elapsed: 0 sec  <<< ERROR!
IllegalArgumentException: The instant is below the supported minimum of 1686-01-01T00:00:00.���Z (CopticChronology[UTC])
	at org.joda.time.chrono.LimitChronology.checkLimits(LimitChronology.java:286)
	at org.joda.time.chrono.LimitChronology.getDateTimeMillis(LimitChronology.java:199)
	at org.joda.time.chrono.AssembledChronology.getDateTimeMillis(AssembledChronology.java:148)
	at org.joda.time.LocalTime.<init>(LocalTime.java:506)
	at org.joda.time.TestLocalTime_Basics.testGetField_int(TestLocalTime_Basics.java:162)

testGetFields(org.joda.time.TestLocalTime_Basics)  Time elapsed: 0.001 sec  <<< ERROR!
IllegalArgumentException: The instant is below the supported minimum of 1686-01-01T00:00:00.���Z (CopticChronology[UTC])
	at org.joda.time.chrono.LimitChronology.checkLimits(LimitChronology.java:286)
	at org.joda.time.chrono.LimitChronology.getDateTimeMillis(LimitChronology.java:199)
	at org.joda.time.chrono.AssembledChronology.getDateTimeMillis(AssembledChronology.java:148)
	at org.joda.time.LocalTime.<init>(LocalTime.java:506)
	at org.joda.time.TestLocalTime_Basics.testGetFields(TestLocalTime_Basics.java:176)

testGetValue_int(org.joda.time.TestLocalTime_Basics)  Time elapsed: 0.006 sec  <<< ERROR!
IllegalArgumentException: The instant is below the supported minimum of 1686-01-01T00:00:00.���Z (CopticChronology[UTC])
	at org.joda.time.chrono.LimitChronology.checkLimits(LimitChronology.java:286)
	at org.joda.time.chrono.LimitChronology.getDateTimeMillis(LimitChronology.java:199)
	at org.joda.time.chrono.AssembledChronology.getDateTimeMillis(AssembledChronology.java:148)
	at org.joda.time.LocalTime.<init>(LocalTime.java:506)
	at org.joda.time.TestLocalTime_Basics.testGetValue_int(TestLocalTime_Basics.java:186)

testGetValues(org.joda.time.TestLocalTime_Basics)  Time elapsed: 0 sec  <<< ERROR!
IllegalArgumentException: The instant is below the supported minimum of 1686-01-01T00:00:00.���Z (CopticChronology[UTC])
	at org.joda.time.chrono.LimitChronology.checkLimits(LimitChronology.java:286)
	at org.joda.time.chrono.LimitChronology.getDateTimeMillis(LimitChronology.java:199)
	at org.joda.time.chrono.AssembledChronology.getDateTimeMillis(AssembledChronology.java:148)
	at org.joda.time.LocalTime.<init>(LocalTime.java:506)
	at org.joda.time.TestLocalTime_Basics.testGetValues(TestLocalTime_Basics.java:200)

testToDateTimeTodayDefaultZone(org.joda.time.TestLocalTime_Basics)  Time elapsed: 0.001 sec  <<< ERROR!
IllegalArgumentException: The instant is below the supported minimum of 1686-01-01T00:00:00.���Z (CopticChronology[UTC])
	at org.joda.time.chrono.LimitChronology.checkLimits(LimitChronology.java:286)
	at org.joda.time.chrono.LimitChronology.getDateTimeMillis(LimitChronology.java:199)
	at org.joda.time.chrono.AssembledChronology.getDateTimeMillis(AssembledChronology.java:148)
	at org.joda.time.LocalTime.<init>(LocalTime.java:506)
	at org.joda.time.TestLocalTime_Basics.testToDateTimeTodayDefaultZone(TestLocalTime_Basics.java:669)

testToDateTimeToday_nullZone(org.joda.time.TestLocalTime_Basics)  Time elapsed: 0 sec  <<< ERROR!
IllegalArgumentException: The instant is below the supported minimum of 1686-01-01T00:00:00.���Z (CopticChronology[UTC])
	at org.joda.time.chrono.LimitChronology.checkLimits(LimitChronology.java:286)
	at org.joda.time.chrono.LimitChronology.getDateTimeMillis(LimitChronology.java:199)
	at org.joda.time.chrono.AssembledChronology.getDateTimeMillis(AssembledChronology.java:148)
	at org.joda.time.LocalTime.<init>(LocalTime.java:506)
	at org.joda.time.TestLocalTime_Basics.testToDateTimeToday_nullZone(TestLocalTime_Basics.java:700)

testToDateTime_RI(org.joda.time.TestLocalTime_Basics)  Time elapsed: 0.001 sec  <<< ERROR!
IllegalArgumentException: The instant is below the supported minimum of 1686-01-01T00:00:00.���Z (CopticChronology[UTC])
	at org.joda.time.chrono.LimitChronology.checkLimits(LimitChronology.java:286)
	at org.joda.time.chrono.LimitChronology.getDateTimeMillis(LimitChronology.java:199)
	at org.joda.time.chrono.AssembledChronology.getDateTimeMillis(AssembledChronology.java:148)
	at org.joda.time.LocalTime.<init>(LocalTime.java:506)
	at org.joda.time.TestLocalTime_Basics.testToDateTime_RI(TestLocalTime_Basics.java:716)

testToDateTimeToday_Zone(org.joda.time.TestLocalTime_Basics)  Time elapsed: 0.001 sec  <<< ERROR!
IllegalArgumentException: The instant is below the supported minimum of 1686-01-01T00:00:00.���Z (CopticChronology[UTC])
	at org.joda.time.chrono.LimitChronology.checkLimits(LimitChronology.java:286)
	at org.joda.time.chrono.LimitChronology.getDateTimeMillis(LimitChronology.java:199)
	at org.joda.time.chrono.AssembledChronology.getDateTimeMillis(AssembledChronology.java:148)
	at org.joda.time.LocalTime.<init>(LocalTime.java:506)
	at org.joda.time.TestLocalTime_Basics.testToDateTimeToday_Zone(TestLocalTime_Basics.java:685)

testConstructor_long_long_Chronology1(org.joda.time.TestPeriod_Constructors)  Time elapsed: 0.001 sec  <<< FAILURE!
junit.framework.AssertionFailedError: expected:<1> but was:<0>
	at junit.framework.Assert.fail(Assert.java:47)
	at junit.framework.Assert.failNotEquals(Assert.java:280)
	at junit.framework.Assert.assertEquals(Assert.java:64)
	at junit.framework.Assert.assertEquals(Assert.java:198)
	at junit.framework.Assert.assertEquals(Assert.java:204)
	at org.joda.time.TestPeriod_Constructors.testConstructor_long_long_Chronology1(TestPeriod_Constructors.java:560)

testConstructor_long_long_PeriodType_Chronology1(org.joda.time.TestPeriod_Constructors)  Time elapsed: 0.001 sec  <<< FAILURE!
junit.framework.AssertionFailedError: expected:<1> but was:<0>
	at junit.framework.Assert.fail(Assert.java:47)
	at junit.framework.Assert.failNotEquals(Assert.java:280)
	at junit.framework.Assert.assertEquals(Assert.java:64)
	at junit.framework.Assert.assertEquals(Assert.java:198)
	at junit.framework.Assert.assertEquals(Assert.java:204)
	at org.joda.time.TestPeriod_Constructors.testConstructor_long_long_PeriodType_Chronology1(TestPeriod_Constructors.java:591)

testConstructor_long_long_Chronology1(org.joda.time.TestMutablePeriod_Constructors)  Time elapsed: 0 sec  <<< FAILURE!
junit.framework.AssertionFailedError: expected:<1> but was:<0>
	at junit.framework.Assert.fail(Assert.java:47)
	at junit.framework.Assert.failNotEquals(Assert.java:280)
	at junit.framework.Assert.assertEquals(Assert.java:64)
	at junit.framework.Assert.assertEquals(Assert.java:198)
	at junit.framework.Assert.assertEquals(Assert.java:204)
	at org.joda.time.TestMutablePeriod_Constructors.testConstructor_long_long_Chronology1(TestMutablePeriod_Constructors.java:550)

testConstructor_long_long_PeriodType_Chronology1(org.joda.time.TestMutablePeriod_Constructors)  Time elapsed: 0 sec  <<< FAILURE!
junit.framework.AssertionFailedError: expected:<1> but was:<0>
	at junit.framework.Assert.fail(Assert.java:47)
	at junit.framework.Assert.failNotEquals(Assert.java:280)
	at junit.framework.Assert.assertEquals(Assert.java:64)
	at junit.framework.Assert.assertEquals(Assert.java:198)
	at junit.framework.Assert.assertEquals(Assert.java:204)
	at org.joda.time.TestMutablePeriod_Constructors.testConstructor_long_long_PeriodType_Chronology1(TestMutablePeriod_Constructors.java:581)

testToLocalTime(org.joda.time.TestTimeOfDay_Basics)  Time elapsed: 0.001 sec  <<< ERROR!
IllegalArgumentException: The instant is below the supported minimum of 1686-01-01T00:00:00.���Z (CopticChronology[UTC])
	at org.joda.time.chrono.LimitChronology.checkLimits(LimitChronology.java:286)
	at org.joda.time.chrono.LimitChronology.getDateTimeMillis(LimitChronology.java:199)
	at org.joda.time.chrono.AssembledChronology.getDateTimeMillis(AssembledChronology.java:148)
	at org.joda.time.LocalTime.<init>(LocalTime.java:506)
	at org.joda.time.TimeOfDay.toLocalTime(TimeOfDay.java:816)
	at org.joda.time.TestTimeOfDay_Basics.testToLocalTime(TestTimeOfDay_Basics.java:591)

testGetFieldTypes(org.joda.time.TestTimeOfDay_Basics)  Time elapsed: 0 sec  <<< ERROR!
IllegalArgumentException: The instant is below the supported minimum of 1686-01-01T00:00:00.���Z (CopticChronology[UTC])
	at org.joda.time.chrono.LimitChronology.checkLimits(LimitChronology.java:286)
	at org.joda.time.chrono.LimitChronology$LimitDateTimeField.get(LimitChronology.java:462)
	at org.joda.time.chrono.ZonedChronology$ZonedDateTimeField.get(ZonedChronology.java:423)
	at org.joda.time.chrono.BaseChronology.get(BaseChronology.java:226)
	at org.joda.time.base.BasePartial.<init>(BasePartial.java:111)
	at org.joda.time.base.BasePartial.<init>(BasePartial.java:79)
	at org.joda.time.TimeOfDay.<init>(TimeOfDay.java:228)
	at org.joda.time.TestTimeOfDay_Basics.testGetFieldTypes(TestTimeOfDay_Basics.java:131)

testGetFields(org.joda.time.TestTimeOfDay_Basics)  Time elapsed: 0 sec  <<< ERROR!
IllegalArgumentException: The instant is below the supported minimum of 1686-01-01T00:00:00.���Z (CopticChronology[UTC])
	at org.joda.time.chrono.LimitChronology.checkLimits(LimitChronology.java:286)
	at org.joda.time.chrono.LimitChronology$LimitDateTimeField.get(LimitChronology.java:462)
	at org.joda.time.chrono.ZonedChronology$ZonedDateTimeField.get(ZonedChronology.java:423)
	at org.joda.time.chrono.BaseChronology.get(BaseChronology.java:226)
	at org.joda.time.base.BasePartial.<init>(BasePartial.java:111)
	at org.joda.time.base.BasePartial.<init>(BasePartial.java:79)
	at org.joda.time.TimeOfDay.<init>(TimeOfDay.java:228)
	at org.joda.time.TestTimeOfDay_Basics.testGetFields(TestTimeOfDay_Basics.java:155)

testIsSupported(org.joda.time.TestTimeOfDay_Basics)  Time elapsed: 0 sec  <<< ERROR!
IllegalArgumentException: The instant is below the supported minimum of 1686-01-01T00:00:00.���Z (CopticChronology[UTC])
	at org.joda.time.chrono.LimitChronology.checkLimits(LimitChronology.java:286)
	at org.joda.time.chrono.LimitChronology$LimitDateTimeField.get(LimitChronology.java:462)
	at org.joda.time.chrono.ZonedChronology$ZonedDateTimeField.get(ZonedChronology.java:423)
	at org.joda.time.chrono.BaseChronology.get(BaseChronology.java:226)
	at org.joda.time.base.BasePartial.<init>(BasePartial.java:111)
	at org.joda.time.base.BasePartial.<init>(BasePartial.java:79)
	at org.joda.time.TimeOfDay.<init>(TimeOfDay.java:228)
	at org.joda.time.TestTimeOfDay_Basics.testIsSupported(TestTimeOfDay_Basics.java:189)

testGetField(org.joda.time.TestTimeOfDay_Basics)  Time elapsed: 0.001 sec  <<< ERROR!
IllegalArgumentException: The instant is below the supported minimum of 1686-01-01T00:00:00.���Z (CopticChronology[UTC])
	at org.joda.time.chrono.LimitChronology.checkLimits(LimitChronology.java:286)
	at org.joda.time.chrono.LimitChronology$LimitDateTimeField.get(LimitChronology.java:462)
	at org.joda.time.chrono.ZonedChronology$ZonedDateTimeField.get(ZonedChronology.java:423)
	at org.joda.time.chrono.BaseChronology.get(BaseChronology.java:226)
	at org.joda.time.base.BasePartial.<init>(BasePartial.java:111)
	at org.joda.time.base.BasePartial.<init>(BasePartial.java:79)
	at org.joda.time.TimeOfDay.<init>(TimeOfDay.java:228)
	at org.joda.time.TestTimeOfDay_Basics.testGetField(TestTimeOfDay_Basics.java:141)

testGetFieldType(org.joda.time.TestTimeOfDay_Basics)  Time elapsed: 0.001 sec  <<< ERROR!
IllegalArgumentException: The instant is below the supported minimum of 1686-01-01T00:00:00.���Z (CopticChronology[UTC])
	at org.joda.time.chrono.LimitChronology.checkLimits(LimitChronology.java:286)
	at org.joda.time.chrono.LimitChronology$LimitDateTimeField.get(LimitChronology.java:462)
	at org.joda.time.chrono.ZonedChronology$ZonedDateTimeField.get(ZonedChronology.java:423)
	at org.joda.time.chrono.BaseChronology.get(BaseChronology.java:226)
	at org.joda.time.base.BasePartial.<init>(BasePartial.java:111)
	at org.joda.time.base.BasePartial.<init>(BasePartial.java:79)
	at org.joda.time.TimeOfDay.<init>(TimeOfDay.java:228)
	at org.joda.time.TestTimeOfDay_Basics.testGetFieldType(TestTimeOfDay_Basics.java:117)

testGetFieldTypes(org.joda.time.TestYearMonthDay_Basics)  Time elapsed: 0.001 sec  <<< ERROR!
IllegalArgumentException: The instant is below the supported minimum of 1686-01-01T00:00:00.���Z (CopticChronology[UTC])
	at org.joda.time.chrono.LimitChronology.checkLimits(LimitChronology.java:286)
	at org.joda.time.chrono.LimitChronology$LimitDateTimeField.get(LimitChronology.java:462)
	at org.joda.time.chrono.ZonedChronology$ZonedDateTimeField.get(ZonedChronology.java:423)
	at org.joda.time.chrono.BaseChronology.get(BaseChronology.java:226)
	at org.joda.time.base.BasePartial.<init>(BasePartial.java:111)
	at org.joda.time.base.BasePartial.<init>(BasePartial.java:79)
	at org.joda.time.YearMonthDay.<init>(YearMonthDay.java:182)
	at org.joda.time.TestYearMonthDay_Basics.testGetFieldTypes(TestYearMonthDay_Basics.java:118)

testGetFields(org.joda.time.TestYearMonthDay_Basics)  Time elapsed: 0 sec  <<< ERROR!
IllegalArgumentException: The instant is below the supported minimum of 1686-01-01T00:00:00.���Z (CopticChronology[UTC])
	at org.joda.time.chrono.LimitChronology.checkLimits(LimitChronology.java:286)
	at org.joda.time.chrono.LimitChronology$LimitDateTimeField.get(LimitChronology.java:462)
	at org.joda.time.chrono.ZonedChronology$ZonedDateTimeField.get(ZonedChronology.java:423)
	at org.joda.time.chrono.BaseChronology.get(BaseChronology.java:226)
	at org.joda.time.base.BasePartial.<init>(BasePartial.java:111)
	at org.joda.time.base.BasePartial.<init>(BasePartial.java:79)
	at org.joda.time.YearMonthDay.<init>(YearMonthDay.java:182)
	at org.joda.time.TestYearMonthDay_Basics.testGetFields(TestYearMonthDay_Basics.java:140)

testToInterval(org.joda.time.TestYearMonthDay_Basics)  Time elapsed: 0.001 sec  <<< ERROR!
IllegalArgumentException: The instant is below the supported minimum of 1686-01-01T00:00:00.���Z (CopticChronology[UTC])
	at org.joda.time.chrono.LimitChronology.checkLimits(LimitChronology.java:286)
	at org.joda.time.chrono.LimitChronology$LimitDateTimeField.set(LimitChronology.java:510)
	at org.joda.time.chrono.ZonedChronology$ZonedDateTimeField.set(ZonedChronology.java:482)
	at org.joda.time.chrono.BaseChronology.set(BaseChronology.java:240)
	at org.joda.time.YearMonthDay.toDateTime(YearMonthDay.java:772)
	at org.joda.time.YearMonthDay.toDateTime(YearMonthDay.java:753)
	at org.joda.time.TestYearMonthDay_Basics.testToInterval(TestYearMonthDay_Basics.java:716)

testIsSupported(org.joda.time.TestYearMonthDay_Basics)  Time elapsed: 0 sec  <<< ERROR!
IllegalArgumentException: The instant is below the supported minimum of 1686-01-01T00:00:00.���Z (CopticChronology[UTC])
	at org.joda.time.chrono.LimitChronology.checkLimits(LimitChronology.java:286)
	at org.joda.time.chrono.LimitChronology$LimitDateTimeField.get(LimitChronology.java:462)
	at org.joda.time.chrono.ZonedChronology$ZonedDateTimeField.get(ZonedChronology.java:423)
	at org.joda.time.chrono.BaseChronology.get(BaseChronology.java:226)
	at org.joda.time.base.BasePartial.<init>(BasePartial.java:111)
	at org.joda.time.base.BasePartial.<init>(BasePartial.java:79)
	at org.joda.time.YearMonthDay.<init>(YearMonthDay.java:182)
	at org.joda.time.TestYearMonthDay_Basics.testIsSupported(TestYearMonthDay_Basics.java:171)

testGetField(org.joda.time.TestYearMonthDay_Basics)  Time elapsed: 0.001 sec  <<< ERROR!
IllegalArgumentException: The instant is below the supported minimum of 1686-01-01T00:00:00.���Z (CopticChronology[UTC])
	at org.joda.time.chrono.LimitChronology.checkLimits(LimitChronology.java:286)
	at org.joda.time.chrono.LimitChronology$LimitDateTimeField.get(LimitChronology.java:462)
	at org.joda.time.chrono.ZonedChronology$ZonedDateTimeField.get(ZonedChronology.java:423)
	at org.joda.time.chrono.BaseChronology.get(BaseChronology.java:226)
	at org.joda.time.base.BasePartial.<init>(BasePartial.java:111)
	at org.joda.time.base.BasePartial.<init>(BasePartial.java:79)
	at org.joda.time.YearMonthDay.<init>(YearMonthDay.java:182)
	at org.joda.time.TestYearMonthDay_Basics.testGetField(TestYearMonthDay_Basics.java:127)

testToDateTime_TOD(org.joda.time.TestYearMonthDay_Basics)  Time elapsed: 0.001 sec  <<< ERROR!
IllegalArgumentException: The instant is below the supported minimum of 1686-01-01T00:00:00.���Z (CopticChronology[UTC])
	at org.joda.time.chrono.LimitChronology.checkLimits(LimitChronology.java:286)
	at org.joda.time.chrono.LimitChronology$LimitDateTimeField.set(LimitChronology.java:510)
	at org.joda.time.chrono.ZonedChronology$ZonedDateTimeField.set(ZonedChronology.java:482)
	at org.joda.time.chrono.BaseChronology.set(BaseChronology.java:240)
	at org.joda.time.YearMonthDay.toDateTime(YearMonthDay.java:772)
	at org.joda.time.YearMonthDay.toDateTime(YearMonthDay.java:753)
	at org.joda.time.TestYearMonthDay_Basics.testToDateTime_TOD(TestYearMonthDay_Basics.java:608)

testToDateTime_nullTOD(org.joda.time.TestYearMonthDay_Basics)  Time elapsed: 0.001 sec  <<< ERROR!
org.joda.time.IllegalFieldValueException: Value 2005 for year is not supported: Illegal instant due to time zone offset transition (daylight savings time 'gap'): 1971-01-16T12:13:14.015 (Europe/London)
	at org.joda.time.chrono.ZonedChronology$ZonedDateTimeField.set(ZonedChronology.java:486)
	at org.joda.time.chrono.BaseChronology.set(BaseChronology.java:240)
	at org.joda.time.YearMonthDay.toDateTime(YearMonthDay.java:772)
	at org.joda.time.YearMonthDay.toDateTime(YearMonthDay.java:753)
	at org.joda.time.TestYearMonthDay_Basics.testToDateTime_nullTOD(TestYearMonthDay_Basics.java:619)
Caused by: org.joda.time.IllegalInstantException: Illegal instant due to time zone offset transition (daylight savings time 'gap'): 1971-01-16T12:13:14.015 (Europe/London)
	at org.joda.time.chrono.ZonedChronology$ZonedDateTimeField.set(ZonedChronology.java:485)
	... 30 more

testToDateTime_TOD_Zone(org.joda.time.TestYearMonthDay_Basics)  Time elapsed: 0.001 sec  <<< ERROR!
IllegalArgumentException: The instant is below the supported minimum of 1686-01-01T00:00:00.���Z (CopticChronology[UTC])
	at org.joda.time.chrono.LimitChronology.checkLimits(LimitChronology.java:286)
	at org.joda.time.chrono.LimitChronology$LimitDateTimeField.set(LimitChronology.java:510)
	at org.joda.time.chrono.ZonedChronology$ZonedDateTimeField.set(ZonedChronology.java:482)
	at org.joda.time.chrono.BaseChronology.set(BaseChronology.java:240)
	at org.joda.time.YearMonthDay.toDateTime(YearMonthDay.java:772)
	at org.joda.time.TestYearMonthDay_Basics.testToDateTime_TOD_Zone(TestYearMonthDay_Basics.java:630)

testToDateTime_TOD_nullZone(org.joda.time.TestYearMonthDay_Basics)  Time elapsed: 0.001 sec  <<< ERROR!
IllegalArgumentException: The instant is below the supported minimum of 1686-01-01T00:00:00.���Z (CopticChronology[UTC])
	at org.joda.time.chrono.LimitChronology.checkLimits(LimitChronology.java:286)
	at org.joda.time.chrono.LimitChronology$LimitDateTimeField.set(LimitChronology.java:510)
	at org.joda.time.chrono.ZonedChronology$ZonedDateTimeField.set(ZonedChronology.java:482)
	at org.joda.time.chrono.BaseChronology.set(BaseChronology.java:240)
	at org.joda.time.YearMonthDay.toDateTime(YearMonthDay.java:772)
	at org.joda.time.TestYearMonthDay_Basics.testToDateTime_TOD_nullZone(TestYearMonthDay_Basics.java:640)

testToDateTime_nullTOD_Zone(org.joda.time.TestYearMonthDay_Basics)  Time elapsed: 0.001 sec  <<< ERROR!
org.joda.time.IllegalFieldValueException: Value 2005 for year is not supported: Illegal instant due to time zone offset transition (daylight savings time 'gap'): 1971-01-16T12:13:14.015 (Asia/Tokyo)
	at org.joda.time.chrono.ZonedChronology$ZonedDateTimeField.set(ZonedChronology.java:486)
	at org.joda.time.chrono.BaseChronology.set(BaseChronology.java:240)
	at org.joda.time.YearMonthDay.toDateTime(YearMonthDay.java:772)
	at org.joda.time.TestYearMonthDay_Basics.testToDateTime_nullTOD_Zone(TestYearMonthDay_Basics.java:651)
Caused by: org.joda.time.IllegalInstantException: Illegal instant due to time zone offset transition (daylight savings time 'gap'): 1971-01-16T12:13:14.015 (Asia/Tokyo)
	at org.joda.time.chrono.ZonedChronology$ZonedDateTimeField.set(ZonedChronology.java:485)
	... 29 more

testGetFieldType(org.joda.time.TestYearMonthDay_Basics)  Time elapsed: 0.002 sec  <<< ERROR!
IllegalArgumentException: The instant is below the supported minimum of 1686-01-01T00:00:00.���Z (CopticChronology[UTC])
	at org.joda.time.chrono.LimitChronology.checkLimits(LimitChronology.java:286)
	at org.joda.time.chrono.LimitChronology$LimitDateTimeField.get(LimitChronology.java:462)
	at org.joda.time.chrono.ZonedChronology$ZonedDateTimeField.get(ZonedChronology.java:423)
	at org.joda.time.chrono.BaseChronology.get(BaseChronology.java:226)
	at org.joda.time.base.BasePartial.<init>(BasePartial.java:111)
	at org.joda.time.base.BasePartial.<init>(BasePartial.java:79)
	at org.joda.time.YearMonthDay.<init>(YearMonthDay.java:182)
	at org.joda.time.TestYearMonthDay_Basics.testGetFieldType(TestYearMonthDay_Basics.java:105)

testToDateTimeAtCurrentTime(org.joda.time.TestYearMonthDay_Basics)  Time elapsed: 0.001 sec  <<< ERROR!
org.joda.time.IllegalFieldValueException: Value 2005 for year is not supported: Illegal instant due to time zone offset transition (daylight savings time 'gap'): 2004-06-08T06:07:08.009 (Europe/London)
	at org.joda.time.chrono.ZonedChronology$ZonedDateTimeField.set(ZonedChronology.java:486)
	at org.joda.time.chrono.BaseChronology.set(BaseChronology.java:240)
	at org.joda.time.YearMonthDay.toDateTimeAtCurrentTime(YearMonthDay.java:714)
	at org.joda.time.YearMonthDay.toDateTimeAtCurrentTime(YearMonthDay.java:697)
	at org.joda.time.TestYearMonthDay_Basics.testToDateTimeAtCurrentTime(TestYearMonthDay_Basics.java:565)
Caused by: org.joda.time.IllegalInstantException: Illegal instant due to time zone offset transition (daylight savings time 'gap'): 2004-06-08T06:07:08.009 (Europe/London)
	at org.joda.time.chrono.ZonedChronology$ZonedDateTimeField.set(ZonedChronology.java:485)
	... 30 more

testToDateTimeAtCurrentTime_Zone(org.joda.time.TestYearMonthDay_Basics)  Time elapsed: 0.001 sec  <<< ERROR!
org.joda.time.IllegalFieldValueException: Value 2005 for year is not supported: Illegal instant due to time zone offset transition (daylight savings time 'gap'): 2004-06-08T14:07:08.009 (Asia/Tokyo)
	at org.joda.time.chrono.ZonedChronology$ZonedDateTimeField.set(ZonedChronology.java:486)
	at org.joda.time.chrono.BaseChronology.set(BaseChronology.java:240)
	at org.joda.time.YearMonthDay.toDateTimeAtCurrentTime(YearMonthDay.java:714)
	at org.joda.time.TestYearMonthDay_Basics.testToDateTimeAtCurrentTime_Zone(TestYearMonthDay_Basics.java:580)
Caused by: org.joda.time.IllegalInstantException: Illegal instant due to time zone offset transition (daylight savings time 'gap'): 2004-06-08T14:07:08.009 (Asia/Tokyo)
	at org.joda.time.chrono.ZonedChronology$ZonedDateTimeField.set(ZonedChronology.java:485)
	... 29 more

testToDateTimeAtCurrentTime_nullZone(org.joda.time.TestYearMonthDay_Basics)  Time elapsed: 0.001 sec  <<< ERROR!
org.joda.time.IllegalFieldValueException: Value 2005 for year is not supported: Illegal instant due to time zone offset transition (daylight savings time 'gap'): 2004-06-08T06:07:08.009 (Europe/London)
	at org.joda.time.chrono.ZonedChronology$ZonedDateTimeField.set(ZonedChronology.java:486)
	at org.joda.time.chrono.BaseChronology.set(BaseChronology.java:240)
	at org.joda.time.YearMonthDay.toDateTimeAtCurrentTime(YearMonthDay.java:714)
	at org.joda.time.TestYearMonthDay_Basics.testToDateTimeAtCurrentTime_nullZone(TestYearMonthDay_Basics.java:594)
Caused by: org.joda.time.IllegalInstantException: Illegal instant due to time zone offset transition (daylight savings time 'gap'): 2004-06-08T06:07:08.009 (Europe/London)
	at org.joda.time.chrono.ZonedChronology$ZonedDateTimeField.set(ZonedChronology.java:485)
	... 29 more

testToInterval_Zone(org.joda.time.TestYearMonthDay_Basics)  Time elapsed: 0.001 sec  <<< ERROR!
IllegalArgumentException: The instant is below the supported minimum of 1686-01-01T00:00:00.���Z (CopticChronology[UTC])
	at org.joda.time.chrono.LimitChronology.checkLimits(LimitChronology.java:286)
	at org.joda.time.chrono.LimitChronology$LimitDateTimeField.set(LimitChronology.java:510)
	at org.joda.time.chrono.ZonedChronology$ZonedDateTimeField.set(ZonedChronology.java:482)
	at org.joda.time.chrono.BaseChronology.set(BaseChronology.java:240)
	at org.joda.time.YearMonthDay.toDateTime(YearMonthDay.java:772)
	at org.joda.time.TestYearMonthDay_Basics.testToInterval_Zone(TestYearMonthDay_Basics.java:727)

testToInterval_nullZone(org.joda.time.TestYearMonthDay_Basics)  Time elapsed: 0.002 sec  <<< ERROR!
IllegalArgumentException: The instant is below the supported minimum of 1686-01-01T00:00:00.���Z (CopticChronology[UTC])
	at org.joda.time.chrono.LimitChronology.checkLimits(LimitChronology.java:286)
	at org.joda.time.chrono.LimitChronology$LimitDateTimeField.set(LimitChronology.java:510)
	at org.joda.time.chrono.ZonedChronology$ZonedDateTimeField.set(ZonedChronology.java:482)
	at org.joda.time.chrono.BaseChronology.set(BaseChronology.java:240)
	at org.joda.time.YearMonthDay.toDateTime(YearMonthDay.java:772)
	at org.joda.time.TestYearMonthDay_Basics.testToInterval_nullZone(TestYearMonthDay_Basics.java:737)

testGetFieldTypes(org.joda.time.TestYearMonth_Basics)  Time elapsed: 0.001 sec  <<< ERROR!
IllegalArgumentException: The instant is below the supported minimum of 1686-01-01T00:00:00.���Z (CopticChronology[UTC])
	at org.joda.time.chrono.LimitChronology.checkLimits(LimitChronology.java:286)
	at org.joda.time.chrono.LimitChronology$LimitDateTimeField.get(LimitChronology.java:462)
	at org.joda.time.chrono.ZonedChronology$ZonedDateTimeField.get(ZonedChronology.java:423)
	at org.joda.time.chrono.BaseChronology.get(BaseChronology.java:226)
	at org.joda.time.base.BasePartial.<init>(BasePartial.java:111)
	at org.joda.time.base.BasePartial.<init>(BasePartial.java:79)
	at org.joda.time.YearMonth.<init>(YearMonth.java:243)
	at org.joda.time.TestYearMonth_Basics.testGetFieldTypes(TestYearMonth_Basics.java:120)

testGetFields(org.joda.time.TestYearMonth_Basics)  Time elapsed: 0.001 sec  <<< ERROR!
IllegalArgumentException: The instant is below the supported minimum of 1686-01-01T00:00:00.���Z (CopticChronology[UTC])
	at org.joda.time.chrono.LimitChronology.checkLimits(LimitChronology.java:286)
	at org.joda.time.chrono.LimitChronology$LimitDateTimeField.get(LimitChronology.java:462)
	at org.joda.time.chrono.ZonedChronology$ZonedDateTimeField.get(ZonedChronology.java:423)
	at org.joda.time.chrono.BaseChronology.get(BaseChronology.java:226)
	at org.joda.time.base.BasePartial.<init>(BasePartial.java:111)
	at org.joda.time.base.BasePartial.<init>(BasePartial.java:79)
	at org.joda.time.YearMonth.<init>(YearMonth.java:243)
	at org.joda.time.TestYearMonth_Basics.testGetFields(TestYearMonth_Basics.java:141)

testIsSupported(org.joda.time.TestYearMonth_Basics)  Time elapsed: 0.001 sec  <<< ERROR!
IllegalArgumentException: The instant is below the supported minimum of 1686-01-01T00:00:00.���Z (CopticChronology[UTC])
	at org.joda.time.chrono.LimitChronology.checkLimits(LimitChronology.java:286)
	at org.joda.time.chrono.LimitChronology$LimitDateTimeField.get(LimitChronology.java:462)
	at org.joda.time.chrono.ZonedChronology$ZonedDateTimeField.get(ZonedChronology.java:423)
	at org.joda.time.chrono.BaseChronology.get(BaseChronology.java:226)
	at org.joda.time.base.BasePartial.<init>(BasePartial.java:111)
	at org.joda.time.base.BasePartial.<init>(BasePartial.java:79)
	at org.joda.time.YearMonth.<init>(YearMonth.java:243)
	at org.joda.time.TestYearMonth_Basics.testIsSupported(TestYearMonth_Basics.java:171)

testGetField(org.joda.time.TestYearMonth_Basics)  Time elapsed: 0.001 sec  <<< ERROR!
IllegalArgumentException: The instant is below the supported minimum of 1686-01-01T00:00:00.���Z (CopticChronology[UTC])
	at org.joda.time.chrono.LimitChronology.checkLimits(LimitChronology.java:286)
	at org.joda.time.chrono.LimitChronology$LimitDateTimeField.get(LimitChronology.java:462)
	at org.joda.time.chrono.ZonedChronology$ZonedDateTimeField.get(ZonedChronology.java:423)
	at org.joda.time.chrono.BaseChronology.get(BaseChronology.java:226)
	at org.joda.time.base.BasePartial.<init>(BasePartial.java:111)
	at org.joda.time.base.BasePartial.<init>(BasePartial.java:79)
	at org.joda.time.YearMonth.<init>(YearMonth.java:243)
	at org.joda.time.TestYearMonth_Basics.testGetField(TestYearMonth_Basics.java:129)

testGetFieldType(org.joda.time.TestYearMonth_Basics)  Time elapsed: 0.001 sec  <<< ERROR!
IllegalArgumentException: The instant is below the supported minimum of 1686-01-01T00:00:00.���Z (CopticChronology[UTC])
	at org.joda.time.chrono.LimitChronology.checkLimits(LimitChronology.java:286)
	at org.joda.time.chrono.LimitChronology$LimitDateTimeField.get(LimitChronology.java:462)
	at org.joda.time.chrono.ZonedChronology$ZonedDateTimeField.get(ZonedChronology.java:423)
	at org.joda.time.chrono.BaseChronology.get(BaseChronology.java:226)
	at org.joda.time.base.BasePartial.<init>(BasePartial.java:111)
	at org.joda.time.base.BasePartial.<init>(BasePartial.java:79)
	at org.joda.time.YearMonth.<init>(YearMonth.java:243)
	at org.joda.time.TestYearMonth_Basics.testGetFieldType(TestYearMonth_Basics.java:108)

testToLocalDate(org.joda.time.TestMonthDay_Basics)  Time elapsed: 0.001 sec  <<< FAILURE!
junit.framework.AssertionFailedError
	at junit.framework.Assert.fail(Assert.java:47)
	at junit.framework.Assert.fail(Assert.java:53)
	at org.joda.time.TestMonthDay_Basics.testToLocalDate(TestMonthDay_Basics.java:705)

testGetFieldTypes(org.joda.time.TestMonthDay_Basics)  Time elapsed: 0.001 sec  <<< ERROR!
IllegalArgumentException: The instant is below the supported minimum of 1686-01-01T00:00:00.���Z (CopticChronology[UTC])
	at org.joda.time.chrono.LimitChronology.checkLimits(LimitChronology.java:286)
	at org.joda.time.chrono.LimitChronology$LimitDateTimeField.get(LimitChronology.java:462)
	at org.joda.time.chrono.ZonedChronology$ZonedDateTimeField.get(ZonedChronology.java:423)
	at org.joda.time.chrono.BaseChronology.get(BaseChronology.java:226)
	at org.joda.time.base.BasePartial.<init>(BasePartial.java:111)
	at org.joda.time.base.BasePartial.<init>(BasePartial.java:79)
	at org.joda.time.MonthDay.<init>(MonthDay.java:251)
	at org.joda.time.TestMonthDay_Basics.testGetFieldTypes(TestMonthDay_Basics.java:119)

testGetFields(org.joda.time.TestMonthDay_Basics)  Time elapsed: 0.001 sec  <<< ERROR!
IllegalArgumentException: The instant is below the supported minimum of 1686-01-01T00:00:00.���Z (CopticChronology[UTC])
	at org.joda.time.chrono.LimitChronology.checkLimits(LimitChronology.java:286)
	at org.joda.time.chrono.LimitChronology$LimitDateTimeField.get(LimitChronology.java:462)
	at org.joda.time.chrono.ZonedChronology$ZonedDateTimeField.get(ZonedChronology.java:423)
	at org.joda.time.chrono.BaseChronology.get(BaseChronology.java:226)
	at org.joda.time.base.BasePartial.<init>(BasePartial.java:111)
	at org.joda.time.base.BasePartial.<init>(BasePartial.java:79)
	at org.joda.time.MonthDay.<init>(MonthDay.java:251)
	at org.joda.time.TestMonthDay_Basics.testGetFields(TestMonthDay_Basics.java:140)

testIsSupported(org.joda.time.TestMonthDay_Basics)  Time elapsed: 0.001 sec  <<< ERROR!
IllegalArgumentException: The instant is below the supported minimum of 1686-01-01T00:00:00.���Z (CopticChronology[UTC])
	at org.joda.time.chrono.LimitChronology.checkLimits(LimitChronology.java:286)
	at org.joda.time.chrono.LimitChronology$LimitDateTimeField.get(LimitChronology.java:462)
	at org.joda.time.chrono.ZonedChronology$ZonedDateTimeField.get(ZonedChronology.java:423)
	at org.joda.time.chrono.BaseChronology.get(BaseChronology.java:226)
	at org.joda.time.base.BasePartial.<init>(BasePartial.java:111)
	at org.joda.time.base.BasePartial.<init>(BasePartial.java:79)
	at org.joda.time.MonthDay.<init>(MonthDay.java:251)
	at org.joda.time.TestMonthDay_Basics.testIsSupported(TestMonthDay_Basics.java:170)

testGetField(org.joda.time.TestMonthDay_Basics)  Time elapsed: 0.001 sec  <<< ERROR!
IllegalArgumentException: The instant is below the supported minimum of 1686-01-01T00:00:00.���Z (CopticChronology[UTC])
	at org.joda.time.chrono.LimitChronology.checkLimits(LimitChronology.java:286)
	at org.joda.time.chrono.LimitChronology$LimitDateTimeField.get(LimitChronology.java:462)
	at org.joda.time.chrono.ZonedChronology$ZonedDateTimeField.get(ZonedChronology.java:423)
	at org.joda.time.chrono.BaseChronology.get(BaseChronology.java:226)
	at org.joda.time.base.BasePartial.<init>(BasePartial.java:111)
	at org.joda.time.base.BasePartial.<init>(BasePartial.java:79)
	at org.joda.time.MonthDay.<init>(MonthDay.java:251)
	at org.joda.time.TestMonthDay_Basics.testGetField(TestMonthDay_Basics.java:128)

testGetFieldType(org.joda.time.TestMonthDay_Basics)  Time elapsed: 0.001 sec  <<< ERROR!
IllegalArgumentException: The instant is below the supported minimum of 1686-01-01T00:00:00.���Z (CopticChronology[UTC])
	at org.joda.time.chrono.LimitChronology.checkLimits(LimitChronology.java:286)
	at org.joda.time.chrono.LimitChronology$LimitDateTimeField.get(LimitChronology.java:462)
	at org.joda.time.chrono.ZonedChronology$ZonedDateTimeField.get(ZonedChronology.java:423)
	at org.joda.time.chrono.BaseChronology.get(BaseChronology.java:226)
	at org.joda.time.base.BasePartial.<init>(BasePartial.java:111)
	at org.joda.time.base.BasePartial.<init>(BasePartial.java:79)
	at org.joda.time.MonthDay.<init>(MonthDay.java:251)
	at org.joda.time.TestMonthDay_Basics.testGetFieldType(TestMonthDay_Basics.java:106)

testGetIntervalChronology_RI_RI(org.joda.time.TestDateTimeUtils)  Time elapsed: 0 sec  <<< ERROR!
IllegalArgumentException: The instant is below the supported minimum of 1686-01-01T00:00:00.���Z (CopticChronology[UTC])
	at org.joda.time.chrono.LimitChronology.checkLimits(LimitChronology.java:286)
	at org.joda.time.chrono.LimitChronology$LimitDateTimeField.get(LimitChronology.java:462)
	at org.joda.time.chrono.ZonedChronology$ZonedDateTimeField.get(ZonedChronology.java:423)
	at org.joda.time.base.BaseDateTime.<init>(BaseDateTime.java:129)
	at org.joda.time.DateTime.<init>(DateTime.java:236)
	at org.joda.time.TestDateTimeUtils.testGetIntervalChronology_RI_RI(TestDateTimeUtils.java:382)

testEpoch(org.joda.time.chrono.TestCopticChronology)  Time elapsed: 0.001 sec  <<< FAILURE!
junit.framework.AssertionFailedError: expected:<0284-08-29T00:00:00.000Z> but was:<1970-08-29T00:00:00.000Z>
	at junit.framework.Assert.fail(Assert.java:47)
	at junit.framework.Assert.failNotEquals(Assert.java:280)
	at junit.framework.Assert.assertEquals(Assert.java:64)
	at junit.framework.Assert.assertEquals(Assert.java:71)
	at org.joda.time.chrono.TestCopticChronology.testEpoch(TestCopticChronology.java:301)

testEra(org.joda.time.chrono.TestCopticChronology)  Time elapsed: 0 sec  <<< FAILURE!
junit.framework.AssertionFailedError
	at junit.framework.Assert.fail(Assert.java:47)
	at junit.framework.Assert.fail(Assert.java:53)
	at org.joda.time.chrono.TestCopticChronology.testEra(TestCopticChronology.java:308)

testCalendar(org.joda.time.chrono.TestCopticChronology)  Time elapsed: 0 sec  <<< FAILURE!
junit.framework.AssertionFailedError: expected:<1> but was:<1686>
	at junit.framework.Assert.fail(Assert.java:47)
	at junit.framework.Assert.failNotEquals(Assert.java:280)
	at junit.framework.Assert.assertEquals(Assert.java:64)
	at junit.framework.Assert.assertEquals(Assert.java:198)
	at junit.framework.Assert.assertEquals(Assert.java:204)
	at org.joda.time.chrono.TestCopticChronology.testCalendar(TestCopticChronology.java:354)

testSampleDate(org.joda.time.chrono.TestCopticChronology)  Time elapsed: 0.001 sec  <<< FAILURE!
junit.framework.AssertionFailedError: expected:<20> but was:<21>
	at junit.framework.Assert.fail(Assert.java:47)
	at junit.framework.Assert.failNotEquals(Assert.java:280)
	at junit.framework.Assert.assertEquals(Assert.java:64)
	at junit.framework.Assert.assertEquals(Assert.java:198)
	at junit.framework.Assert.assertEquals(Assert.java:204)
	at org.joda.time.chrono.TestCopticChronology.testSampleDate(TestCopticChronology.java:404)

testSampleDateWithZone(org.joda.time.chrono.TestCopticChronology)  Time elapsed: 0 sec  <<< FAILURE!
junit.framework.AssertionFailedError: expected:<1720> but was:<1721>
	at junit.framework.Assert.fail(Assert.java:47)
	at junit.framework.Assert.failNotEquals(Assert.java:280)
	at junit.framework.Assert.assertEquals(Assert.java:64)
	at junit.framework.Assert.assertEquals(Assert.java:198)
	at junit.framework.Assert.assertEquals(Assert.java:204)
	at org.joda.time.chrono.TestCopticChronology.testSampleDateWithZone(TestCopticChronology.java:468)

testDurationYear(org.joda.time.chrono.TestCopticChronology)  Time elapsed: 0.001 sec  <<< FAILURE!
junit.framework.AssertionFailedError: expected:<31536000000> but was:<0>
	at junit.framework.Assert.fail(Assert.java:47)
	at junit.framework.Assert.failNotEquals(Assert.java:280)
	at junit.framework.Assert.assertEquals(Assert.java:64)
	at junit.framework.Assert.assertEquals(Assert.java:133)
	at junit.framework.Assert.assertEquals(Assert.java:139)
	at org.joda.time.chrono.TestCopticChronology.testDurationYear(TestCopticChronology.java:488)

testDurationMonth(org.joda.time.chrono.TestCopticChronology)  Time elapsed: 0 sec  <<< FAILURE!
junit.framework.AssertionFailedError: expected:<5702400000> but was:<-25920000000>
	at junit.framework.Assert.fail(Assert.java:47)
	at junit.framework.Assert.failNotEquals(Assert.java:280)
	at junit.framework.Assert.assertEquals(Assert.java:64)
	at junit.framework.Assert.assertEquals(Assert.java:133)
	at junit.framework.Assert.assertEquals(Assert.java:139)
	at org.joda.time.chrono.TestCopticChronology.testDurationMonth(TestCopticChronology.java:541)

testGetPartialValues(org.joda.time.convert.TestDateConverter)  Time elapsed: 0.001 sec  <<< ERROR!
IllegalArgumentException: The instant is below the supported minimum of 1686-01-01T00:00:00.���Z (CopticChronology[UTC])
	at org.joda.time.chrono.LimitChronology.checkLimits(LimitChronology.java:286)
	at org.joda.time.chrono.LimitChronology$LimitDateTimeField.get(LimitChronology.java:462)
	at org.joda.time.chrono.ZonedChronology$ZonedDateTimeField.get(ZonedChronology.java:423)
	at org.joda.time.chrono.BaseChronology.get(BaseChronology.java:226)
	at org.joda.time.convert.TestDateConverter.testGetPartialValues(TestDateConverter.java:109)

testSetIntoPeriod_Object2(org.joda.time.convert.TestReadableIntervalConverter)  Time elapsed: 0 sec  <<< ERROR!
IllegalArgumentException: The minuend instant is below the supported minimum of 1686-01-01T00:00:00.���Z (CopticChronology[UTC])
	at org.joda.time.chrono.LimitChronology.checkLimits(LimitChronology.java:286)
	at org.joda.time.chrono.LimitChronology$LimitDurationField.getDifference(LimitChronology.java:430)
	at org.joda.time.chrono.ZonedChronology$ZonedDurationField.getDifference(ZonedChronology.java:329)
	at org.joda.time.chrono.BaseChronology.get(BaseChronology.java:260)
	at org.joda.time.convert.ReadableIntervalConverter.setInto(ReadableIntervalConverter.java:68)
	at org.joda.time.convert.TestReadableIntervalConverter.testSetIntoPeriod_Object2(TestReadableIntervalConverter.java:122)


Results :

Failed tests: 
  org.joda.time.TestLocalDateTime_Basics#testEqualsHashCode AssertionFailedError
  org.joda.time.TestLocalDateTime_Basics#testToDateTime AssertionFailedError exp...
  org.joda.time.TestLocalDateTime_Basics#testToDateTime_RI AssertionFailedError ...
  org.joda.time.TestLocalDateTime_Basics#testToDateTime_Zone AssertionFailedError
  org.joda.time.TestLocalDateTime_Basics#testToDateTime_nullRI AssertionFailedError
  org.joda.time.TestLocalDateTime_Basics#testToDateTime_nullZone AssertionFailedError
  org.joda.time.TestLocalDateTime_Basics#testToDate_summer AssertionFailedError ...
  org.joda.time.TestLocalDateTime_Basics#testToDate_summer_Zone AssertionFailedError
  org.joda.time.TestLocalDateTime_Basics#testToDate_winter AssertionFailedError ...
  org.joda.time.TestLocalDateTime_Basics#testToDate_winter_Zone AssertionFailedError
  org.joda.time.TestLocalDate_Basics#testEqualsHashCode AssertionFailedError exp...
  org.joda.time.TestLocalDate_Basics#testEqualsHashCodeAPI AssertionFailedError ...
  org.joda.time.TestLocalDate_Basics#testToDateMidnight AssertionFailedError exp...
  org.joda.time.TestLocalDate_Basics#testToDateMidnight_Zone AssertionFailedError
  org.joda.time.TestLocalDate_Basics#testToDateMidnight_nullZone AssertionFailedError
  org.joda.time.TestLocalDate_Basics#testToDateTimeAtMidnight AssertionFailedError
  org.joda.time.TestLocalDate_Basics#testToDateTimeAtMidnight_Zone AssertionFailedError
  org.joda.time.TestLocalDate_Basics#testToDateTimeAtMidnight_nullZone AssertionFailedError
  org.joda.time.TestLocalDate_Basics#testToDateTimeAtStartOfDay AssertionFailedError
  org.joda.time.TestLocalDate_Basics#testToDateTimeAtStartOfDay_Zone AssertionFailedError
  org.joda.time.TestLocalDate_Basics#testToDateTimeAtStartOfDay_nullZone AssertionFailedError
  org.joda.time.TestLocalDate_Basics#testToDateTime_RI AssertionFailedError expe...
  org.joda.time.TestLocalDate_Basics#testToDateTime_nullLocalTime AssertionFailedError
  org.joda.time.TestLocalDate_Basics#testToDateTime_nullLocalTime_Zone AssertionFailedError
  org.joda.time.TestLocalDate_Basics#testToDate_summer AssertionFailedError expe...
  org.joda.time.TestLocalDate_Basics#testToDate_winter AssertionFailedError expe...
  org.joda.time.TestLocalDate_Basics#testToInterval AssertionFailedError expecte...
  org.joda.time.TestLocalDate_Basics#testToInterval_Zone AssertionFailedError ex...
  org.joda.time.TestLocalDate_Basics#testToInterval_nullZone AssertionFailedError
  org.joda.time.TestMonthDay_Basics#testToLocalDate AssertionFailedError
  org.joda.time.TestMutablePeriod_Constructors#testConstructor_long_long_Chronology1 AssertionFailedError
  org.joda.time.TestMutablePeriod_Constructors#testConstructor_long_long_PeriodType_Chronology1 AssertionFailedError
  org.joda.time.TestPeriod_Constructors#testConstructor_long_long_Chronology1 AssertionFailedError
  org.joda.time.TestPeriod_Constructors#testConstructor_long_long_PeriodType_Chronology1 AssertionFailedError
  org.joda.time.chrono.TestCopticChronology#testCalendar AssertionFailedError ex...
  org.joda.time.chrono.TestCopticChronology#testDurationMonth AssertionFailedError
  org.joda.time.chrono.TestCopticChronology#testDurationYear AssertionFailedError
  org.joda.time.chrono.TestCopticChronology#testEpoch AssertionFailedError expec...
  org.joda.time.chrono.TestCopticChronology#testEra AssertionFailedError
  org.joda.time.chrono.TestCopticChronology#testSampleDate AssertionFailedError ...
  org.joda.time.chrono.TestCopticChronology#testSampleDateWithZone AssertionFailedError
Tests in error: 
  org.joda.time.TestDateMidnight_Properties#testPropertyEqualsHashCodeLenient LimitException
  org.joda.time.TestDateTimeUtils#testGetIntervalChronology_RI_RI LimitException
  org.joda.time.TestDateTime_Properties#testPropertyEqualsHashCodeLenient LimitException
  org.joda.time.TestInterval_Basics#testWithPeriodAfterStart1 IllegalArgumentException
  org.joda.time.TestInterval_Constructors#testConstructor_RI_RP3 IllegalArgumentException
  org.joda.time.TestLocalDateTime_Basics#testToLocalTime LimitException The inst...
  org.joda.time.TestLocalDate_Basics#testEqualsHashCodeLenient LimitException Th...
  org.joda.time.TestLocalDate_Basics#testGetFieldType_int LimitException The ins...
  org.joda.time.TestLocalDate_Basics#testGetFieldTypes LimitException The instan...
  org.joda.time.TestLocalDate_Basics#testGetField_int LimitException The instant...
  org.joda.time.TestLocalDate_Basics#testGetFields LimitException The instant is...
  org.joda.time.TestLocalDate_Basics#testIsSupported_DateTimeFieldType LimitException
  org.joda.time.TestLocalDate_Basics#testToDateTimeAtCurrentTime IllegalFieldValueException
  org.joda.time.TestLocalDate_Basics#testToDateTimeAtCurrentTime_Zone IllegalFieldValueException
  org.joda.time.TestLocalDate_Basics#testToDateTimeAtCurrentTime_nullZone IllegalFieldValueException
  org.joda.time.TestLocalDate_Basics#testToDateTime_LocalTime LimitException The...
  org.joda.time.TestLocalDate_Basics#testToDateTime_LocalTime_Zone LimitException
  org.joda.time.TestLocalDate_Basics#testToDateTime_LocalTime_nullZone LimitException
  org.joda.time.TestLocalDate_Basics#testToLocalDateTime_LocalTime LimitException
  org.joda.time.TestLocalDate_Properties#testPropertyEqualsHashCodeLenient LimitException
  org.joda.time.TestLocalTime_Basics#testEqualsHashCode LimitException The insta...
  org.joda.time.TestLocalTime_Basics#testGetField_int LimitException The instant...
  org.joda.time.TestLocalTime_Basics#testGetFields LimitException The instant is...
  org.joda.time.TestLocalTime_Basics#testGetValue_int LimitException The instant...
  org.joda.time.TestLocalTime_Basics#testGetValues LimitException The instant is...
  org.joda.time.TestLocalTime_Basics#testSerialization LimitException The instan...
  org.joda.time.TestLocalTime_Basics#testToDateTimeTodayDefaultZone LimitException
  org.joda.time.TestLocalTime_Basics#testToDateTimeToday_Zone LimitException The...
  org.joda.time.TestLocalTime_Basics#testToDateTimeToday_nullZone LimitException
  org.joda.time.TestLocalTime_Basics#testToDateTime_RI LimitException The instan...
  org.joda.time.TestMonthDay_Basics#testGetField LimitException The instant is b...
  org.joda.time.TestMonthDay_Basics#testGetFieldType LimitException The instant ...
  org.joda.time.TestMonthDay_Basics#testGetFieldTypes LimitException The instant...
  org.joda.time.TestMonthDay_Basics#testGetFields LimitException The instant is ...
  org.joda.time.TestMonthDay_Basics#testIsSupported LimitException The instant i...
  org.joda.time.TestTimeOfDay_Basics#testGetField LimitException The instant is ...
  org.joda.time.TestTimeOfDay_Basics#testGetFieldType LimitException The instant...
  org.joda.time.TestTimeOfDay_Basics#testGetFieldTypes LimitException The instan...
  org.joda.time.TestTimeOfDay_Basics#testGetFields LimitException The instant is...
  org.joda.time.TestTimeOfDay_Basics#testIsSupported LimitException The instant ...
  org.joda.time.TestTimeOfDay_Basics#testToLocalTime LimitException The instant ...
  org.joda.time.TestYearMonthDay_Basics#testGetField LimitException The instant ...
  org.joda.time.TestYearMonthDay_Basics#testGetFieldType LimitException The inst...
  org.joda.time.TestYearMonthDay_Basics#testGetFieldTypes LimitException The ins...
  org.joda.time.TestYearMonthDay_Basics#testGetFields LimitException The instant...
  org.joda.time.TestYearMonthDay_Basics#testIsSupported LimitException The insta...
  org.joda.time.TestYearMonthDay_Basics#testToDateTimeAtCurrentTime IllegalFieldValueException
  org.joda.time.TestYearMonthDay_Basics#testToDateTimeAtCurrentTime_Zone IllegalFieldValueException
  org.joda.time.TestYearMonthDay_Basics#testToDateTimeAtCurrentTime_nullZone IllegalFieldValueException
  org.joda.time.TestYearMonthDay_Basics#testToDateTime_TOD LimitException The in...
  org.joda.time.TestYearMonthDay_Basics#testToDateTime_TOD_Zone LimitException T...
  org.joda.time.TestYearMonthDay_Basics#testToDateTime_TOD_nullZone LimitException
  org.joda.time.TestYearMonthDay_Basics#testToDateTime_nullTOD IllegalFieldValueException
  org.joda.time.TestYearMonthDay_Basics#testToDateTime_nullTOD_Zone IllegalFieldValueException
  org.joda.time.TestYearMonthDay_Basics#testToInterval LimitException The instan...
  org.joda.time.TestYearMonthDay_Basics#testToInterval_Zone LimitException The i...
  org.joda.time.TestYearMonthDay_Basics#testToInterval_nullZone LimitException T...
  org.joda.time.TestYearMonth_Basics#testGetField LimitException The instant is ...
  org.joda.time.TestYearMonth_Basics#testGetFieldType LimitException The instant...
  org.joda.time.TestYearMonth_Basics#testGetFieldTypes LimitException The instan...
  org.joda.time.TestYearMonth_Basics#testGetFields LimitException The instant is...
  org.joda.time.TestYearMonth_Basics#testIsSupported LimitException The instant ...
  org.joda.time.convert.TestDateConverter#testGetPartialValues LimitException Th...
  org.joda.time.convert.TestReadableIntervalConverter#testSetIntoPeriod_Object2 LimitException

Tests run: 4157, Failures: 41, Errors: 64, Skipped: 0

[INFO] ------------------------------------------------------------------------
[INFO] BUILD FAILURE
[INFO] ------------------------------------------------------------------------
[INFO] Total time: 16.990s
[INFO] Finished at: Wed Aug 05 23:57:31 BST 2015
[INFO] Final Memory: 8M/213M
[INFO] ------------------------------------------------------------------------
[ERROR] Failed to execute goal org.apache.maven.plugins:maven-surefire-plugin:2.18.1:test (default-test) on project joda-time: There are test failures.
[ERROR] 
[ERROR] Please refer to /home/perham/Study/LittleDarwin/Cases/joda-time-2.8.1/target/surefire-reports for the individual test results.
[ERROR] -> [Help 1]
[ERROR] 
[ERROR] To see the full stack trace of the errors, re-run Maven with the -e switch.
[ERROR] Re-run Maven using the -X switch to enable full debug logging.
[ERROR] 
[ERROR] For more information about the errors and possible solutions, please read the following articles:
[ERROR] [Help 1] http://cwiki.apache.org/confluence/display/MAVEN/MojoFailureException
