[INFO] Scanning for projects...
[INFO]                                                                         
[INFO] ------------------------------------------------------------------------
[INFO] Building Joda-Time 2.8.1
[INFO] ------------------------------------------------------------------------
[INFO] 
[INFO] --- maven-resources-plugin:2.7:resources (default-resources) @ joda-time ---
[INFO] Using 'UTF-8' encoding to copy filtered resources.
[INFO] Copying 2 resources to META-INF
[INFO] Copying 10 resources
[INFO] 
[INFO] --- maven-compiler-plugin:3.3:compile (default-compile) @ joda-time ---
[INFO] Changes detected - recompiling the module!
[INFO] Compiling 166 source files to /home/perham/Study/LittleDarwin/Cases/joda-time-2.8.1/target/classes
[INFO] 
[INFO] --- exec-maven-plugin:1.4.0:java (compile-tzdb) @ joda-time ---
Writing zoneinfo files
Writing ZoneInfoMap
[INFO] 
[INFO] --- maven-resources-plugin:2.7:testResources (default-testResources) @ joda-time ---
[INFO] Using 'UTF-8' encoding to copy filtered resources.
[INFO] Copying 34 resources
[INFO] 
[INFO] --- maven-compiler-plugin:3.3:testCompile (default-testCompile) @ joda-time ---
[INFO] Nothing to compile - all classes are up to date
[INFO] 
[INFO] --- maven-surefire-plugin:2.18.1:test (default-test) @ joda-time ---
[INFO] Surefire report directory: /home/perham/Study/LittleDarwin/Cases/joda-time-2.8.1/target/surefire-reports

-------------------------------------------------------
 T E S T S
-------------------------------------------------------
Running org.joda.time.TestAllPackages

TestBuddhistChronology.testCalendar

TestCopticChronology.testCalendar

TestEthiopicChronology.testCalendar

TestIslamicChronology.testCalendar

Testing Gregorian chronology over 1000 iterations
100% complete (i=1000)

Testing Julian chronology over 1000 iterations
100% complete (i=1000)
Writing zoneinfo files
Writing ZoneInfoMap
Tests run: 4157, Failures: 25, Errors: 94, Skipped: 0, Time elapsed: 4.813 sec <<< FAILURE! - in org.joda.time.TestAllPackages
testWithTime_int_int_int_int(org.joda.time.TestDateTime_Basics)  Time elapsed: 0.004 sec  <<< FAILURE!
junit.framework.AssertionFailedError: expected:<1018009440000> but was:<1018005840000>
	at junit.framework.Assert.fail(Assert.java:47)
	at junit.framework.Assert.failNotEquals(Assert.java:280)
	at junit.framework.Assert.assertEquals(Assert.java:64)
	at junit.framework.Assert.assertEquals(Assert.java:133)
	at junit.framework.Assert.assertEquals(Assert.java:139)
	at org.joda.time.TestDateTime_Basics.testWithTime_int_int_int_int(TestDateTime_Basics.java:883)

testWithTime_LocalTime(org.joda.time.TestDateTime_Basics)  Time elapsed: 0.001 sec  <<< FAILURE!
junit.framework.AssertionFailedError: expected:<1018009440000> but was:<1018005840000>
	at junit.framework.Assert.fail(Assert.java:47)
	at junit.framework.Assert.failNotEquals(Assert.java:280)
	at junit.framework.Assert.assertEquals(Assert.java:64)
	at junit.framework.Assert.assertEquals(Assert.java:133)
	at junit.framework.Assert.assertEquals(Assert.java:139)
	at org.joda.time.TestDateTime_Basics.testWithTime_LocalTime(TestDateTime_Basics.java:904)

testToDateTimeISO(org.joda.time.TestDateTime_Basics)  Time elapsed: 0.001 sec  <<< FAILURE!
junit.framework.AssertionFailedError: expected not same
	at junit.framework.Assert.fail(Assert.java:47)
	at junit.framework.Assert.failSame(Assert.java:269)
	at junit.framework.Assert.assertNotSame(Assert.java:255)
	at junit.framework.Assert.assertNotSame(Assert.java:262)
	at org.joda.time.TestDateTime_Basics.testToDateTimeISO(TestDateTime_Basics.java:564)

testConstructor_ObjectLocalDateTime(org.joda.time.TestLocalDateTime_Constructors)  Time elapsed: 0 sec  <<< FAILURE!
junit.framework.AssertionFailedError: expected:<null> but was:<ISOChronology[UTC]>
	at junit.framework.Assert.fail(Assert.java:47)
	at junit.framework.Assert.failNotEquals(Assert.java:280)
	at junit.framework.Assert.assertEquals(Assert.java:64)
	at junit.framework.Assert.assertEquals(Assert.java:71)
	at org.joda.time.TestLocalDateTime_Constructors.testConstructor_ObjectLocalDateTime(TestLocalDateTime_Constructors.java:472)

testConstructor_Object_Chronology_crossChronology(org.joda.time.TestLocalDateTime_Constructors)  Time elapsed: 0.002 sec  <<< FAILURE!
junit.framework.AssertionFailedError: expected:<null> but was:<ISOChronology[UTC]>
	at junit.framework.Assert.fail(Assert.java:47)
	at junit.framework.Assert.failNotEquals(Assert.java:280)
	at junit.framework.Assert.assertEquals(Assert.java:64)
	at junit.framework.Assert.assertEquals(Assert.java:71)
	at org.joda.time.TestLocalDateTime_Constructors.testConstructor_Object_Chronology_crossChronology(TestLocalDateTime_Constructors.java:594)

testPlus_RP(org.joda.time.TestLocalDateTime_Basics)  Time elapsed: 0 sec  <<< ERROR!
java.lang.NullPointerException
	at org.joda.time.LocalDateTime.<init>(LocalDateTime.java:511)
	at org.joda.time.TestLocalDateTime_Basics.testPlus_RP(TestLocalDateTime_Basics.java:534)

testPlusYears_int(org.joda.time.TestLocalDateTime_Basics)  Time elapsed: 0 sec  <<< ERROR!
java.lang.NullPointerException
	at org.joda.time.LocalDateTime.<init>(LocalDateTime.java:511)
	at org.joda.time.TestLocalDateTime_Basics.testPlusYears_int(TestLocalDateTime_Basics.java:544)

testPlusMonths_int(org.joda.time.TestLocalDateTime_Basics)  Time elapsed: 0 sec  <<< ERROR!
java.lang.NullPointerException
	at org.joda.time.LocalDateTime.<init>(LocalDateTime.java:511)
	at org.joda.time.TestLocalDateTime_Basics.testPlusMonths_int(TestLocalDateTime_Basics.java:554)

testPlusWeeks_int(org.joda.time.TestLocalDateTime_Basics)  Time elapsed: 0 sec  <<< ERROR!
java.lang.NullPointerException
	at org.joda.time.LocalDateTime.<init>(LocalDateTime.java:511)
	at org.joda.time.TestLocalDateTime_Basics.testPlusWeeks_int(TestLocalDateTime_Basics.java:564)

testPlusDays_int(org.joda.time.TestLocalDateTime_Basics)  Time elapsed: 0 sec  <<< ERROR!
java.lang.NullPointerException
	at org.joda.time.LocalDateTime.<init>(LocalDateTime.java:511)
	at org.joda.time.TestLocalDateTime_Basics.testPlusDays_int(TestLocalDateTime_Basics.java:574)

testPlusHours_int(org.joda.time.TestLocalDateTime_Basics)  Time elapsed: 0.001 sec  <<< ERROR!
java.lang.NullPointerException
	at org.joda.time.LocalDateTime.<init>(LocalDateTime.java:511)
	at org.joda.time.TestLocalDateTime_Basics.testPlusHours_int(TestLocalDateTime_Basics.java:584)

testPlusMinutes_int(org.joda.time.TestLocalDateTime_Basics)  Time elapsed: 0 sec  <<< ERROR!
java.lang.NullPointerException
	at org.joda.time.LocalDateTime.<init>(LocalDateTime.java:511)
	at org.joda.time.TestLocalDateTime_Basics.testPlusMinutes_int(TestLocalDateTime_Basics.java:594)

testPlusSeconds_int(org.joda.time.TestLocalDateTime_Basics)  Time elapsed: 0.001 sec  <<< ERROR!
java.lang.NullPointerException
	at org.joda.time.LocalDateTime.<init>(LocalDateTime.java:511)
	at org.joda.time.TestLocalDateTime_Basics.testPlusSeconds_int(TestLocalDateTime_Basics.java:604)

testPlusMillis_int(org.joda.time.TestLocalDateTime_Basics)  Time elapsed: 0 sec  <<< ERROR!
java.lang.NullPointerException
	at org.joda.time.LocalDateTime.<init>(LocalDateTime.java:511)
	at org.joda.time.TestLocalDateTime_Basics.testPlusMillis_int(TestLocalDateTime_Basics.java:614)

testMinus_RP(org.joda.time.TestLocalDateTime_Basics)  Time elapsed: 0.001 sec  <<< ERROR!
java.lang.NullPointerException
	at org.joda.time.LocalDateTime.<init>(LocalDateTime.java:511)
	at org.joda.time.TestLocalDateTime_Basics.testMinus_RP(TestLocalDateTime_Basics.java:625)

testMinusYears_int(org.joda.time.TestLocalDateTime_Basics)  Time elapsed: 0 sec  <<< ERROR!
java.lang.NullPointerException
	at org.joda.time.LocalDateTime.<init>(LocalDateTime.java:511)
	at org.joda.time.TestLocalDateTime_Basics.testMinusYears_int(TestLocalDateTime_Basics.java:636)

testMinusMonths_int(org.joda.time.TestLocalDateTime_Basics)  Time elapsed: 0.001 sec  <<< ERROR!
java.lang.NullPointerException
	at org.joda.time.LocalDateTime.<init>(LocalDateTime.java:511)
	at org.joda.time.TestLocalDateTime_Basics.testMinusMonths_int(TestLocalDateTime_Basics.java:646)

testMinusWeeks_int(org.joda.time.TestLocalDateTime_Basics)  Time elapsed: 0 sec  <<< ERROR!
java.lang.NullPointerException
	at org.joda.time.LocalDateTime.<init>(LocalDateTime.java:511)
	at org.joda.time.TestLocalDateTime_Basics.testMinusWeeks_int(TestLocalDateTime_Basics.java:656)

testMinusDays_int(org.joda.time.TestLocalDateTime_Basics)  Time elapsed: 0.001 sec  <<< ERROR!
java.lang.NullPointerException
	at org.joda.time.LocalDateTime.<init>(LocalDateTime.java:511)
	at org.joda.time.TestLocalDateTime_Basics.testMinusDays_int(TestLocalDateTime_Basics.java:666)

testMinusHours_int(org.joda.time.TestLocalDateTime_Basics)  Time elapsed: 0 sec  <<< ERROR!
java.lang.NullPointerException
	at org.joda.time.LocalDateTime.<init>(LocalDateTime.java:511)
	at org.joda.time.TestLocalDateTime_Basics.testMinusHours_int(TestLocalDateTime_Basics.java:676)

testMinusMinutes_int(org.joda.time.TestLocalDateTime_Basics)  Time elapsed: 0.001 sec  <<< ERROR!
java.lang.NullPointerException
	at org.joda.time.LocalDateTime.<init>(LocalDateTime.java:511)
	at org.joda.time.TestLocalDateTime_Basics.testMinusMinutes_int(TestLocalDateTime_Basics.java:686)

testMinusSeconds_int(org.joda.time.TestLocalDateTime_Basics)  Time elapsed: 0 sec  <<< ERROR!
java.lang.NullPointerException
	at org.joda.time.LocalDateTime.<init>(LocalDateTime.java:511)
	at org.joda.time.TestLocalDateTime_Basics.testMinusSeconds_int(TestLocalDateTime_Basics.java:696)

testMinusMillis_int(org.joda.time.TestLocalDateTime_Basics)  Time elapsed: 0 sec  <<< ERROR!
java.lang.NullPointerException
	at org.joda.time.LocalDateTime.<init>(LocalDateTime.java:511)
	at org.joda.time.TestLocalDateTime_Basics.testMinusMillis_int(TestLocalDateTime_Basics.java:706)

testConstructor_ObjectYearMonthDay(org.joda.time.TestLocalDate_Constructors)  Time elapsed: 0 sec  <<< FAILURE!
junit.framework.AssertionFailedError: expected:<null> but was:<ISOChronology[UTC]>
	at junit.framework.Assert.fail(Assert.java:47)
	at junit.framework.Assert.failNotEquals(Assert.java:280)
	at junit.framework.Assert.assertEquals(Assert.java:64)
	at junit.framework.Assert.assertEquals(Assert.java:71)
	at org.joda.time.TestLocalDate_Constructors.testConstructor_ObjectYearMonthDay(TestLocalDate_Constructors.java:435)

testConstructor_ObjectLocalDateTime(org.joda.time.TestLocalDate_Constructors)  Time elapsed: 0 sec  <<< FAILURE!
junit.framework.AssertionFailedError: expected:<null> but was:<ISOChronology[UTC]>
	at junit.framework.Assert.fail(Assert.java:47)
	at junit.framework.Assert.failNotEquals(Assert.java:280)
	at junit.framework.Assert.assertEquals(Assert.java:64)
	at junit.framework.Assert.assertEquals(Assert.java:71)
	at org.joda.time.TestLocalDate_Constructors.testConstructor_ObjectLocalDateTime(TestLocalDate_Constructors.java:425)

testConstructor_ObjectLocalDate(org.joda.time.TestLocalDate_Constructors)  Time elapsed: 0 sec  <<< FAILURE!
junit.framework.AssertionFailedError: expected:<null> but was:<ISOChronology[UTC]>
	at junit.framework.Assert.fail(Assert.java:47)
	at junit.framework.Assert.failNotEquals(Assert.java:280)
	at junit.framework.Assert.assertEquals(Assert.java:64)
	at junit.framework.Assert.assertEquals(Assert.java:71)
	at org.joda.time.TestLocalDate_Constructors.testConstructor_ObjectLocalDate(TestLocalDate_Constructors.java:408)

testConstructor_Object_Chronology_crossChronology(org.joda.time.TestLocalDate_Constructors)  Time elapsed: 0.001 sec  <<< FAILURE!
junit.framework.AssertionFailedError: expected:<null> but was:<ISOChronology[UTC]>
	at junit.framework.Assert.fail(Assert.java:47)
	at junit.framework.Assert.failNotEquals(Assert.java:280)
	at junit.framework.Assert.assertEquals(Assert.java:64)
	at junit.framework.Assert.assertEquals(Assert.java:71)
	at org.joda.time.TestLocalDate_Constructors.testConstructor_Object_Chronology_crossChronology(TestLocalDate_Constructors.java:488)

testPlus_RP(org.joda.time.TestLocalDate_Basics)  Time elapsed: 0 sec  <<< ERROR!
java.lang.NullPointerException
	at org.joda.time.LocalDate.<init>(LocalDate.java:457)
	at org.joda.time.TestLocalDate_Basics.testPlus_RP(TestLocalDate_Basics.java:518)

testPlusYears_int(org.joda.time.TestLocalDate_Basics)  Time elapsed: 0.001 sec  <<< ERROR!
java.lang.NullPointerException
	at org.joda.time.LocalDate.<init>(LocalDate.java:457)
	at org.joda.time.TestLocalDate_Basics.testPlusYears_int(TestLocalDate_Basics.java:528)

testPlusMonths_int(org.joda.time.TestLocalDate_Basics)  Time elapsed: 0.001 sec  <<< ERROR!
java.lang.NullPointerException
	at org.joda.time.LocalDate.<init>(LocalDate.java:457)
	at org.joda.time.TestLocalDate_Basics.testPlusMonths_int(TestLocalDate_Basics.java:538)

testPlusWeeks_int(org.joda.time.TestLocalDate_Basics)  Time elapsed: 0 sec  <<< ERROR!
java.lang.NullPointerException
	at org.joda.time.LocalDate.<init>(LocalDate.java:457)
	at org.joda.time.TestLocalDate_Basics.testPlusWeeks_int(TestLocalDate_Basics.java:548)

testPlusDays_int(org.joda.time.TestLocalDate_Basics)  Time elapsed: 0 sec  <<< ERROR!
java.lang.NullPointerException
	at org.joda.time.LocalDate.<init>(LocalDate.java:457)
	at org.joda.time.TestLocalDate_Basics.testPlusDays_int(TestLocalDate_Basics.java:558)

testMinus_RP(org.joda.time.TestLocalDate_Basics)  Time elapsed: 0 sec  <<< ERROR!
java.lang.NullPointerException
	at org.joda.time.LocalDate.<init>(LocalDate.java:457)
	at org.joda.time.TestLocalDate_Basics.testMinus_RP(TestLocalDate_Basics.java:569)

testMinusYears_int(org.joda.time.TestLocalDate_Basics)  Time elapsed: 0 sec  <<< ERROR!
java.lang.NullPointerException
	at org.joda.time.LocalDate.<init>(LocalDate.java:457)
	at org.joda.time.TestLocalDate_Basics.testMinusYears_int(TestLocalDate_Basics.java:583)

testMinusMonths_int(org.joda.time.TestLocalDate_Basics)  Time elapsed: 0.001 sec  <<< ERROR!
java.lang.NullPointerException
	at org.joda.time.LocalDate.<init>(LocalDate.java:457)
	at org.joda.time.TestLocalDate_Basics.testMinusMonths_int(TestLocalDate_Basics.java:593)

testMinusWeeks_int(org.joda.time.TestLocalDate_Basics)  Time elapsed: 0 sec  <<< ERROR!
java.lang.NullPointerException
	at org.joda.time.LocalDate.<init>(LocalDate.java:457)
	at org.joda.time.TestLocalDate_Basics.testMinusWeeks_int(TestLocalDate_Basics.java:603)

testMinusDays_int(org.joda.time.TestLocalDate_Basics)  Time elapsed: 0.002 sec  <<< ERROR!
java.lang.NullPointerException
	at org.joda.time.LocalDate.<init>(LocalDate.java:457)
	at org.joda.time.TestLocalDate_Basics.testMinusDays_int(TestLocalDate_Basics.java:613)

testToDateTime_wrongChronoLocalTime_Zone(org.joda.time.TestLocalDate_Basics)  Time elapsed: 0.001 sec  <<< ERROR!
java.lang.NullPointerException
	at org.joda.time.LocalTime.<init>(LocalTime.java:506)
	at org.joda.time.TestLocalDate_Basics.testToDateTime_wrongChronoLocalTime_Zone(TestLocalDate_Basics.java:893)

testConstructor_ObjectTimeOfDay(org.joda.time.TestLocalTime_Constructors)  Time elapsed: 0.001 sec  <<< FAILURE!
junit.framework.AssertionFailedError: expected:<null> but was:<ISOChronology[UTC]>
	at junit.framework.Assert.fail(Assert.java:47)
	at junit.framework.Assert.failNotEquals(Assert.java:280)
	at junit.framework.Assert.assertEquals(Assert.java:64)
	at junit.framework.Assert.assertEquals(Assert.java:71)
	at org.joda.time.TestLocalTime_Constructors.testConstructor_ObjectTimeOfDay(TestLocalTime_Constructors.java:492)

testConstructor_ObjectLocalDateTime(org.joda.time.TestLocalTime_Constructors)  Time elapsed: 0 sec  <<< FAILURE!
junit.framework.AssertionFailedError: expected:<null> but was:<ISOChronology[UTC]>
	at junit.framework.Assert.fail(Assert.java:47)
	at junit.framework.Assert.failNotEquals(Assert.java:280)
	at junit.framework.Assert.assertEquals(Assert.java:64)
	at junit.framework.Assert.assertEquals(Assert.java:71)
	at org.joda.time.TestLocalTime_Constructors.testConstructor_ObjectLocalDateTime(TestLocalTime_Constructors.java:481)

testConstructor_ObjectLocalTime(org.joda.time.TestLocalTime_Constructors)  Time elapsed: 0 sec  <<< FAILURE!
junit.framework.AssertionFailedError: expected:<null> but was:<ISOChronology[UTC]>
	at junit.framework.Assert.fail(Assert.java:47)
	at junit.framework.Assert.failNotEquals(Assert.java:280)
	at junit.framework.Assert.assertEquals(Assert.java:64)
	at junit.framework.Assert.assertEquals(Assert.java:71)
	at org.joda.time.TestLocalTime_Constructors.testConstructor_ObjectLocalTime(TestLocalTime_Constructors.java:463)

testPlus_RP(org.joda.time.TestLocalTime_Basics)  Time elapsed: 0 sec  <<< ERROR!
java.lang.NullPointerException
	at org.joda.time.LocalTime.<init>(LocalTime.java:506)
	at org.joda.time.TestLocalTime_Basics.testPlus_RP(TestLocalTime_Basics.java:539)

testPlusHours_int(org.joda.time.TestLocalTime_Basics)  Time elapsed: 0 sec  <<< ERROR!
java.lang.NullPointerException
	at org.joda.time.LocalTime.<init>(LocalTime.java:506)
	at org.joda.time.TestLocalTime_Basics.testPlusHours_int(TestLocalTime_Basics.java:549)

testPlusMinutes_int(org.joda.time.TestLocalTime_Basics)  Time elapsed: 0 sec  <<< ERROR!
java.lang.NullPointerException
	at org.joda.time.LocalTime.<init>(LocalTime.java:506)
	at org.joda.time.TestLocalTime_Basics.testPlusMinutes_int(TestLocalTime_Basics.java:559)

testPlusSeconds_int(org.joda.time.TestLocalTime_Basics)  Time elapsed: 0.001 sec  <<< ERROR!
java.lang.NullPointerException
	at org.joda.time.LocalTime.<init>(LocalTime.java:506)
	at org.joda.time.TestLocalTime_Basics.testPlusSeconds_int(TestLocalTime_Basics.java:569)

testPlusMillis_int(org.joda.time.TestLocalTime_Basics)  Time elapsed: 0 sec  <<< ERROR!
java.lang.NullPointerException
	at org.joda.time.LocalTime.<init>(LocalTime.java:506)
	at org.joda.time.TestLocalTime_Basics.testPlusMillis_int(TestLocalTime_Basics.java:579)

testMinus_RP(org.joda.time.TestLocalTime_Basics)  Time elapsed: 0.001 sec  <<< ERROR!
java.lang.NullPointerException
	at org.joda.time.LocalTime.<init>(LocalTime.java:506)
	at org.joda.time.TestLocalTime_Basics.testMinus_RP(TestLocalTime_Basics.java:590)

testMinusHours_int(org.joda.time.TestLocalTime_Basics)  Time elapsed: 0 sec  <<< ERROR!
java.lang.NullPointerException
	at org.joda.time.LocalTime.<init>(LocalTime.java:506)
	at org.joda.time.TestLocalTime_Basics.testMinusHours_int(TestLocalTime_Basics.java:600)

testMinusMinutes_int(org.joda.time.TestLocalTime_Basics)  Time elapsed: 0.001 sec  <<< ERROR!
java.lang.NullPointerException
	at org.joda.time.LocalTime.<init>(LocalTime.java:506)
	at org.joda.time.TestLocalTime_Basics.testMinusMinutes_int(TestLocalTime_Basics.java:610)

testMinusSeconds_int(org.joda.time.TestLocalTime_Basics)  Time elapsed: 0 sec  <<< ERROR!
java.lang.NullPointerException
	at org.joda.time.LocalTime.<init>(LocalTime.java:506)
	at org.joda.time.TestLocalTime_Basics.testMinusSeconds_int(TestLocalTime_Basics.java:620)

testMinusMillis_int(org.joda.time.TestLocalTime_Basics)  Time elapsed: 0.001 sec  <<< ERROR!
java.lang.NullPointerException
	at org.joda.time.LocalTime.<init>(LocalTime.java:506)
	at org.joda.time.TestLocalTime_Basics.testMinusMillis_int(TestLocalTime_Basics.java:630)

testPlus_RP(org.joda.time.TestTimeOfDay_Basics)  Time elapsed: 0 sec  <<< ERROR!
java.lang.NullPointerException
	at org.joda.time.TimeOfDay.getField(TimeOfDay.java:444)
	at org.joda.time.base.AbstractPartial.getField(AbstractPartial.java:105)
	at org.joda.time.chrono.BaseChronology.validate(BaseChronology.java:186)
	at org.joda.time.base.BasePartial.<init>(BasePartial.java:183)
	at org.joda.time.TimeOfDay.<init>(TimeOfDay.java:399)
	at org.joda.time.TestTimeOfDay_Basics.testPlus_RP(TestTimeOfDay_Basics.java:488)

testPlusHours_int(org.joda.time.TestTimeOfDay_Basics)  Time elapsed: 0 sec  <<< ERROR!
java.lang.NullPointerException
	at org.joda.time.TimeOfDay.getField(TimeOfDay.java:444)
	at org.joda.time.base.AbstractPartial.getField(AbstractPartial.java:105)
	at org.joda.time.chrono.BaseChronology.validate(BaseChronology.java:186)
	at org.joda.time.base.BasePartial.<init>(BasePartial.java:183)
	at org.joda.time.TimeOfDay.<init>(TimeOfDay.java:399)
	at org.joda.time.TestTimeOfDay_Basics.testPlusHours_int(TestTimeOfDay_Basics.java:498)

testPlusMinutes_int(org.joda.time.TestTimeOfDay_Basics)  Time elapsed: 0.001 sec  <<< ERROR!
java.lang.NullPointerException
	at org.joda.time.TimeOfDay.getField(TimeOfDay.java:444)
	at org.joda.time.base.AbstractPartial.getField(AbstractPartial.java:105)
	at org.joda.time.chrono.BaseChronology.validate(BaseChronology.java:186)
	at org.joda.time.base.BasePartial.<init>(BasePartial.java:183)
	at org.joda.time.TimeOfDay.<init>(TimeOfDay.java:399)
	at org.joda.time.TestTimeOfDay_Basics.testPlusMinutes_int(TestTimeOfDay_Basics.java:508)

testPlusSeconds_int(org.joda.time.TestTimeOfDay_Basics)  Time elapsed: 0 sec  <<< ERROR!
java.lang.NullPointerException
	at org.joda.time.TimeOfDay.getField(TimeOfDay.java:444)
	at org.joda.time.base.AbstractPartial.getField(AbstractPartial.java:105)
	at org.joda.time.chrono.BaseChronology.validate(BaseChronology.java:186)
	at org.joda.time.base.BasePartial.<init>(BasePartial.java:183)
	at org.joda.time.TimeOfDay.<init>(TimeOfDay.java:399)
	at org.joda.time.TestTimeOfDay_Basics.testPlusSeconds_int(TestTimeOfDay_Basics.java:518)

testPlusMillis_int(org.joda.time.TestTimeOfDay_Basics)  Time elapsed: 0 sec  <<< ERROR!
java.lang.NullPointerException
	at org.joda.time.TimeOfDay.getField(TimeOfDay.java:444)
	at org.joda.time.base.AbstractPartial.getField(AbstractPartial.java:105)
	at org.joda.time.chrono.BaseChronology.validate(BaseChronology.java:186)
	at org.joda.time.base.BasePartial.<init>(BasePartial.java:183)
	at org.joda.time.TimeOfDay.<init>(TimeOfDay.java:399)
	at org.joda.time.TestTimeOfDay_Basics.testPlusMillis_int(TestTimeOfDay_Basics.java:528)

testMinus_RP(org.joda.time.TestTimeOfDay_Basics)  Time elapsed: 0.001 sec  <<< ERROR!
java.lang.NullPointerException
	at org.joda.time.TimeOfDay.getField(TimeOfDay.java:444)
	at org.joda.time.base.AbstractPartial.getField(AbstractPartial.java:105)
	at org.joda.time.chrono.BaseChronology.validate(BaseChronology.java:186)
	at org.joda.time.base.BasePartial.<init>(BasePartial.java:183)
	at org.joda.time.TimeOfDay.<init>(TimeOfDay.java:399)
	at org.joda.time.TestTimeOfDay_Basics.testMinus_RP(TestTimeOfDay_Basics.java:539)

testMinusHours_int(org.joda.time.TestTimeOfDay_Basics)  Time elapsed: 0 sec  <<< ERROR!
java.lang.NullPointerException
	at org.joda.time.TimeOfDay.getField(TimeOfDay.java:444)
	at org.joda.time.base.AbstractPartial.getField(AbstractPartial.java:105)
	at org.joda.time.chrono.BaseChronology.validate(BaseChronology.java:186)
	at org.joda.time.base.BasePartial.<init>(BasePartial.java:183)
	at org.joda.time.TimeOfDay.<init>(TimeOfDay.java:399)
	at org.joda.time.TestTimeOfDay_Basics.testMinusHours_int(TestTimeOfDay_Basics.java:549)

testMinusMinutes_int(org.joda.time.TestTimeOfDay_Basics)  Time elapsed: 0.001 sec  <<< ERROR!
java.lang.NullPointerException
	at org.joda.time.TimeOfDay.getField(TimeOfDay.java:444)
	at org.joda.time.base.AbstractPartial.getField(AbstractPartial.java:105)
	at org.joda.time.chrono.BaseChronology.validate(BaseChronology.java:186)
	at org.joda.time.base.BasePartial.<init>(BasePartial.java:183)
	at org.joda.time.TimeOfDay.<init>(TimeOfDay.java:399)
	at org.joda.time.TestTimeOfDay_Basics.testMinusMinutes_int(TestTimeOfDay_Basics.java:559)

testMinusSeconds_int(org.joda.time.TestTimeOfDay_Basics)  Time elapsed: 0 sec  <<< ERROR!
java.lang.NullPointerException
	at org.joda.time.TimeOfDay.getField(TimeOfDay.java:444)
	at org.joda.time.base.AbstractPartial.getField(AbstractPartial.java:105)
	at org.joda.time.chrono.BaseChronology.validate(BaseChronology.java:186)
	at org.joda.time.base.BasePartial.<init>(BasePartial.java:183)
	at org.joda.time.TimeOfDay.<init>(TimeOfDay.java:399)
	at org.joda.time.TestTimeOfDay_Basics.testMinusSeconds_int(TestTimeOfDay_Basics.java:569)

testMinusMillis_int(org.joda.time.TestTimeOfDay_Basics)  Time elapsed: 0.001 sec  <<< ERROR!
java.lang.NullPointerException
	at org.joda.time.TimeOfDay.getField(TimeOfDay.java:444)
	at org.joda.time.base.AbstractPartial.getField(AbstractPartial.java:105)
	at org.joda.time.chrono.BaseChronology.validate(BaseChronology.java:186)
	at org.joda.time.base.BasePartial.<init>(BasePartial.java:183)
	at org.joda.time.TimeOfDay.<init>(TimeOfDay.java:399)
	at org.joda.time.TestTimeOfDay_Basics.testMinusMillis_int(TestTimeOfDay_Basics.java:579)

testWithChronologyRetainFields_Chrono(org.joda.time.TestTimeOfDay_Basics)  Time elapsed: 0.001 sec  <<< ERROR!
java.lang.NullPointerException
	at org.joda.time.base.BasePartial.<init>(BasePartial.java:212)
	at org.joda.time.TimeOfDay.<init>(TimeOfDay.java:419)
	at org.joda.time.TimeOfDay.withChronologyRetainFields(TimeOfDay.java:499)
	at org.joda.time.TestTimeOfDay_Basics.testWithChronologyRetainFields_Chrono(TestTimeOfDay_Basics.java:350)

testPlus_RP(org.joda.time.TestYearMonthDay_Basics)  Time elapsed: 0 sec  <<< ERROR!
java.lang.NullPointerException
	at org.joda.time.YearMonthDay.getField(YearMonthDay.java:333)
	at org.joda.time.base.AbstractPartial.getField(AbstractPartial.java:105)
	at org.joda.time.chrono.BaseChronology.validate(BaseChronology.java:186)
	at org.joda.time.base.BasePartial.<init>(BasePartial.java:183)
	at org.joda.time.YearMonthDay.<init>(YearMonthDay.java:288)
	at org.joda.time.TestYearMonthDay_Basics.testPlus_RP(TestYearMonthDay_Basics.java:446)

testPlusYears_int(org.joda.time.TestYearMonthDay_Basics)  Time elapsed: 0 sec  <<< ERROR!
java.lang.NullPointerException
	at org.joda.time.YearMonthDay.getField(YearMonthDay.java:333)
	at org.joda.time.base.AbstractPartial.getField(AbstractPartial.java:105)
	at org.joda.time.chrono.BaseChronology.validate(BaseChronology.java:186)
	at org.joda.time.base.BasePartial.<init>(BasePartial.java:183)
	at org.joda.time.YearMonthDay.<init>(YearMonthDay.java:288)
	at org.joda.time.TestYearMonthDay_Basics.testPlusYears_int(TestYearMonthDay_Basics.java:456)

testPlusMonths_int(org.joda.time.TestYearMonthDay_Basics)  Time elapsed: 0.001 sec  <<< ERROR!
java.lang.NullPointerException
	at org.joda.time.YearMonthDay.getField(YearMonthDay.java:333)
	at org.joda.time.base.AbstractPartial.getField(AbstractPartial.java:105)
	at org.joda.time.chrono.BaseChronology.validate(BaseChronology.java:186)
	at org.joda.time.base.BasePartial.<init>(BasePartial.java:183)
	at org.joda.time.YearMonthDay.<init>(YearMonthDay.java:288)
	at org.joda.time.TestYearMonthDay_Basics.testPlusMonths_int(TestYearMonthDay_Basics.java:466)

testPlusDays_int(org.joda.time.TestYearMonthDay_Basics)  Time elapsed: 0 sec  <<< ERROR!
java.lang.NullPointerException
	at org.joda.time.YearMonthDay.getField(YearMonthDay.java:333)
	at org.joda.time.base.AbstractPartial.getField(AbstractPartial.java:105)
	at org.joda.time.chrono.BaseChronology.validate(BaseChronology.java:186)
	at org.joda.time.base.BasePartial.<init>(BasePartial.java:183)
	at org.joda.time.YearMonthDay.<init>(YearMonthDay.java:288)
	at org.joda.time.TestYearMonthDay_Basics.testPlusDays_int(TestYearMonthDay_Basics.java:476)

testMinus_RP(org.joda.time.TestYearMonthDay_Basics)  Time elapsed: 0.001 sec  <<< ERROR!
java.lang.NullPointerException
	at org.joda.time.YearMonthDay.getField(YearMonthDay.java:333)
	at org.joda.time.base.AbstractPartial.getField(AbstractPartial.java:105)
	at org.joda.time.chrono.BaseChronology.validate(BaseChronology.java:186)
	at org.joda.time.base.BasePartial.<init>(BasePartial.java:183)
	at org.joda.time.YearMonthDay.<init>(YearMonthDay.java:288)
	at org.joda.time.TestYearMonthDay_Basics.testMinus_RP(TestYearMonthDay_Basics.java:487)

testMinusYears_int(org.joda.time.TestYearMonthDay_Basics)  Time elapsed: 0 sec  <<< ERROR!
java.lang.NullPointerException
	at org.joda.time.YearMonthDay.getField(YearMonthDay.java:333)
	at org.joda.time.base.AbstractPartial.getField(AbstractPartial.java:105)
	at org.joda.time.chrono.BaseChronology.validate(BaseChronology.java:186)
	at org.joda.time.base.BasePartial.<init>(BasePartial.java:183)
	at org.joda.time.YearMonthDay.<init>(YearMonthDay.java:288)
	at org.joda.time.TestYearMonthDay_Basics.testMinusYears_int(TestYearMonthDay_Basics.java:497)

testMinusMonths_int(org.joda.time.TestYearMonthDay_Basics)  Time elapsed: 0.001 sec  <<< ERROR!
java.lang.NullPointerException
	at org.joda.time.YearMonthDay.getField(YearMonthDay.java:333)
	at org.joda.time.base.AbstractPartial.getField(AbstractPartial.java:105)
	at org.joda.time.chrono.BaseChronology.validate(BaseChronology.java:186)
	at org.joda.time.base.BasePartial.<init>(BasePartial.java:183)
	at org.joda.time.YearMonthDay.<init>(YearMonthDay.java:288)
	at org.joda.time.TestYearMonthDay_Basics.testMinusMonths_int(TestYearMonthDay_Basics.java:507)

testMinusDays_int(org.joda.time.TestYearMonthDay_Basics)  Time elapsed: 0 sec  <<< ERROR!
java.lang.NullPointerException
	at org.joda.time.YearMonthDay.getField(YearMonthDay.java:333)
	at org.joda.time.base.AbstractPartial.getField(AbstractPartial.java:105)
	at org.joda.time.chrono.BaseChronology.validate(BaseChronology.java:186)
	at org.joda.time.base.BasePartial.<init>(BasePartial.java:183)
	at org.joda.time.YearMonthDay.<init>(YearMonthDay.java:288)
	at org.joda.time.TestYearMonthDay_Basics.testMinusDays_int(TestYearMonthDay_Basics.java:517)

testToDateTime_TOD(org.joda.time.TestYearMonthDay_Basics)  Time elapsed: 0 sec  <<< ERROR!
java.lang.NullPointerException

testToDateTime_TOD_Zone(org.joda.time.TestYearMonthDay_Basics)  Time elapsed: 0 sec  <<< ERROR!
java.lang.NullPointerException

testToDateTime_TOD_nullZone(org.joda.time.TestYearMonthDay_Basics)  Time elapsed: 0 sec  <<< ERROR!
java.lang.NullPointerException

testWithChronologyRetainFields_Chrono(org.joda.time.TestYearMonthDay_Basics)  Time elapsed: 0 sec  <<< ERROR!
java.lang.NullPointerException
	at org.joda.time.base.BasePartial.<init>(BasePartial.java:212)
	at org.joda.time.YearMonthDay.<init>(YearMonthDay.java:308)
	at org.joda.time.YearMonthDay.withChronologyRetainFields(YearMonthDay.java:386)
	at org.joda.time.TestYearMonthDay_Basics.testWithChronologyRetainFields_Chrono(TestYearMonthDay_Basics.java:341)

testPlus_RP(org.joda.time.TestYearMonth_Basics)  Time elapsed: 0 sec  <<< ERROR!
java.lang.NullPointerException
	at org.joda.time.YearMonth.getField(YearMonth.java:402)
	at org.joda.time.base.AbstractPartial.getField(AbstractPartial.java:105)
	at org.joda.time.chrono.BaseChronology.validate(BaseChronology.java:186)
	at org.joda.time.base.BasePartial.<init>(BasePartial.java:183)
	at org.joda.time.YearMonth.<init>(YearMonth.java:344)
	at org.joda.time.TestYearMonth_Basics.testPlus_RP(TestYearMonth_Basics.java:440)

testPlusYears_int(org.joda.time.TestYearMonth_Basics)  Time elapsed: 0.001 sec  <<< ERROR!
java.lang.NullPointerException
	at org.joda.time.YearMonth.getField(YearMonth.java:402)
	at org.joda.time.base.AbstractPartial.getField(AbstractPartial.java:105)
	at org.joda.time.chrono.BaseChronology.validate(BaseChronology.java:186)
	at org.joda.time.base.BasePartial.<init>(BasePartial.java:183)
	at org.joda.time.YearMonth.<init>(YearMonth.java:344)
	at org.joda.time.TestYearMonth_Basics.testPlusYears_int(TestYearMonth_Basics.java:450)

testPlusMonths_int(org.joda.time.TestYearMonth_Basics)  Time elapsed: 0 sec  <<< ERROR!
java.lang.NullPointerException
	at org.joda.time.YearMonth.getField(YearMonth.java:402)
	at org.joda.time.base.AbstractPartial.getField(AbstractPartial.java:105)
	at org.joda.time.chrono.BaseChronology.validate(BaseChronology.java:186)
	at org.joda.time.base.BasePartial.<init>(BasePartial.java:183)
	at org.joda.time.YearMonth.<init>(YearMonth.java:344)
	at org.joda.time.TestYearMonth_Basics.testPlusMonths_int(TestYearMonth_Basics.java:460)

testMinus_RP(org.joda.time.TestYearMonth_Basics)  Time elapsed: 0.001 sec  <<< ERROR!
java.lang.NullPointerException
	at org.joda.time.YearMonth.getField(YearMonth.java:402)
	at org.joda.time.base.AbstractPartial.getField(AbstractPartial.java:105)
	at org.joda.time.chrono.BaseChronology.validate(BaseChronology.java:186)
	at org.joda.time.base.BasePartial.<init>(BasePartial.java:183)
	at org.joda.time.YearMonth.<init>(YearMonth.java:344)
	at org.joda.time.TestYearMonth_Basics.testMinus_RP(TestYearMonth_Basics.java:471)

testMinusYears_int(org.joda.time.TestYearMonth_Basics)  Time elapsed: 0 sec  <<< ERROR!
java.lang.NullPointerException
	at org.joda.time.YearMonth.getField(YearMonth.java:402)
	at org.joda.time.base.AbstractPartial.getField(AbstractPartial.java:105)
	at org.joda.time.chrono.BaseChronology.validate(BaseChronology.java:186)
	at org.joda.time.base.BasePartial.<init>(BasePartial.java:183)
	at org.joda.time.YearMonth.<init>(YearMonth.java:344)
	at org.joda.time.TestYearMonth_Basics.testMinusYears_int(TestYearMonth_Basics.java:481)

testMinusMonths_int(org.joda.time.TestYearMonth_Basics)  Time elapsed: 0.001 sec  <<< ERROR!
java.lang.NullPointerException
	at org.joda.time.YearMonth.getField(YearMonth.java:402)
	at org.joda.time.base.AbstractPartial.getField(AbstractPartial.java:105)
	at org.joda.time.chrono.BaseChronology.validate(BaseChronology.java:186)
	at org.joda.time.base.BasePartial.<init>(BasePartial.java:183)
	at org.joda.time.YearMonth.<init>(YearMonth.java:344)
	at org.joda.time.TestYearMonth_Basics.testMinusMonths_int(TestYearMonth_Basics.java:491)

testWithChronologyRetainFields_Chrono(org.joda.time.TestYearMonth_Basics)  Time elapsed: 0 sec  <<< ERROR!
java.lang.NullPointerException
	at org.joda.time.base.BasePartial.<init>(BasePartial.java:212)
	at org.joda.time.YearMonth.<init>(YearMonth.java:364)
	at org.joda.time.YearMonth.withChronologyRetainFields(YearMonth.java:453)
	at org.joda.time.TestYearMonth_Basics.testWithChronologyRetainFields_Chrono(TestYearMonth_Basics.java:335)

testPlus_RP(org.joda.time.TestMonthDay_Basics)  Time elapsed: 0 sec  <<< ERROR!
java.lang.NullPointerException
	at org.joda.time.MonthDay.getField(MonthDay.java:410)
	at org.joda.time.base.AbstractPartial.getField(AbstractPartial.java:105)
	at org.joda.time.chrono.BaseChronology.validate(BaseChronology.java:186)
	at org.joda.time.base.BasePartial.<init>(BasePartial.java:183)
	at org.joda.time.MonthDay.<init>(MonthDay.java:352)
	at org.joda.time.TestMonthDay_Basics.testPlus_RP(TestMonthDay_Basics.java:435)

testPlusMonths_int(org.joda.time.TestMonthDay_Basics)  Time elapsed: 0.001 sec  <<< ERROR!
java.lang.NullPointerException
	at org.joda.time.MonthDay.getField(MonthDay.java:410)
	at org.joda.time.base.AbstractPartial.getField(AbstractPartial.java:105)
	at org.joda.time.chrono.BaseChronology.validate(BaseChronology.java:186)
	at org.joda.time.base.BasePartial.<init>(BasePartial.java:183)
	at org.joda.time.MonthDay.<init>(MonthDay.java:352)
	at org.joda.time.TestMonthDay_Basics.testPlusMonths_int(TestMonthDay_Basics.java:445)

testPlusDays_int(org.joda.time.TestMonthDay_Basics)  Time elapsed: 0 sec  <<< ERROR!
java.lang.NullPointerException
	at org.joda.time.MonthDay.getField(MonthDay.java:410)
	at org.joda.time.base.AbstractPartial.getField(AbstractPartial.java:105)
	at org.joda.time.chrono.BaseChronology.validate(BaseChronology.java:186)
	at org.joda.time.base.BasePartial.<init>(BasePartial.java:183)
	at org.joda.time.MonthDay.<init>(MonthDay.java:352)
	at org.joda.time.TestMonthDay_Basics.testPlusDays_int(TestMonthDay_Basics.java:501)

testMinus_RP(org.joda.time.TestMonthDay_Basics)  Time elapsed: 0.001 sec  <<< ERROR!
java.lang.NullPointerException
	at org.joda.time.MonthDay.getField(MonthDay.java:410)
	at org.joda.time.base.AbstractPartial.getField(AbstractPartial.java:105)
	at org.joda.time.chrono.BaseChronology.validate(BaseChronology.java:186)
	at org.joda.time.base.BasePartial.<init>(BasePartial.java:183)
	at org.joda.time.MonthDay.<init>(MonthDay.java:352)
	at org.joda.time.TestMonthDay_Basics.testMinus_RP(TestMonthDay_Basics.java:571)

testMinusMonths_int(org.joda.time.TestMonthDay_Basics)  Time elapsed: 0 sec  <<< ERROR!
java.lang.NullPointerException
	at org.joda.time.MonthDay.getField(MonthDay.java:410)
	at org.joda.time.base.AbstractPartial.getField(AbstractPartial.java:105)
	at org.joda.time.chrono.BaseChronology.validate(BaseChronology.java:186)
	at org.joda.time.base.BasePartial.<init>(BasePartial.java:183)
	at org.joda.time.MonthDay.<init>(MonthDay.java:352)
	at org.joda.time.TestMonthDay_Basics.testMinusMonths_int(TestMonthDay_Basics.java:581)

testMinusDays_int(org.joda.time.TestMonthDay_Basics)  Time elapsed: 0.001 sec  <<< ERROR!
java.lang.NullPointerException
	at org.joda.time.MonthDay.getField(MonthDay.java:410)
	at org.joda.time.base.AbstractPartial.getField(AbstractPartial.java:105)
	at org.joda.time.chrono.BaseChronology.validate(BaseChronology.java:186)
	at org.joda.time.base.BasePartial.<init>(BasePartial.java:183)
	at org.joda.time.MonthDay.<init>(MonthDay.java:352)
	at org.joda.time.TestMonthDay_Basics.testMinusDays_int(TestMonthDay_Basics.java:637)

testPlusDays_same(org.joda.time.TestMonthDay_Basics)  Time elapsed: 0.001 sec  <<< ERROR!
java.lang.NullPointerException
	at org.joda.time.MonthDay.getField(MonthDay.java:410)
	at org.joda.time.base.AbstractPartial.getField(AbstractPartial.java:105)
	at org.joda.time.chrono.BaseChronology.validate(BaseChronology.java:186)
	at org.joda.time.base.BasePartial.<init>(BasePartial.java:183)
	at org.joda.time.MonthDay.<init>(MonthDay.java:352)
	at org.joda.time.TestMonthDay_Basics.testPlusDays_same(TestMonthDay_Basics.java:564)

testWithChronologyRetainFields_Chrono(org.joda.time.TestMonthDay_Basics)  Time elapsed: 0 sec  <<< ERROR!
java.lang.NullPointerException
	at org.joda.time.base.BasePartial.<init>(BasePartial.java:212)
	at org.joda.time.MonthDay.<init>(MonthDay.java:372)
	at org.joda.time.MonthDay.withChronologyRetainFields(MonthDay.java:461)
	at org.joda.time.TestMonthDay_Basics.testWithChronologyRetainFields_Chrono(TestMonthDay_Basics.java:340)

testMinusDays_same(org.joda.time.TestMonthDay_Basics)  Time elapsed: 0 sec  <<< ERROR!
java.lang.NullPointerException
	at org.joda.time.MonthDay.getField(MonthDay.java:410)
	at org.joda.time.base.AbstractPartial.getField(AbstractPartial.java:105)
	at org.joda.time.chrono.BaseChronology.validate(BaseChronology.java:186)
	at org.joda.time.base.BasePartial.<init>(BasePartial.java:183)
	at org.joda.time.MonthDay.<init>(MonthDay.java:352)
	at org.joda.time.TestMonthDay_Basics.testMinusDays_same(TestMonthDay_Basics.java:693)

testPlus_RP(org.joda.time.TestPartial_Basics)  Time elapsed: 0 sec  <<< ERROR!
java.lang.NullPointerException
	at org.joda.time.Partial.<init>(Partial.java:272)
	at org.joda.time.TestPartial_Basics.createHourMinPartial(TestPartial_Basics.java:911)
	at org.joda.time.TestPartial_Basics.createHourMinPartial(TestPartial_Basics.java:903)
	at org.joda.time.TestPartial_Basics.testPlus_RP(TestPartial_Basics.java:721)

testMinus_RP(org.joda.time.TestPartial_Basics)  Time elapsed: 0 sec  <<< ERROR!
java.lang.NullPointerException
	at org.joda.time.Partial.<init>(Partial.java:272)
	at org.joda.time.TestPartial_Basics.createHourMinPartial(TestPartial_Basics.java:911)
	at org.joda.time.TestPartial_Basics.createHourMinPartial(TestPartial_Basics.java:903)
	at org.joda.time.TestPartial_Basics.testMinus_RP(TestPartial_Basics.java:732)

testWithChronologyRetainFields_Chrono(org.joda.time.TestPartial_Basics)  Time elapsed: 0 sec  <<< ERROR!
java.lang.NullPointerException
	at org.joda.time.Partial.withChronologyRetainFields(Partial.java:431)
	at org.joda.time.TestPartial_Basics.testWithChronologyRetainFields_Chrono(TestPartial_Basics.java:321)

testGetFieldType(org.joda.time.TestAbstractPartial)  Time elapsed: 0.001 sec  <<< ERROR!
java.lang.NullPointerException
	at org.joda.time.TestAbstractPartial$MockPartial.getField(TestAbstractPartial.java:160)
	at org.joda.time.base.AbstractPartial.getFieldType(AbstractPartial.java:79)
	at org.joda.time.TestAbstractPartial.testGetFieldType(TestAbstractPartial.java:115)

testGetField(org.joda.time.TestAbstractPartial)  Time elapsed: 0 sec  <<< ERROR!
java.lang.NullPointerException
	at org.joda.time.TestAbstractPartial.testGetField(TestAbstractPartial.java:100)

testGetFieldTypes(org.joda.time.TestAbstractPartial)  Time elapsed: 0.001 sec  <<< ERROR!
java.lang.NullPointerException
	at org.joda.time.TestAbstractPartial$MockPartial.getField(TestAbstractPartial.java:160)
	at org.joda.time.base.AbstractPartial.getFieldType(AbstractPartial.java:79)
	at org.joda.time.base.AbstractPartial.getFieldTypes(AbstractPartial.java:92)
	at org.joda.time.TestAbstractPartial.testGetFieldTypes(TestAbstractPartial.java:130)

testGetPropertyEquals(org.joda.time.TestAbstractPartial)  Time elapsed: 0.001 sec  <<< ERROR!
java.lang.NullPointerException
	at org.joda.time.TestAbstractPartial$MockPartial.getField(TestAbstractPartial.java:160)
	at org.joda.time.base.AbstractPartial.getField(AbstractPartial.java:105)
	at org.joda.time.TestAbstractPartial$MockProperty0.getField(TestAbstractPartial.java:188)
	at org.joda.time.field.AbstractPartialFieldProperty.getFieldType(AbstractPartialFieldProperty.java:60)
	at org.joda.time.field.AbstractPartialFieldProperty.equals(AbstractPartialFieldProperty.java:329)
	at org.joda.time.TestAbstractPartial.testGetPropertyEquals(TestAbstractPartial.java:139)

testSerializedLocalDateBuddhist(org.joda.time.TestSerialization)  Time elapsed: 0.003 sec  <<< FAILURE!
junit.framework.AssertionFailedError: expected:<2002-06-09> but was:<2545-06-09>
	at junit.framework.Assert.fail(Assert.java:47)
	at junit.framework.Assert.failNotEquals(Assert.java:280)
	at junit.framework.Assert.assertEquals(Assert.java:64)
	at junit.framework.Assert.assertEquals(Assert.java:71)
	at org.joda.time.TestSerialization.loadAndCompare(TestSerialization.java:300)
	at org.joda.time.TestSerialization.testSerializedLocalDateBuddhist(TestSerialization.java:180)

testToString(org.joda.time.chrono.TestBuddhistChronology)  Time elapsed: 0.001 sec  <<< ERROR!
java.lang.NullPointerException
	at org.joda.time.chrono.TestBuddhistChronology.testToString(TestBuddhistChronology.java:141)

testWithUTC(org.joda.time.chrono.TestBuddhistChronology)  Time elapsed: 0.001 sec  <<< ERROR!
java.lang.NullPointerException
	at org.joda.time.chrono.TestBuddhistChronology.testWithUTC(TestBuddhistChronology.java:124)

testWithZone(org.joda.time.chrono.TestBuddhistChronology)  Time elapsed: 0 sec  <<< ERROR!
java.lang.NullPointerException
	at org.joda.time.chrono.TestBuddhistChronology.testWithZone(TestBuddhistChronology.java:134)

testDurationFields(org.joda.time.chrono.TestBuddhistChronology)  Time elapsed: 0 sec  <<< ERROR!
java.lang.NullPointerException
	at org.joda.time.chrono.TestBuddhistChronology.testDurationFields(TestBuddhistChronology.java:186)

testEpoch(org.joda.time.chrono.TestBuddhistChronology)  Time elapsed: 0 sec  <<< FAILURE!
junit.framework.AssertionFailedError: expected:<-0543-01-01T00:00:00.000Z> but was:<0001-01-03T00:01:15.000Z>
	at junit.framework.Assert.fail(Assert.java:47)
	at junit.framework.Assert.failNotEquals(Assert.java:280)
	at junit.framework.Assert.assertEquals(Assert.java:64)
	at junit.framework.Assert.assertEquals(Assert.java:71)
	at org.joda.time.chrono.TestBuddhistChronology.testEpoch(TestBuddhistChronology.java:298)

testKeyYears(org.joda.time.chrono.TestBuddhistChronology)  Time elapsed: 0 sec  <<< FAILURE!
junit.framework.AssertionFailedError: expected:<1970-01-01T00:00:00.000Z> but was:<2513-01-01T00:00:00.000Z>
	at junit.framework.Assert.fail(Assert.java:47)
	at junit.framework.Assert.failNotEquals(Assert.java:280)
	at junit.framework.Assert.assertEquals(Assert.java:64)
	at junit.framework.Assert.assertEquals(Assert.java:71)
	at org.joda.time.chrono.TestBuddhistChronology.testKeyYears(TestBuddhistChronology.java:312)

testCalendar(org.joda.time.chrono.TestBuddhistChronology)  Time elapsed: 0.001 sec  <<< ERROR!
java.lang.NullPointerException
	at org.joda.time.chrono.TestBuddhistChronology.testCalendar(TestBuddhistChronology.java:361)

testFactoryUTC(org.joda.time.chrono.TestBuddhistChronology)  Time elapsed: 0.001 sec  <<< ERROR!
java.lang.NullPointerException
	at org.joda.time.chrono.TestBuddhistChronology.testFactoryUTC(TestBuddhistChronology.java:96)

testGetChronology_Object_nullChronology(org.joda.time.convert.TestCalendarConverter)  Time elapsed: 0.001 sec  <<< FAILURE!
junit.framework.AssertionFailedError: expected:<null> but was:<BuddhistChronology[Europe/Moscow]>
	at junit.framework.Assert.fail(Assert.java:47)
	at junit.framework.Assert.failNotEquals(Assert.java:280)
	at junit.framework.Assert.assertEquals(Assert.java:64)
	at junit.framework.Assert.assertEquals(Assert.java:71)
	at org.joda.time.convert.TestCalendarConverter.testGetChronology_Object_nullChronology(TestCalendarConverter.java:155)

testGetChronology_Object_Chronology(org.joda.time.convert.TestReadablePartialConverter)  Time elapsed: 0 sec  <<< FAILURE!
junit.framework.AssertionFailedError: expected:<null> but was:<ISOChronology[Europe/London]>
	at junit.framework.Assert.fail(Assert.java:47)
	at junit.framework.Assert.failNotEquals(Assert.java:280)
	at junit.framework.Assert.assertEquals(Assert.java:64)
	at junit.framework.Assert.assertEquals(Assert.java:71)
	at org.joda.time.convert.TestReadablePartialConverter.testGetChronology_Object_Chronology(TestReadablePartialConverter.java:103)

testSetIntoInterval_Object_Chronology7(org.joda.time.convert.TestStringConverter)  Time elapsed: 0 sec  <<< FAILURE!
junit.framework.AssertionFailedError: expected:<1460-08-17T23:58:45.000-00:01:15> but was:<2003-08-09T00:00:00.000+01:00>
	at junit.framework.Assert.fail(Assert.java:47)
	at junit.framework.Assert.failNotEquals(Assert.java:280)
	at junit.framework.Assert.assertEquals(Assert.java:64)
	at junit.framework.Assert.assertEquals(Assert.java:71)
	at org.joda.time.convert.TestStringConverter.testSetIntoInterval_Object_Chronology7(TestStringConverter.java:525)

testSetIntoInterval_Object_Chronology8(org.joda.time.convert.TestStringConverter)  Time elapsed: 0.002 sec  <<< FAILURE!
junit.framework.AssertionFailedError: expected:<2003-08-09T07:00:00.000+08:00> but was:<2003-08-08T19:00:00.000+01:00>
	at junit.framework.Assert.fail(Assert.java:47)
	at junit.framework.Assert.failNotEquals(Assert.java:280)
	at junit.framework.Assert.assertEquals(Assert.java:64)
	at junit.framework.Assert.assertEquals(Assert.java:71)
	at org.joda.time.convert.TestStringConverter.testSetIntoInterval_Object_Chronology8(TestStringConverter.java:533)

testPrint_chrono(org.joda.time.format.TestDateTimeFormatter)  Time elapsed: 0.001 sec  <<< FAILURE!
junit.framework.ComparisonFailure: expected:<Wed 2[547-06-09T12]:20:30+02:00> but was:<Wed 2[004-06-09T13]:20:30+02:00>
	at junit.framework.Assert.assertEquals(Assert.java:81)
	at junit.framework.Assert.assertEquals(Assert.java:87)
	at org.joda.time.format.TestDateTimeFormatter.testPrint_chrono(TestDateTimeFormatter.java:149)

testParseLocalTime_simple(org.joda.time.format.TestDateTimeFormatter)  Time elapsed: 0.001 sec  <<< ERROR!
java.lang.NullPointerException
	at org.joda.time.LocalTime.<init>(LocalTime.java:506)
	at org.joda.time.format.TestDateTimeFormatter.testParseLocalTime_simple(TestDateTimeFormatter.java:498)

testParseLocalDateTime_simple(org.joda.time.format.TestDateTimeFormatter)  Time elapsed: 0.001 sec  <<< ERROR!
java.lang.NullPointerException
	at org.joda.time.LocalDateTime.<init>(LocalDateTime.java:511)
	at org.joda.time.format.TestDateTimeFormatter.testParseLocalDateTime_simple(TestDateTimeFormatter.java:511)

testParseDateTime_chrono(org.joda.time.format.TestDateTimeFormatter)  Time elapsed: 0 sec  <<< FAILURE!
junit.framework.AssertionFailedError: expected:<2004-06-09T13:20:30.000+02:00> but was:<2547-06-09T12:20:30.000+02:00>
	at junit.framework.Assert.fail(Assert.java:47)
	at junit.framework.Assert.failNotEquals(Assert.java:280)
	at junit.framework.Assert.assertEquals(Assert.java:64)
	at junit.framework.Assert.assertEquals(Assert.java:71)
	at org.joda.time.format.TestDateTimeFormatter.testParseDateTime_chrono(TestDateTimeFormatter.java:629)

testParseMutableDateTime_chrono(org.joda.time.format.TestDateTimeFormatter)  Time elapsed: 0.001 sec  <<< FAILURE!
junit.framework.AssertionFailedError: expected:<2004-06-09T13:20:30.000+02:00> but was:<2547-06-09T12:20:30.000+02:00>
	at junit.framework.Assert.fail(Assert.java:47)
	at junit.framework.Assert.failNotEquals(Assert.java:280)
	at junit.framework.Assert.assertEquals(Assert.java:64)
	at junit.framework.Assert.assertEquals(Assert.java:71)
	at org.joda.time.format.TestDateTimeFormatter.testParseMutableDateTime_chrono(TestDateTimeFormatter.java:724)

testParseInto_chrono(org.joda.time.format.TestDateTimeFormatter)  Time elapsed: 0 sec  <<< FAILURE!
junit.framework.AssertionFailedError: expected:<2004-06-09T13:20:30.000+02:00> but was:<2547-06-09T12:20:30.000+02:00>
	at junit.framework.Assert.fail(Assert.java:47)
	at junit.framework.Assert.failNotEquals(Assert.java:280)
	at junit.framework.Assert.assertEquals(Assert.java:64)
	at junit.framework.Assert.assertEquals(Assert.java:71)
	at org.joda.time.format.TestDateTimeFormatter.testParseInto_chrono(TestDateTimeFormatter.java:858)

testPrint_simple(org.joda.time.format.TestDateTimeFormatter)  Time elapsed: 0 sec  <<< FAILURE!
junit.framework.ComparisonFailure: expected:<Wed 2[547-06-09T12]:20:30+02:00> but was:<Wed 2[004-06-09T13]:20:30+02:00>
	at junit.framework.Assert.assertEquals(Assert.java:81)
	at junit.framework.Assert.assertEquals(Assert.java:87)
	at org.joda.time.format.TestDateTimeFormatter.testPrint_simple(TestDateTimeFormatter.java:121)

testPrint_chrono_and_zone(org.joda.time.format.TestDateTimeFormatter)  Time elapsed: 0 sec  <<< FAILURE!
junit.framework.ComparisonFailure: expected:<Wed 2[547-06-09T12]:20:30+02:00> but was:<Wed 2[004-06-09T13]:20:30+02:00>
	at junit.framework.Assert.assertEquals(Assert.java:81)
	at junit.framework.Assert.assertEquals(Assert.java:87)
	at org.joda.time.format.TestDateTimeFormatter.testPrint_chrono_and_zone(TestDateTimeFormatter.java:252)

testParseLocalDate_simple(org.joda.time.format.TestDateTimeFormatter)  Time elapsed: 0.001 sec  <<< ERROR!
java.lang.NullPointerException
	at org.joda.time.LocalDate.<init>(LocalDate.java:457)
	at org.joda.time.format.TestDateTimeFormatter.testParseLocalDate_simple(TestDateTimeFormatter.java:368)


Results :

Failed tests: 
  org.joda.time.TestDateTime_Basics#testToDateTimeISO AssertionFailedError expec...
  org.joda.time.TestDateTime_Basics#testWithTime_LocalTime AssertionFailedError ...
  org.joda.time.TestDateTime_Basics#testWithTime_int_int_int_int AssertionFailedError
  org.joda.time.TestLocalDateTime_Constructors#testConstructor_ObjectLocalDateTime AssertionFailedError
  org.joda.time.TestLocalDateTime_Constructors#testConstructor_Object_Chronology_crossChronology AssertionFailedError
  org.joda.time.TestLocalDate_Constructors#testConstructor_ObjectLocalDate AssertionFailedError
  org.joda.time.TestLocalDate_Constructors#testConstructor_ObjectLocalDateTime AssertionFailedError
  org.joda.time.TestLocalDate_Constructors#testConstructor_ObjectYearMonthDay AssertionFailedError
  org.joda.time.TestLocalDate_Constructors#testConstructor_Object_Chronology_crossChronology AssertionFailedError
  org.joda.time.TestLocalTime_Constructors#testConstructor_ObjectLocalDateTime AssertionFailedError
  org.joda.time.TestLocalTime_Constructors#testConstructor_ObjectLocalTime AssertionFailedError
  org.joda.time.TestLocalTime_Constructors#testConstructor_ObjectTimeOfDay AssertionFailedError
  org.joda.time.TestSerialization#testSerializedLocalDateBuddhist AssertionFailedError
  org.joda.time.chrono.TestBuddhistChronology#testEpoch AssertionFailedError exp...
  org.joda.time.chrono.TestBuddhistChronology#testKeyYears AssertionFailedError ...
  org.joda.time.convert.TestCalendarConverter#testGetChronology_Object_nullChronology AssertionFailedError
  org.joda.time.convert.TestReadablePartialConverter#testGetChronology_Object_Chronology AssertionFailedError
  org.joda.time.convert.TestStringConverter#testSetIntoInterval_Object_Chronology7 AssertionFailedError
  org.joda.time.convert.TestStringConverter#testSetIntoInterval_Object_Chronology8 AssertionFailedError
  org.joda.time.format.TestDateTimeFormatter#testParseDateTime_chrono AssertionFailedError
  org.joda.time.format.TestDateTimeFormatter#testParseInto_chrono AssertionFailedError
  org.joda.time.format.TestDateTimeFormatter#testParseMutableDateTime_chrono AssertionFailedError
  org.joda.time.format.TestDateTimeFormatter#testPrint_chrono ComparisonFailure ...
  org.joda.time.format.TestDateTimeFormatter#testPrint_chrono_and_zone ComparisonFailure
  org.joda.time.format.TestDateTimeFormatter#testPrint_simple ComparisonFailure ...
Tests in error: 
  org.joda.time.TestAbstractPartial#testGetField NullPointerException
  org.joda.time.TestAbstractPartial#testGetFieldType NullPointerException
  org.joda.time.TestAbstractPartial#testGetFieldTypes NullPointerException
  org.joda.time.TestAbstractPartial#testGetPropertyEquals NullPointerException
  org.joda.time.TestLocalDateTime_Basics#testMinusDays_int NullPointerException
  org.joda.time.TestLocalDateTime_Basics#testMinusHours_int NullPointerException
  org.joda.time.TestLocalDateTime_Basics#testMinusMillis_int NullPointerException
  org.joda.time.TestLocalDateTime_Basics#testMinusMinutes_int NullPointerException
  org.joda.time.TestLocalDateTime_Basics#testMinusMonths_int NullPointerException
  org.joda.time.TestLocalDateTime_Basics#testMinusSeconds_int NullPointerException
  org.joda.time.TestLocalDateTime_Basics#testMinusWeeks_int NullPointerException
  org.joda.time.TestLocalDateTime_Basics#testMinusYears_int NullPointerException
  org.joda.time.TestLocalDateTime_Basics#testMinus_RP NullPointerException
  org.joda.time.TestLocalDateTime_Basics#testPlusDays_int NullPointerException
  org.joda.time.TestLocalDateTime_Basics#testPlusHours_int NullPointerException
  org.joda.time.TestLocalDateTime_Basics#testPlusMillis_int NullPointerException
  org.joda.time.TestLocalDateTime_Basics#testPlusMinutes_int NullPointerException
  org.joda.time.TestLocalDateTime_Basics#testPlusMonths_int NullPointerException
  org.joda.time.TestLocalDateTime_Basics#testPlusSeconds_int NullPointerException
  org.joda.time.TestLocalDateTime_Basics#testPlusWeeks_int NullPointerException
  org.joda.time.TestLocalDateTime_Basics#testPlusYears_int NullPointerException
  org.joda.time.TestLocalDateTime_Basics#testPlus_RP NullPointerException
  org.joda.time.TestLocalDate_Basics#testMinusDays_int NullPointerException
  org.joda.time.TestLocalDate_Basics#testMinusMonths_int NullPointerException
  org.joda.time.TestLocalDate_Basics#testMinusWeeks_int NullPointerException
  org.joda.time.TestLocalDate_Basics#testMinusYears_int NullPointerException
  org.joda.time.TestLocalDate_Basics#testMinus_RP NullPointerException
  org.joda.time.TestLocalDate_Basics#testPlusDays_int NullPointerException
  org.joda.time.TestLocalDate_Basics#testPlusMonths_int NullPointerException
  org.joda.time.TestLocalDate_Basics#testPlusWeeks_int NullPointerException
  org.joda.time.TestLocalDate_Basics#testPlusYears_int NullPointerException
  org.joda.time.TestLocalDate_Basics#testPlus_RP NullPointerException
  org.joda.time.TestLocalDate_Basics#testToDateTime_wrongChronoLocalTime_Zone NullPointerException
  org.joda.time.TestLocalTime_Basics#testMinusHours_int NullPointerException
  org.joda.time.TestLocalTime_Basics#testMinusMillis_int NullPointerException
  org.joda.time.TestLocalTime_Basics#testMinusMinutes_int NullPointerException
  org.joda.time.TestLocalTime_Basics#testMinusSeconds_int NullPointerException
  org.joda.time.TestLocalTime_Basics#testMinus_RP NullPointerException
  org.joda.time.TestLocalTime_Basics#testPlusHours_int NullPointerException
  org.joda.time.TestLocalTime_Basics#testPlusMillis_int NullPointerException
  org.joda.time.TestLocalTime_Basics#testPlusMinutes_int NullPointerException
  org.joda.time.TestLocalTime_Basics#testPlusSeconds_int NullPointerException
  org.joda.time.TestLocalTime_Basics#testPlus_RP NullPointerException
  org.joda.time.TestMonthDay_Basics#testMinusDays_int NullPointerException
  org.joda.time.TestMonthDay_Basics#testMinusDays_same NullPointerException
  org.joda.time.TestMonthDay_Basics#testMinusMonths_int NullPointerException
  org.joda.time.TestMonthDay_Basics#testMinus_RP NullPointerException
  org.joda.time.TestMonthDay_Basics#testPlusDays_int NullPointerException
  org.joda.time.TestMonthDay_Basics#testPlusDays_same NullPointerException
  org.joda.time.TestMonthDay_Basics#testPlusMonths_int NullPointerException
  org.joda.time.TestMonthDay_Basics#testPlus_RP NullPointerException
  org.joda.time.TestMonthDay_Basics#testWithChronologyRetainFields_Chrono NullPointerException
  org.joda.time.TestPartial_Basics#testMinus_RP NullPointerException
  org.joda.time.TestPartial_Basics#testPlus_RP NullPointerException
  org.joda.time.TestPartial_Basics#testWithChronologyRetainFields_Chrono NullPointerException
  org.joda.time.TestTimeOfDay_Basics#testMinusHours_int NullPointerException
  org.joda.time.TestTimeOfDay_Basics#testMinusMillis_int NullPointerException
  org.joda.time.TestTimeOfDay_Basics#testMinusMinutes_int NullPointerException
  org.joda.time.TestTimeOfDay_Basics#testMinusSeconds_int NullPointerException
  org.joda.time.TestTimeOfDay_Basics#testMinus_RP NullPointerException
  org.joda.time.TestTimeOfDay_Basics#testPlusHours_int NullPointerException
  org.joda.time.TestTimeOfDay_Basics#testPlusMillis_int NullPointerException
  org.joda.time.TestTimeOfDay_Basics#testPlusMinutes_int NullPointerException
  org.joda.time.TestTimeOfDay_Basics#testPlusSeconds_int NullPointerException
  org.joda.time.TestTimeOfDay_Basics#testPlus_RP NullPointerException
  org.joda.time.TestTimeOfDay_Basics#testWithChronologyRetainFields_Chrono NullPointerException
  org.joda.time.TestYearMonthDay_Basics#testMinusDays_int NullPointerException
  org.joda.time.TestYearMonthDay_Basics#testMinusMonths_int NullPointerException
  org.joda.time.TestYearMonthDay_Basics#testMinusYears_int NullPointerException
  org.joda.time.TestYearMonthDay_Basics#testMinus_RP NullPointerException
  org.joda.time.TestYearMonthDay_Basics#testPlusDays_int NullPointerException
  org.joda.time.TestYearMonthDay_Basics#testPlusMonths_int NullPointerException
  org.joda.time.TestYearMonthDay_Basics#testPlusYears_int NullPointerException
  org.joda.time.TestYearMonthDay_Basics#testPlus_RP NullPointerException
  org.joda.time.TestYearMonthDay_Basics#testToDateTime_TOD NullPointerException
  org.joda.time.TestYearMonthDay_Basics#testToDateTime_TOD_Zone NullPointerException
  org.joda.time.TestYearMonthDay_Basics#testToDateTime_TOD_nullZone NullPointerException
  org.joda.time.TestYearMonthDay_Basics#testWithChronologyRetainFields_Chrono NullPointerException
  org.joda.time.TestYearMonth_Basics#testMinusMonths_int NullPointerException
  org.joda.time.TestYearMonth_Basics#testMinusYears_int NullPointerException
  org.joda.time.TestYearMonth_Basics#testMinus_RP NullPointerException
  org.joda.time.TestYearMonth_Basics#testPlusMonths_int NullPointerException
  org.joda.time.TestYearMonth_Basics#testPlusYears_int NullPointerException
  org.joda.time.TestYearMonth_Basics#testPlus_RP NullPointerException
  org.joda.time.TestYearMonth_Basics#testWithChronologyRetainFields_Chrono NullPointerException
  org.joda.time.chrono.TestBuddhistChronology#testCalendar NullPointerException
  org.joda.time.chrono.TestBuddhistChronology#testDurationFields NullPointerException
  org.joda.time.chrono.TestBuddhistChronology#testFactoryUTC NullPointerException
  org.joda.time.chrono.TestBuddhistChronology#testToString NullPointerException
  org.joda.time.chrono.TestBuddhistChronology#testWithUTC NullPointerException
  org.joda.time.chrono.TestBuddhistChronology#testWithZone NullPointerException
  org.joda.time.format.TestDateTimeFormatter#testParseLocalDateTime_simple NullPointerException
  org.joda.time.format.TestDateTimeFormatter#testParseLocalDate_simple NullPointerException
  org.joda.time.format.TestDateTimeFormatter#testParseLocalTime_simple NullPointerException

Tests run: 4157, Failures: 25, Errors: 94, Skipped: 0

[INFO] ------------------------------------------------------------------------
[INFO] BUILD FAILURE
[INFO] ------------------------------------------------------------------------
[INFO] Total time: 15.637s
[INFO] Finished at: Wed Aug 05 23:53:08 BST 2015
[INFO] Final Memory: 11M/338M
[INFO] ------------------------------------------------------------------------
[ERROR] Failed to execute goal org.apache.maven.plugins:maven-surefire-plugin:2.18.1:test (default-test) on project joda-time: There are test failures.
[ERROR] 
[ERROR] Please refer to /home/perham/Study/LittleDarwin/Cases/joda-time-2.8.1/target/surefire-reports for the individual test results.
[ERROR] -> [Help 1]
[ERROR] 
[ERROR] To see the full stack trace of the errors, re-run Maven with the -e switch.
[ERROR] Re-run Maven using the -X switch to enable full debug logging.
[ERROR] 
[ERROR] For more information about the errors and possible solutions, please read the following articles:
[ERROR] [Help 1] http://cwiki.apache.org/confluence/display/MAVEN/MojoFailureException
