[INFO] Scanning for projects...
[INFO]                                                                         
[INFO] ------------------------------------------------------------------------
[INFO] Building Joda-Time 2.8.1
[INFO] ------------------------------------------------------------------------
[INFO] 
[INFO] --- maven-resources-plugin:2.7:resources (default-resources) @ joda-time ---
[INFO] Using 'UTF-8' encoding to copy filtered resources.
[INFO] Copying 2 resources to META-INF
[INFO] Copying 10 resources
[INFO] 
[INFO] --- maven-compiler-plugin:3.3:compile (default-compile) @ joda-time ---
[INFO] Changes detected - recompiling the module!
[INFO] Compiling 166 source files to /home/perham/Study/LittleDarwin/Cases/joda-time-2.8.1/target/classes
[INFO] 
[INFO] --- exec-maven-plugin:1.4.0:java (compile-tzdb) @ joda-time ---
Writing zoneinfo files
Writing ZoneInfoMap
[INFO] 
[INFO] --- maven-resources-plugin:2.7:testResources (default-testResources) @ joda-time ---
[INFO] Using 'UTF-8' encoding to copy filtered resources.
[INFO] Copying 34 resources
[INFO] 
[INFO] --- maven-compiler-plugin:3.3:testCompile (default-testCompile) @ joda-time ---
[INFO] Nothing to compile - all classes are up to date
[INFO] 
[INFO] --- maven-surefire-plugin:2.18.1:test (default-test) @ joda-time ---
[INFO] Surefire report directory: /home/perham/Study/LittleDarwin/Cases/joda-time-2.8.1/target/surefire-reports

-------------------------------------------------------
 T E S T S
-------------------------------------------------------
Running org.joda.time.TestAllPackages

TestBuddhistChronology.testCalendar

TestCopticChronology.testCalendar

TestEthiopicChronology.testCalendar

TestIslamicChronology.testCalendar

Testing Gregorian chronology over 1000 iterations
Failure on monthOfYear.roundCeiling
org.joda.time.chrono.gj.TestGJMonthOfYearField
	vs. org.joda.time.chrono.GJMonthOfYearDateTimeField
Datetime: Sat 1960-03-26T03:29:34.468Z / 1960-W12-6
Millis from 1970: -308262625532
Fri 1960-04-01T00:00:00.000Z / 1960-W13-5 != Wed 1960-06-01T00:00:00.000Z / 1960-W22-3
-307756800000 != -302486400000
Original value as reported by first field: 3
Original value as reported by second field: 3
First new value as reported by first field: 4
First new value as reported by second field: 4
Second new value as reported by first field: 6
Second new value as reported by second field: 6
Failure index: 0
Test millis: -308262625532
Test value: -49
Test millis2: -46922557997542

Testing Julian chronology over 1000 iterations
Failure on monthOfYear.roundCeiling
org.joda.time.chrono.gj.TestJulianMonthOfYearField
	vs. org.joda.time.chrono.GJMonthOfYearDateTimeField
Datetime: Sat 1960-03-13T03:29:34.468Z / 1960-W11-6
Millis from 1970: -308262625532
Thu 1960-04-01T00:00:00.000Z / 1960-W14-4 != Tue 1960-06-01T00:00:00.000Z / 1960-W23-2
-306633600000 != -301363200000
Original value as reported by first field: 3
Original value as reported by second field: 3
First new value as reported by first field: 4
First new value as reported by second field: 4
Second new value as reported by first field: 6
Second new value as reported by second field: 6
Failure index: 0
Test millis: -308262625532
Test value: -49
Test millis2: -46922557997542
Writing zoneinfo files
Writing ZoneInfoMap
Tests run: 4157, Failures: 197, Errors: 1, Skipped: 0, Time elapsed: 4.911 sec <<< FAILURE! - in org.joda.time.TestAllPackages
testWithDate_int_int_int_toDST1(org.joda.time.TestDateTime_Basics)  Time elapsed: 0.005 sec  <<< FAILURE!
junit.framework.AssertionFailedError: expected:<2010-03-28T03:55:00.000+01:00> but was:<2010-03-28T02:55:00.000+01:00>
	at junit.framework.Assert.fail(Assert.java:47)
	at junit.framework.Assert.failNotEquals(Assert.java:280)
	at junit.framework.Assert.assertEquals(Assert.java:64)
	at junit.framework.Assert.assertEquals(Assert.java:71)
	at org.joda.time.TestDateTime_Basics.testWithDate_int_int_int_toDST1(TestDateTime_Basics.java:847)

testWithDate_int_int_int_toDST2(org.joda.time.TestDateTime_Basics)  Time elapsed: 0.001 sec  <<< FAILURE!
junit.framework.AssertionFailedError: expected:<2010-03-28T03:55:00.000+01:00> but was:<2010-03-28T02:55:00.000+01:00>
	at junit.framework.Assert.fail(Assert.java:47)
	at junit.framework.Assert.failNotEquals(Assert.java:280)
	at junit.framework.Assert.assertEquals(Assert.java:64)
	at junit.framework.Assert.assertEquals(Assert.java:71)
	at org.joda.time.TestDateTime_Basics.testWithDate_int_int_int_toDST2(TestDateTime_Basics.java:855)

testWithTime_int_int_int_int_toDST(org.joda.time.TestDateTime_Basics)  Time elapsed: 0.005 sec  <<< FAILURE!
junit.framework.AssertionFailedError: expected:<2010-03-28T03:55:00.000+01:00> but was:<2010-03-28T02:55:00.000+01:00>
	at junit.framework.Assert.fail(Assert.java:47)
	at junit.framework.Assert.failNotEquals(Assert.java:280)
	at junit.framework.Assert.assertEquals(Assert.java:64)
	at junit.framework.Assert.assertEquals(Assert.java:71)
	at org.joda.time.TestDateTime_Basics.testWithTime_int_int_int_int_toDST(TestDateTime_Basics.java:898)

testWithDurationAdded_RP_int(org.joda.time.TestDateTime_Basics)  Time elapsed: 0.001 sec  <<< FAILURE!
junit.framework.AssertionFailedError: expected:<2003-07-28T06:08:10.012-00:01:15> but was:<2003-09-28T06:08:10.012-00:01:15>
	at junit.framework.Assert.fail(Assert.java:47)
	at junit.framework.Assert.failNotEquals(Assert.java:280)
	at junit.framework.Assert.assertEquals(Assert.java:64)
	at junit.framework.Assert.assertEquals(Assert.java:71)
	at org.joda.time.TestDateTime_Basics.testWithDurationAdded_RP_int(TestDateTime_Basics.java:1020)

testPlus_RP(org.joda.time.TestDateTime_Basics)  Time elapsed: 0.001 sec  <<< FAILURE!
junit.framework.AssertionFailedError: expected:<2003-07-28T06:08:10.012-00:01:15> but was:<2003-09-28T06:08:10.012-00:01:15>
	at junit.framework.Assert.fail(Assert.java:47)
	at junit.framework.Assert.failNotEquals(Assert.java:280)
	at junit.framework.Assert.assertEquals(Assert.java:64)
	at junit.framework.Assert.assertEquals(Assert.java:71)
	at org.joda.time.TestDateTime_Basics.testPlus_RP(TestDateTime_Basics.java:1059)

testPlusMonths_int(org.joda.time.TestDateTime_Basics)  Time elapsed: 0.001 sec  <<< FAILURE!
junit.framework.AssertionFailedError: expected:<2002-06-03T01:02:03.004-00:01:15> but was:<2002-08-03T01:02:03.004-00:01:15>
	at junit.framework.Assert.fail(Assert.java:47)
	at junit.framework.Assert.failNotEquals(Assert.java:280)
	at junit.framework.Assert.assertEquals(Assert.java:64)
	at junit.framework.Assert.assertEquals(Assert.java:71)
	at org.joda.time.TestDateTime_Basics.testPlusMonths_int(TestDateTime_Basics.java:1079)

testMinus_RP(org.joda.time.TestDateTime_Basics)  Time elapsed: 0 sec  <<< FAILURE!
junit.framework.AssertionFailedError: expected:<2001-03-26T00:01:02.003-00:01:15> but was:<2001-05-26T00:01:02.003-00:01:15>
	at junit.framework.Assert.fail(Assert.java:47)
	at junit.framework.Assert.failNotEquals(Assert.java:280)
	at junit.framework.Assert.assertEquals(Assert.java:64)
	at junit.framework.Assert.assertEquals(Assert.java:71)
	at org.joda.time.TestDateTime_Basics.testMinus_RP(TestDateTime_Basics.java:1167)

testMinusMonths_int(org.joda.time.TestDateTime_Basics)  Time elapsed: 0 sec  <<< FAILURE!
junit.framework.AssertionFailedError: expected:<2002-04-03T01:02:03.004-00:01:15> but was:<2002-06-03T01:02:03.004-00:01:15>
	at junit.framework.Assert.fail(Assert.java:47)
	at junit.framework.Assert.failNotEquals(Assert.java:280)
	at junit.framework.Assert.assertEquals(Assert.java:64)
	at junit.framework.Assert.assertEquals(Assert.java:71)
	at org.joda.time.TestDateTime_Basics.testMinusMonths_int(TestDateTime_Basics.java:1187)

testPropertySetTextMonthOfYear(org.joda.time.TestDateTime_Properties)  Time elapsed: 0.002 sec  <<< FAILURE!
junit.framework.ComparisonFailure: expected:<...4-12-09T00:00:00.000[Z]> but was:<...4-12-09T00:00:00.000[+01:00]>
	at junit.framework.Assert.assertEquals(Assert.java:81)
	at junit.framework.Assert.assertEquals(Assert.java:87)
	at org.joda.time.TestDateTime_Properties.testPropertySetTextMonthOfYear(TestDateTime_Properties.java:481)

testPropertyAddWrapFieldDayOfYear(org.joda.time.TestDateTime_Properties)  Time elapsed: 0.001 sec  <<< FAILURE!
junit.framework.ComparisonFailure: expected:<...4-05-28T00:00:00.000[+01:00]> but was:<...4-05-28T00:00:00.000[Z]>
	at junit.framework.Assert.assertEquals(Assert.java:81)
	at junit.framework.Assert.assertEquals(Assert.java:87)
	at org.joda.time.TestDateTime_Properties.testPropertyAddWrapFieldDayOfYear(TestDateTime_Properties.java:765)

testPropertyToIntervalMonthOfYear(org.joda.time.TestDateTime_Properties)  Time elapsed: 0 sec  <<< FAILURE!
junit.framework.AssertionFailedError: expected:<2004-07-01T00:00:00.000+01:00> but was:<2004-09-01T00:00:00.000+01:00>
	at junit.framework.Assert.fail(Assert.java:47)
	at junit.framework.Assert.failNotEquals(Assert.java:280)
	at junit.framework.Assert.assertEquals(Assert.java:64)
	at junit.framework.Assert.assertEquals(Assert.java:71)
	at org.joda.time.TestDateTime_Properties.testPropertyToIntervalMonthOfYear(TestDateTime_Properties.java:1325)

testPropertyAddMonthOfYear(org.joda.time.TestDateTime_Properties)  Time elapsed: 0.001 sec  <<< FAILURE!
junit.framework.ComparisonFailure: expected:<200[4-1]2-09T00:00:00.000Z> but was:<200[5-0]2-09T00:00:00.000Z>
	at junit.framework.Assert.assertEquals(Assert.java:81)
	at junit.framework.Assert.assertEquals(Assert.java:87)
	at org.joda.time.TestDateTime_Properties.testPropertyAddMonthOfYear(TestDateTime_Properties.java:401)

testPropertyAddWrapFieldMonthOfYear(org.joda.time.TestDateTime_Properties)  Time elapsed: 0.001 sec  <<< FAILURE!
junit.framework.ComparisonFailure: expected:<...4-03-31T00:00:00.000[+01:00]> but was:<...4-03-31T00:00:00.000[Z]>
	at junit.framework.Assert.assertEquals(Assert.java:81)
	at junit.framework.Assert.assertEquals(Assert.java:87)
	at org.joda.time.TestDateTime_Properties.testPropertyAddWrapFieldMonthOfYear(TestDateTime_Properties.java:446)

testPropertySetMonthOfYear(org.joda.time.TestDateTime_Properties)  Time elapsed: 0.001 sec  <<< FAILURE!
junit.framework.ComparisonFailure: expected:<...4-12-09T00:00:00.000[Z]> but was:<...4-12-09T00:00:00.000[+01:00]>
	at junit.framework.Assert.assertEquals(Assert.java:81)
	at junit.framework.Assert.assertEquals(Assert.java:87)
	at org.joda.time.TestDateTime_Properties.testPropertySetMonthOfYear(TestDateTime_Properties.java:461)

testSetDayOfMonth_int_dstOverlapWinter_addZero(org.joda.time.TestMutableDateTime_Sets)  Time elapsed: 0.001 sec  <<< FAILURE!
junit.framework.ComparisonFailure: expected:<2011-10-30T0[2:30:00.000+01]:00> but was:<2011-10-30T0[3:30:00.000+02]:00>
	at junit.framework.Assert.assertEquals(Assert.java:81)
	at junit.framework.Assert.assertEquals(Assert.java:87)
	at org.joda.time.TestMutableDateTime_Sets.testSetDayOfMonth_int_dstOverlapWinter_addZero(TestMutableDateTime_Sets.java:480)

testSetDayOfYear_int_dstOverlapWinter_addZero(org.joda.time.TestMutableDateTime_Sets)  Time elapsed: 0.001 sec  <<< FAILURE!
junit.framework.ComparisonFailure: expected:<2011-10-30T0[2:30:00.000+01]:00> but was:<2011-10-30T0[3:30:00.000+02]:00>
	at junit.framework.Assert.assertEquals(Assert.java:81)
	at junit.framework.Assert.assertEquals(Assert.java:87)
	at org.joda.time.TestMutableDateTime_Sets.testSetDayOfYear_int_dstOverlapWinter_addZero(TestMutableDateTime_Sets.java:502)

testSetTime_long1(org.joda.time.TestMutableDateTime_Sets)  Time elapsed: 0.001 sec  <<< FAILURE!
junit.framework.AssertionFailedError: expected:<5> but was:<4>
	at junit.framework.Assert.fail(Assert.java:47)
	at junit.framework.Assert.failNotEquals(Assert.java:280)
	at junit.framework.Assert.assertEquals(Assert.java:64)
	at junit.framework.Assert.assertEquals(Assert.java:198)
	at junit.framework.Assert.assertEquals(Assert.java:204)
	at org.joda.time.TestMutableDateTime_Sets.testSetTime_long1(TestMutableDateTime_Sets.java:347)

testSetTime_Object3(org.joda.time.TestMutableDateTime_Sets)  Time elapsed: 0 sec  <<< FAILURE!
junit.framework.AssertionFailedError: expected:<5> but was:<4>
	at junit.framework.Assert.fail(Assert.java:47)
	at junit.framework.Assert.failNotEquals(Assert.java:280)
	at junit.framework.Assert.assertEquals(Assert.java:64)
	at junit.framework.Assert.assertEquals(Assert.java:198)
	at junit.framework.Assert.assertEquals(Assert.java:204)
	at org.joda.time.TestMutableDateTime_Sets.testSetTime_Object3(TestMutableDateTime_Sets.java:387)

testSetMonthOfYear_int1(org.joda.time.TestMutableDateTime_Sets)  Time elapsed: 0 sec  <<< FAILURE!
junit.framework.ComparisonFailure: expected:<...2-12-09T05:06:07.008[Z]> but was:<...2-12-09T05:06:07.008[+01:00]>
	at junit.framework.Assert.assertEquals(Assert.java:81)
	at junit.framework.Assert.assertEquals(Assert.java:87)
	at org.joda.time.TestMutableDateTime_Sets.testSetMonthOfYear_int1(TestMutableDateTime_Sets.java:427)

testSetMonthOfYear_int_dstOverlapWinter_addZero(org.joda.time.TestMutableDateTime_Sets)  Time elapsed: 0 sec  <<< FAILURE!
junit.framework.ComparisonFailure: expected:<2011-10-30T0[2:30:00.000+01]:00> but was:<2011-10-30T0[3:30:00.000+02]:00>
	at junit.framework.Assert.assertEquals(Assert.java:81)
	at junit.framework.Assert.assertEquals(Assert.java:87)
	at org.joda.time.TestMutableDateTime_Sets.testSetMonthOfYear_int_dstOverlapWinter_addZero(TestMutableDateTime_Sets.java:440)

testAddDays_int_dstOverlapWinter_addZero(org.joda.time.TestMutableDateTime_Adds)  Time elapsed: 0 sec  <<< FAILURE!
junit.framework.ComparisonFailure: expected:<2011-10-30T0[2:30:00.000+01]:00> but was:<2011-10-30T0[3:30:00.000+02]:00>
	at junit.framework.Assert.assertEquals(Assert.java:81)
	at junit.framework.Assert.assertEquals(Assert.java:87)
	at org.joda.time.TestMutableDateTime_Adds.testAddDays_int_dstOverlapWinter_addZero(TestMutableDateTime_Adds.java:269)

testAddWeeks_int_dstOverlapWinter_addZero(org.joda.time.TestMutableDateTime_Adds)  Time elapsed: 0.001 sec  <<< FAILURE!
junit.framework.ComparisonFailure: expected:<2011-10-30T0[2:30:00.000+01]:00> but was:<2011-10-30T0[3:30:00.000+02]:00>
	at junit.framework.Assert.assertEquals(Assert.java:81)
	at junit.framework.Assert.assertEquals(Assert.java:87)
	at org.joda.time.TestMutableDateTime_Adds.testAddWeeks_int_dstOverlapWinter_addZero(TestMutableDateTime_Adds.java:298)

testAddHours_int_dstOverlapWinter_addZero(org.joda.time.TestMutableDateTime_Adds)  Time elapsed: 0.001 sec  <<< FAILURE!
junit.framework.ComparisonFailure: expected:<2011-10-30T0[2:30:00.000+01]:00> but was:<2011-10-30T0[3:30:00.000+02]:00>
	at junit.framework.Assert.assertEquals(Assert.java:81)
	at junit.framework.Assert.assertEquals(Assert.java:87)
	at org.joda.time.TestMutableDateTime_Adds.testAddHours_int_dstOverlapWinter_addZero(TestMutableDateTime_Adds.java:320)

testAddMinutes_int_dstOverlapWinter_addZero(org.joda.time.TestMutableDateTime_Adds)  Time elapsed: 0.001 sec  <<< FAILURE!
junit.framework.ComparisonFailure: expected:<2011-10-30T0[2:30:00.000+01]:00> but was:<2011-10-30T0[3:30:00.000+02]:00>
	at junit.framework.Assert.assertEquals(Assert.java:81)
	at junit.framework.Assert.assertEquals(Assert.java:87)
	at org.joda.time.TestMutableDateTime_Adds.testAddMinutes_int_dstOverlapWinter_addZero(TestMutableDateTime_Adds.java:342)

testAddSeconds_int_dstOverlapWinter_addZero(org.joda.time.TestMutableDateTime_Adds)  Time elapsed: 0 sec  <<< FAILURE!
junit.framework.ComparisonFailure: expected:<2011-10-30T0[2:30:00.000+01]:00> but was:<2011-10-30T0[3:30:00.000+02]:00>
	at junit.framework.Assert.assertEquals(Assert.java:81)
	at junit.framework.Assert.assertEquals(Assert.java:87)
	at org.joda.time.TestMutableDateTime_Adds.testAddSeconds_int_dstOverlapWinter_addZero(TestMutableDateTime_Adds.java:364)

testAddMillis_int_dstOverlapWinter_addZero(org.joda.time.TestMutableDateTime_Adds)  Time elapsed: 0 sec  <<< FAILURE!
junit.framework.ComparisonFailure: expected:<2011-10-30T0[2:30:00.000+01]:00> but was:<2011-10-30T0[3:30:00.000+02]:00>
	at junit.framework.Assert.assertEquals(Assert.java:81)
	at junit.framework.Assert.assertEquals(Assert.java:87)
	at org.joda.time.TestMutableDateTime_Adds.testAddMillis_int_dstOverlapWinter_addZero(TestMutableDateTime_Adds.java:386)

testAdd_DurationFieldType_int_dstOverlapWinter_addZero(org.joda.time.TestMutableDateTime_Adds)  Time elapsed: 0.001 sec  <<< FAILURE!
junit.framework.ComparisonFailure: expected:<2011-10-30T0[2:30:00.000+01]:00> but was:<2011-10-30T0[3:30:00.000+02]:00>
	at junit.framework.Assert.assertEquals(Assert.java:81)
	at junit.framework.Assert.assertEquals(Assert.java:87)
	at org.joda.time.TestMutableDateTime_Adds.testAdd_DurationFieldType_int_dstOverlapWinter_addZero(TestMutableDateTime_Adds.java:185)

testAddYears_int_dstOverlapWinter_addZero(org.joda.time.TestMutableDateTime_Adds)  Time elapsed: 0 sec  <<< FAILURE!
junit.framework.ComparisonFailure: expected:<2011-10-30T0[2:30:00.000+01]:00> but was:<2011-10-30T0[3:30:00.000+02]:00>
	at junit.framework.Assert.assertEquals(Assert.java:81)
	at junit.framework.Assert.assertEquals(Assert.java:87)
	at org.joda.time.TestMutableDateTime_Adds.testAddYears_int_dstOverlapWinter_addZero(TestMutableDateTime_Adds.java:225)

testAddMonths_int1(org.joda.time.TestMutableDateTime_Adds)  Time elapsed: 0.001 sec  <<< FAILURE!
junit.framework.ComparisonFailure: expected:<200[2-1]2-09T05:06:07.008Z> but was:<200[3-0]2-09T05:06:07.008Z>
	at junit.framework.Assert.assertEquals(Assert.java:81)
	at junit.framework.Assert.assertEquals(Assert.java:87)
	at org.joda.time.TestMutableDateTime_Adds.testAddMonths_int1(TestMutableDateTime_Adds.java:234)

testAddMonths_int_dstOverlapWinter_addZero(org.joda.time.TestMutableDateTime_Adds)  Time elapsed: 0.001 sec  <<< FAILURE!
junit.framework.ComparisonFailure: expected:<2011-10-30T0[2:30:00.000+01]:00> but was:<2011-10-30T0[3:30:00.000+02]:00>
	at junit.framework.Assert.assertEquals(Assert.java:81)
	at junit.framework.Assert.assertEquals(Assert.java:87)
	at org.joda.time.TestMutableDateTime_Adds.testAddMonths_int_dstOverlapWinter_addZero(TestMutableDateTime_Adds.java:247)

testAdd_RP1(org.joda.time.TestMutableDateTime_Adds)  Time elapsed: 0.001 sec  <<< FAILURE!
junit.framework.ComparisonFailure: expected:<2003-0[7]-10T06:07:08.009+01:...> but was:<2003-0[9]-10T06:07:08.009+01:...>
	at junit.framework.Assert.assertEquals(Assert.java:81)
	at junit.framework.Assert.assertEquals(Assert.java:87)
	at org.joda.time.TestMutableDateTime_Adds.testAdd_RP1(TestMutableDateTime_Adds.java:145)

testPropertySetTextMonthOfYear(org.joda.time.TestMutableDateTime_Properties)  Time elapsed: 0.008 sec  <<< FAILURE!
junit.framework.ComparisonFailure: expected:<...4-12-09T00:00:00.000[Z]> but was:<...4-12-09T00:00:00.000[+01:00]>
	at junit.framework.Assert.assertEquals(Assert.java:81)
	at junit.framework.Assert.assertEquals(Assert.java:87)
	at org.joda.time.TestMutableDateTime_Properties.testPropertySetTextMonthOfYear(TestMutableDateTime_Properties.java:280)

testPropertyToIntervalMonthOfYear(org.joda.time.TestMutableDateTime_Properties)  Time elapsed: 0 sec  <<< FAILURE!
junit.framework.AssertionFailedError: expected:<2004-07-01T00:00:00.000+01:00> but was:<2004-09-01T00:00:00.000+01:00>
	at junit.framework.Assert.fail(Assert.java:47)
	at junit.framework.Assert.failNotEquals(Assert.java:280)
	at junit.framework.Assert.assertEquals(Assert.java:64)
	at junit.framework.Assert.assertEquals(Assert.java:71)
	at org.joda.time.TestMutableDateTime_Properties.testPropertyToIntervalMonthOfYear(TestMutableDateTime_Properties.java:720)

testPropertyAddMonthOfYear(org.joda.time.TestMutableDateTime_Properties)  Time elapsed: 0 sec  <<< FAILURE!
junit.framework.ComparisonFailure: expected:<200[4-1]2-09T00:00:00.000Z> but was:<200[5-0]2-09T00:00:00.000Z>
	at junit.framework.Assert.assertEquals(Assert.java:81)
	at junit.framework.Assert.assertEquals(Assert.java:87)
	at org.joda.time.TestMutableDateTime_Properties.testPropertyAddMonthOfYear(TestMutableDateTime_Properties.java:262)

testPropertySetMonthOfYear(org.joda.time.TestMutableDateTime_Properties)  Time elapsed: 0 sec  <<< FAILURE!
junit.framework.ComparisonFailure: expected:<...4-12-09T00:00:00.000[Z]> but was:<...4-12-09T00:00:00.000[+01:00]>
	at junit.framework.Assert.assertEquals(Assert.java:81)
	at junit.framework.Assert.assertEquals(Assert.java:87)
	at org.joda.time.TestMutableDateTime_Properties.testPropertySetMonthOfYear(TestMutableDateTime_Properties.java:274)

testConstructor_long1_DateTimeZone(org.joda.time.TestDateMidnight_Constructors)  Time elapsed: 0.001 sec  <<< FAILURE!
junit.framework.AssertionFailedError: expected:<1017957600000> but was:<1017961200000>
	at junit.framework.Assert.fail(Assert.java:47)
	at junit.framework.Assert.failNotEquals(Assert.java:280)
	at junit.framework.Assert.assertEquals(Assert.java:64)
	at junit.framework.Assert.assertEquals(Assert.java:133)
	at junit.framework.Assert.assertEquals(Assert.java:139)
	at org.joda.time.TestDateMidnight_Constructors.testConstructor_long1_DateTimeZone(TestDateMidnight_Constructors.java:256)

testConstructor_long2_DateTimeZone(org.joda.time.TestDateMidnight_Constructors)  Time elapsed: 0 sec  <<< FAILURE!
junit.framework.AssertionFailedError: expected:<1052172000000> but was:<1052175600000>
	at junit.framework.Assert.fail(Assert.java:47)
	at junit.framework.Assert.failNotEquals(Assert.java:280)
	at junit.framework.Assert.assertEquals(Assert.java:64)
	at junit.framework.Assert.assertEquals(Assert.java:133)
	at junit.framework.Assert.assertEquals(Assert.java:139)
	at org.joda.time.TestDateMidnight_Constructors.testConstructor_long2_DateTimeZone(TestDateMidnight_Constructors.java:265)

testConstructor_long_nullDateTimeZone(org.joda.time.TestDateMidnight_Constructors)  Time elapsed: 0.001 sec  <<< FAILURE!
junit.framework.AssertionFailedError: expected:<1017961200000> but was:<1017964800000>
	at junit.framework.Assert.fail(Assert.java:47)
	at junit.framework.Assert.failNotEquals(Assert.java:280)
	at junit.framework.Assert.assertEquals(Assert.java:64)
	at junit.framework.Assert.assertEquals(Assert.java:133)
	at junit.framework.Assert.assertEquals(Assert.java:139)
	at org.joda.time.TestDateMidnight_Constructors.testConstructor_long_nullDateTimeZone(TestDateMidnight_Constructors.java:274)

testConstructor_long1_Chronology(org.joda.time.TestDateMidnight_Constructors)  Time elapsed: 0 sec  <<< FAILURE!
junit.framework.AssertionFailedError: expected:<1017961200000> but was:<1017964800000>
	at junit.framework.Assert.fail(Assert.java:47)
	at junit.framework.Assert.failNotEquals(Assert.java:280)
	at junit.framework.Assert.assertEquals(Assert.java:64)
	at junit.framework.Assert.assertEquals(Assert.java:133)
	at junit.framework.Assert.assertEquals(Assert.java:139)
	at org.joda.time.TestDateMidnight_Constructors.testConstructor_long1_Chronology(TestDateMidnight_Constructors.java:283)

testConstructor_long2_Chronology(org.joda.time.TestDateMidnight_Constructors)  Time elapsed: 0 sec  <<< FAILURE!
junit.framework.AssertionFailedError: expected:<1052175600000> but was:<1052179200000>
	at junit.framework.Assert.fail(Assert.java:47)
	at junit.framework.Assert.failNotEquals(Assert.java:280)
	at junit.framework.Assert.assertEquals(Assert.java:64)
	at junit.framework.Assert.assertEquals(Assert.java:133)
	at junit.framework.Assert.assertEquals(Assert.java:139)
	at org.joda.time.TestDateMidnight_Constructors.testConstructor_long2_Chronology(TestDateMidnight_Constructors.java:292)

testConstructor_long_nullChronology(org.joda.time.TestDateMidnight_Constructors)  Time elapsed: 0.001 sec  <<< FAILURE!
junit.framework.AssertionFailedError: expected:<1017961200000> but was:<1017964800000>
	at junit.framework.Assert.fail(Assert.java:47)
	at junit.framework.Assert.failNotEquals(Assert.java:280)
	at junit.framework.Assert.assertEquals(Assert.java:64)
	at junit.framework.Assert.assertEquals(Assert.java:133)
	at junit.framework.Assert.assertEquals(Assert.java:139)
	at org.joda.time.TestDateMidnight_Constructors.testConstructor_long_nullChronology(TestDateMidnight_Constructors.java:301)

testConstructor_Object_DateTimeZone(org.joda.time.TestDateMidnight_Constructors)  Time elapsed: 0 sec  <<< FAILURE!
junit.framework.AssertionFailedError: expected:<1017957600000> but was:<1017961200000>
	at junit.framework.Assert.fail(Assert.java:47)
	at junit.framework.Assert.failNotEquals(Assert.java:280)
	at junit.framework.Assert.assertEquals(Assert.java:64)
	at junit.framework.Assert.assertEquals(Assert.java:133)
	at junit.framework.Assert.assertEquals(Assert.java:139)
	at org.joda.time.TestDateMidnight_Constructors.testConstructor_Object_DateTimeZone(TestDateMidnight_Constructors.java:355)

testConstructor_Object_nullDateTimeZone(org.joda.time.TestDateMidnight_Constructors)  Time elapsed: 0 sec  <<< FAILURE!
junit.framework.AssertionFailedError: expected:<1017961200000> but was:<1017964800000>
	at junit.framework.Assert.fail(Assert.java:47)
	at junit.framework.Assert.failNotEquals(Assert.java:280)
	at junit.framework.Assert.assertEquals(Assert.java:64)
	at junit.framework.Assert.assertEquals(Assert.java:133)
	at junit.framework.Assert.assertEquals(Assert.java:139)
	at org.joda.time.TestDateMidnight_Constructors.testConstructor_Object_nullDateTimeZone(TestDateMidnight_Constructors.java:384)

testConstructor_long1(org.joda.time.TestDateMidnight_Constructors)  Time elapsed: 0 sec  <<< FAILURE!
junit.framework.AssertionFailedError: expected:<1017961200000> but was:<1017964800000>
	at junit.framework.Assert.fail(Assert.java:47)
	at junit.framework.Assert.failNotEquals(Assert.java:280)
	at junit.framework.Assert.assertEquals(Assert.java:64)
	at junit.framework.Assert.assertEquals(Assert.java:133)
	at junit.framework.Assert.assertEquals(Assert.java:139)
	at org.joda.time.TestDateMidnight_Constructors.testConstructor_long1(TestDateMidnight_Constructors.java:238)

testConstructor_long2(org.joda.time.TestDateMidnight_Constructors)  Time elapsed: 0.001 sec  <<< FAILURE!
junit.framework.AssertionFailedError: expected:<1052175600000> but was:<1052179200000>
	at junit.framework.Assert.fail(Assert.java:47)
	at junit.framework.Assert.failNotEquals(Assert.java:280)
	at junit.framework.Assert.assertEquals(Assert.java:64)
	at junit.framework.Assert.assertEquals(Assert.java:133)
	at junit.framework.Assert.assertEquals(Assert.java:139)
	at org.joda.time.TestDateMidnight_Constructors.testConstructor_long2(TestDateMidnight_Constructors.java:247)

testConstructor_Object(org.joda.time.TestDateMidnight_Constructors)  Time elapsed: 0 sec  <<< FAILURE!
junit.framework.AssertionFailedError: expected:<1017961200000> but was:<1017964800000>
	at junit.framework.Assert.fail(Assert.java:47)
	at junit.framework.Assert.failNotEquals(Assert.java:280)
	at junit.framework.Assert.assertEquals(Assert.java:64)
	at junit.framework.Assert.assertEquals(Assert.java:133)
	at junit.framework.Assert.assertEquals(Assert.java:139)
	at org.joda.time.TestDateMidnight_Constructors.testConstructor_Object(TestDateMidnight_Constructors.java:312)

testConstructor_Object_Chronology(org.joda.time.TestDateMidnight_Constructors)  Time elapsed: 0 sec  <<< FAILURE!
junit.framework.AssertionFailedError: expected:<1017961200000> but was:<1017964800000>
	at junit.framework.Assert.fail(Assert.java:47)
	at junit.framework.Assert.failNotEquals(Assert.java:280)
	at junit.framework.Assert.assertEquals(Assert.java:64)
	at junit.framework.Assert.assertEquals(Assert.java:133)
	at junit.framework.Assert.assertEquals(Assert.java:139)
	at org.joda.time.TestDateMidnight_Constructors.testConstructor_Object_Chronology(TestDateMidnight_Constructors.java:417)

testConstructor_Object_nullChronology(org.joda.time.TestDateMidnight_Constructors)  Time elapsed: 0.001 sec  <<< FAILURE!
junit.framework.AssertionFailedError: expected:<1017961200000> but was:<1017964800000>
	at junit.framework.Assert.fail(Assert.java:47)
	at junit.framework.Assert.failNotEquals(Assert.java:280)
	at junit.framework.Assert.assertEquals(Assert.java:64)
	at junit.framework.Assert.assertEquals(Assert.java:133)
	at junit.framework.Assert.assertEquals(Assert.java:139)
	at org.joda.time.TestDateMidnight_Constructors.testConstructor_Object_nullChronology(TestDateMidnight_Constructors.java:446)

testWithChronology_Chronology(org.joda.time.TestDateMidnight_Basics)  Time elapsed: 0 sec  <<< FAILURE!
junit.framework.AssertionFailedError: expected:<1017961200000> but was:<1017964800000>
	at junit.framework.Assert.fail(Assert.java:47)
	at junit.framework.Assert.failNotEquals(Assert.java:280)
	at junit.framework.Assert.assertEquals(Assert.java:64)
	at junit.framework.Assert.assertEquals(Assert.java:133)
	at junit.framework.Assert.assertEquals(Assert.java:139)
	at org.joda.time.TestDateMidnight_Basics.testWithChronology_Chronology(TestDateMidnight_Basics.java:680)

testWithZoneRetainFields_DateTimeZone(org.joda.time.TestDateMidnight_Basics)  Time elapsed: 0.001 sec  <<< FAILURE!
junit.framework.AssertionFailedError: expected:<1017961200000> but was:<1017964800000>
	at junit.framework.Assert.fail(Assert.java:47)
	at junit.framework.Assert.failNotEquals(Assert.java:280)
	at junit.framework.Assert.assertEquals(Assert.java:64)
	at junit.framework.Assert.assertEquals(Assert.java:133)
	at junit.framework.Assert.assertEquals(Assert.java:139)
	at org.joda.time.TestDateMidnight_Basics.testWithZoneRetainFields_DateTimeZone(TestDateMidnight_Basics.java:704)

testWithDurationAdded_RP_int(org.joda.time.TestDateMidnight_Basics)  Time elapsed: 0.001 sec  <<< FAILURE!
junit.framework.AssertionFailedError: expected:<2003-07-28T00:00:00.000-00:01:15> but was:<2003-09-28T00:00:00.000-00:01:15>
	at junit.framework.Assert.fail(Assert.java:47)
	at junit.framework.Assert.failNotEquals(Assert.java:280)
	at junit.framework.Assert.assertEquals(Assert.java:64)
	at junit.framework.Assert.assertEquals(Assert.java:71)
	at org.joda.time.TestDateMidnight_Basics.testWithDurationAdded_RP_int(TestDateMidnight_Basics.java:833)

testPlus_RP(org.joda.time.TestDateMidnight_Basics)  Time elapsed: 0.001 sec  <<< FAILURE!
junit.framework.AssertionFailedError: expected:<2003-07-28T00:00:00.000-00:01:15> but was:<2003-09-28T00:00:00.000-00:01:15>
	at junit.framework.Assert.fail(Assert.java:47)
	at junit.framework.Assert.failNotEquals(Assert.java:280)
	at junit.framework.Assert.assertEquals(Assert.java:64)
	at junit.framework.Assert.assertEquals(Assert.java:71)
	at org.joda.time.TestDateMidnight_Basics.testPlus_RP(TestDateMidnight_Basics.java:872)

testEqualsHashCode(org.joda.time.TestDateMidnight_Basics)  Time elapsed: 0.001 sec  <<< FAILURE!
junit.framework.AssertionFailedError: expected:<true> but was:<false>
	at junit.framework.Assert.fail(Assert.java:47)
	at junit.framework.Assert.failNotEquals(Assert.java:280)
	at junit.framework.Assert.assertEquals(Assert.java:64)
	at junit.framework.Assert.assertEquals(Assert.java:146)
	at junit.framework.Assert.assertEquals(Assert.java:152)
	at org.joda.time.TestDateMidnight_Basics.testEqualsHashCode(TestDateMidnight_Basics.java:285)

testCompareTo(org.joda.time.TestDateMidnight_Basics)  Time elapsed: 0.001 sec  <<< FAILURE!
junit.framework.AssertionFailedError: expected:<0> but was:<1>
	at junit.framework.Assert.fail(Assert.java:47)
	at junit.framework.Assert.failNotEquals(Assert.java:280)
	at junit.framework.Assert.assertEquals(Assert.java:64)
	at junit.framework.Assert.assertEquals(Assert.java:198)
	at junit.framework.Assert.assertEquals(Assert.java:204)
	at org.joda.time.TestDateMidnight_Basics.testCompareTo(TestDateMidnight_Basics.java:319)

testToInstant(org.joda.time.TestDateMidnight_Basics)  Time elapsed: 0.001 sec  <<< FAILURE!
junit.framework.AssertionFailedError: expected:<1017961200000> but was:<1017964800000>
	at junit.framework.Assert.fail(Assert.java:47)
	at junit.framework.Assert.failNotEquals(Assert.java:280)
	at junit.framework.Assert.assertEquals(Assert.java:64)
	at junit.framework.Assert.assertEquals(Assert.java:133)
	at junit.framework.Assert.assertEquals(Assert.java:139)
	at org.joda.time.TestDateMidnight_Basics.testToInstant(TestDateMidnight_Basics.java:473)

testToDateTime(org.joda.time.TestDateMidnight_Basics)  Time elapsed: 0 sec  <<< FAILURE!
junit.framework.AssertionFailedError: expected:<1017957600000> but was:<1017961200000>
	at junit.framework.Assert.fail(Assert.java:47)
	at junit.framework.Assert.failNotEquals(Assert.java:280)
	at junit.framework.Assert.assertEquals(Assert.java:64)
	at junit.framework.Assert.assertEquals(Assert.java:133)
	at junit.framework.Assert.assertEquals(Assert.java:139)
	at org.joda.time.TestDateMidnight_Basics.testToDateTime(TestDateMidnight_Basics.java:480)

testToDateTime_DateTimeZone(org.joda.time.TestDateMidnight_Basics)  Time elapsed: 0.001 sec  <<< FAILURE!
junit.framework.AssertionFailedError: expected:<1017961200000> but was:<1017964800000>
	at junit.framework.Assert.fail(Assert.java:47)
	at junit.framework.Assert.failNotEquals(Assert.java:280)
	at junit.framework.Assert.assertEquals(Assert.java:64)
	at junit.framework.Assert.assertEquals(Assert.java:133)
	at junit.framework.Assert.assertEquals(Assert.java:139)
	at org.joda.time.TestDateMidnight_Basics.testToDateTime_DateTimeZone(TestDateMidnight_Basics.java:497)

testPlusMonths_int(org.joda.time.TestDateMidnight_Basics)  Time elapsed: 0 sec  <<< FAILURE!
junit.framework.AssertionFailedError: expected:<2002-06-03T00:00:00.000-00:01:15> but was:<2002-08-03T00:00:00.000-00:01:15>
	at junit.framework.Assert.fail(Assert.java:47)
	at junit.framework.Assert.failNotEquals(Assert.java:280)
	at junit.framework.Assert.assertEquals(Assert.java:64)
	at junit.framework.Assert.assertEquals(Assert.java:71)
	at org.joda.time.TestDateMidnight_Basics.testPlusMonths_int(TestDateMidnight_Basics.java:892)

testMinus_RP(org.joda.time.TestDateMidnight_Basics)  Time elapsed: 0 sec  <<< FAILURE!
junit.framework.AssertionFailedError: expected:<2001-03-25T00:00:00.000-00:01:15> but was:<2001-05-25T00:00:00.000-00:01:15>
	at junit.framework.Assert.fail(Assert.java:47)
	at junit.framework.Assert.failNotEquals(Assert.java:280)
	at junit.framework.Assert.assertEquals(Assert.java:64)
	at junit.framework.Assert.assertEquals(Assert.java:71)
	at org.joda.time.TestDateMidnight_Basics.testMinus_RP(TestDateMidnight_Basics.java:940)

testMinusMonths_int(org.joda.time.TestDateMidnight_Basics)  Time elapsed: 0 sec  <<< FAILURE!
junit.framework.AssertionFailedError: expected:<2002-04-03T00:00:00.000-00:01:15> but was:<2002-06-03T00:00:00.000-00:01:15>
	at junit.framework.Assert.fail(Assert.java:47)
	at junit.framework.Assert.failNotEquals(Assert.java:280)
	at junit.framework.Assert.assertEquals(Assert.java:64)
	at junit.framework.Assert.assertEquals(Assert.java:71)
	at org.joda.time.TestDateMidnight_Basics.testMinusMonths_int(TestDateMidnight_Basics.java:960)

testToDateTime_Chronology(org.joda.time.TestDateMidnight_Basics)  Time elapsed: 0.001 sec  <<< FAILURE!
junit.framework.AssertionFailedError: expected:<1017961200000> but was:<1017964800000>
	at junit.framework.Assert.fail(Assert.java:47)
	at junit.framework.Assert.failNotEquals(Assert.java:280)
	at junit.framework.Assert.assertEquals(Assert.java:64)
	at junit.framework.Assert.assertEquals(Assert.java:133)
	at junit.framework.Assert.assertEquals(Assert.java:139)
	at org.joda.time.TestDateMidnight_Basics.testToDateTime_Chronology(TestDateMidnight_Basics.java:523)

testWithMillis_long(org.joda.time.TestDateMidnight_Basics)  Time elapsed: 0 sec  <<< FAILURE!
junit.framework.AssertionFailedError: expected:<1052175600000> but was:<1052179200000>
	at junit.framework.Assert.fail(Assert.java:47)
	at junit.framework.Assert.failNotEquals(Assert.java:280)
	at junit.framework.Assert.assertEquals(Assert.java:64)
	at junit.framework.Assert.assertEquals(Assert.java:133)
	at junit.framework.Assert.assertEquals(Assert.java:139)
	at org.joda.time.TestDateMidnight_Basics.testWithMillis_long(TestDateMidnight_Basics.java:664)

testIsAfter(org.joda.time.TestDateMidnight_Basics)  Time elapsed: 0.001 sec  <<< FAILURE!
junit.framework.AssertionFailedError: expected:<false> but was:<true>
	at junit.framework.Assert.fail(Assert.java:47)
	at junit.framework.Assert.failNotEquals(Assert.java:280)
	at junit.framework.Assert.assertEquals(Assert.java:64)
	at junit.framework.Assert.assertEquals(Assert.java:146)
	at junit.framework.Assert.assertEquals(Assert.java:152)
	at org.joda.time.TestDateMidnight_Basics.testIsAfter(TestDateMidnight_Basics.java:407)

testIsEqual(org.joda.time.TestDateMidnight_Basics)  Time elapsed: 0 sec  <<< FAILURE!
junit.framework.AssertionFailedError: expected:<true> but was:<false>
	at junit.framework.Assert.fail(Assert.java:47)
	at junit.framework.Assert.failNotEquals(Assert.java:280)
	at junit.framework.Assert.assertEquals(Assert.java:64)
	at junit.framework.Assert.assertEquals(Assert.java:146)
	at junit.framework.Assert.assertEquals(Assert.java:152)
	at org.joda.time.TestDateMidnight_Basics.testIsEqual(TestDateMidnight_Basics.java:349)

testPropertyAddLongMonthOfYear(org.joda.time.TestDateMidnight_Properties)  Time elapsed: 0.001 sec  <<< FAILURE!
junit.framework.AssertionFailedError: expected:<2> but was:<4>
	at junit.framework.Assert.fail(Assert.java:47)
	at junit.framework.Assert.failNotEquals(Assert.java:280)
	at junit.framework.Assert.assertEquals(Assert.java:64)
	at junit.framework.Assert.assertEquals(Assert.java:198)
	at junit.framework.Assert.assertEquals(Assert.java:204)
	at org.joda.time.TestDateMidnight_Properties.testPropertyAddLongMonthOfYear(TestDateMidnight_Properties.java:286)

testPropertyRoundCeilingMonthOfYear(org.joda.time.TestDateMidnight_Properties)  Time elapsed: 0 sec  <<< FAILURE!
junit.framework.ComparisonFailure: expected:<2004-0[7]-01T00:00:00.000+01:...> but was:<2004-0[9]-01T00:00:00.000+01:...>
	at junit.framework.Assert.assertEquals(Assert.java:81)
	at junit.framework.Assert.assertEquals(Assert.java:87)
	at org.joda.time.TestDateMidnight_Properties.testPropertyRoundCeilingMonthOfYear(TestDateMidnight_Properties.java:316)

testPropertyRoundHalfFloorMonthOfYear(org.joda.time.TestDateMidnight_Properties)  Time elapsed: 0.001 sec  <<< FAILURE!
junit.framework.ComparisonFailure: expected:<2004-0[7]-01T00:00:00.000+01:...> but was:<2004-0[6]-01T00:00:00.000+01:...>
	at junit.framework.Assert.assertEquals(Assert.java:81)
	at junit.framework.Assert.assertEquals(Assert.java:87)
	at org.joda.time.TestDateMidnight_Properties.testPropertyRoundHalfFloorMonthOfYear(TestDateMidnight_Properties.java:326)

testPropertyRoundHalfCeilingMonthOfYear(org.joda.time.TestDateMidnight_Properties)  Time elapsed: 0 sec  <<< FAILURE!
junit.framework.ComparisonFailure: expected:<2004-0[7]-01T00:00:00.000+01:...> but was:<2004-0[6]-01T00:00:00.000+01:...>
	at junit.framework.Assert.assertEquals(Assert.java:81)
	at junit.framework.Assert.assertEquals(Assert.java:87)
	at org.joda.time.TestDateMidnight_Properties.testPropertyRoundHalfCeilingMonthOfYear(TestDateMidnight_Properties.java:336)

testPropertyRoundHalfEvenMonthOfYear(org.joda.time.TestDateMidnight_Properties)  Time elapsed: 0.001 sec  <<< FAILURE!
junit.framework.ComparisonFailure: expected:<2004-[10]-01T00:00:00.000+01:...> but was:<2004-[09]-01T00:00:00.000+01:...>
	at junit.framework.Assert.assertEquals(Assert.java:81)
	at junit.framework.Assert.assertEquals(Assert.java:87)
	at org.joda.time.TestDateMidnight_Properties.testPropertyRoundHalfEvenMonthOfYear(TestDateMidnight_Properties.java:354)

testPropertyToIntervalMonthOfYear(org.joda.time.TestDateMidnight_Properties)  Time elapsed: 0 sec  <<< FAILURE!
junit.framework.AssertionFailedError: expected:<2004-07-01T00:00:00.000+01:00> but was:<2004-09-01T00:00:00.000+01:00>
	at junit.framework.Assert.fail(Assert.java:47)
	at junit.framework.Assert.failNotEquals(Assert.java:280)
	at junit.framework.Assert.assertEquals(Assert.java:64)
	at junit.framework.Assert.assertEquals(Assert.java:71)
	at org.joda.time.TestDateMidnight_Properties.testPropertyToIntervalMonthOfYear(TestDateMidnight_Properties.java:506)

testPropertyAddMonthOfYear(org.joda.time.TestDateMidnight_Properties)  Time elapsed: 0 sec  <<< FAILURE!
junit.framework.AssertionFailedError: expected:<2> but was:<4>
	at junit.framework.Assert.fail(Assert.java:47)
	at junit.framework.Assert.failNotEquals(Assert.java:280)
	at junit.framework.Assert.assertEquals(Assert.java:64)
	at junit.framework.Assert.assertEquals(Assert.java:198)
	at junit.framework.Assert.assertEquals(Assert.java:204)
	at org.joda.time.TestDateMidnight_Properties.testPropertyAddMonthOfYear(TestDateMidnight_Properties.java:278)

testPlus_RP(org.joda.time.TestLocalDateTime_Basics)  Time elapsed: 0.001 sec  <<< FAILURE!
junit.framework.AssertionFailedError: expected:<2003-07-29T15:26:37.048> but was:<2003-09-29T15:26:37.048>
	at junit.framework.Assert.fail(Assert.java:47)
	at junit.framework.Assert.failNotEquals(Assert.java:280)
	at junit.framework.Assert.assertEquals(Assert.java:64)
	at junit.framework.Assert.assertEquals(Assert.java:71)
	at org.joda.time.TestLocalDateTime_Basics.testPlus_RP(TestLocalDateTime_Basics.java:537)

testPlusMonths_int(org.joda.time.TestLocalDateTime_Basics)  Time elapsed: 0.004 sec  <<< FAILURE!
junit.framework.AssertionFailedError: expected:<2002-06-03T10:20:30.040> but was:<2002-08-03T10:20:30.040>
	at junit.framework.Assert.fail(Assert.java:47)
	at junit.framework.Assert.failNotEquals(Assert.java:280)
	at junit.framework.Assert.assertEquals(Assert.java:64)
	at junit.framework.Assert.assertEquals(Assert.java:71)
	at org.joda.time.TestLocalDateTime_Basics.testPlusMonths_int(TestLocalDateTime_Basics.java:557)

testMinus_RP(org.joda.time.TestLocalDateTime_Basics)  Time elapsed: 0 sec  <<< FAILURE!
junit.framework.AssertionFailedError: expected:<2001-03-26T09:19:29.039> but was:<2001-05-26T09:19:29.039>
	at junit.framework.Assert.fail(Assert.java:47)
	at junit.framework.Assert.failNotEquals(Assert.java:280)
	at junit.framework.Assert.assertEquals(Assert.java:64)
	at junit.framework.Assert.assertEquals(Assert.java:71)
	at org.joda.time.TestLocalDateTime_Basics.testMinus_RP(TestLocalDateTime_Basics.java:629)

testMinusMonths_int(org.joda.time.TestLocalDateTime_Basics)  Time elapsed: 0.001 sec  <<< FAILURE!
junit.framework.AssertionFailedError: expected:<2002-04-03T10:20:30.040> but was:<2002-06-03T10:20:30.040>
	at junit.framework.Assert.fail(Assert.java:47)
	at junit.framework.Assert.failNotEquals(Assert.java:280)
	at junit.framework.Assert.assertEquals(Assert.java:64)
	at junit.framework.Assert.assertEquals(Assert.java:71)
	at org.joda.time.TestLocalDateTime_Basics.testMinusMonths_int(TestLocalDateTime_Basics.java:649)

testToDateTime_Zone_dstGap(org.joda.time.TestLocalDateTime_Basics)  Time elapsed: 0.001 sec  <<< FAILURE!
junit.framework.AssertionFailedError
	at junit.framework.Assert.fail(Assert.java:47)
	at junit.framework.Assert.fail(Assert.java:53)
	at org.joda.time.TestLocalDateTime_Basics.testToDateTime_Zone_dstGap(TestLocalDateTime_Basics.java:798)

testPropertyAddToCopyMonth(org.joda.time.TestLocalDateTime_Properties)  Time elapsed: 0 sec  <<< FAILURE!
junit.framework.AssertionFailedError: expected:<1972> but was:<1973>
	at junit.framework.Assert.fail(Assert.java:47)
	at junit.framework.Assert.failNotEquals(Assert.java:280)
	at junit.framework.Assert.assertEquals(Assert.java:64)
	at junit.framework.Assert.assertEquals(Assert.java:198)
	at junit.framework.Assert.assertEquals(Assert.java:204)
	at org.joda.time.TestLocalDateTime_Properties.check(TestLocalDateTime_Properties.java:1076)
	at org.joda.time.TestLocalDateTime_Properties.testPropertyAddToCopyMonth(TestLocalDateTime_Properties.java:231)

testPlus_RP(org.joda.time.TestLocalDate_Basics)  Time elapsed: 0 sec  <<< FAILURE!
junit.framework.AssertionFailedError: expected:<2003-07-28> but was:<2003-09-28>
	at junit.framework.Assert.fail(Assert.java:47)
	at junit.framework.Assert.failNotEquals(Assert.java:280)
	at junit.framework.Assert.assertEquals(Assert.java:64)
	at junit.framework.Assert.assertEquals(Assert.java:71)
	at org.joda.time.TestLocalDate_Basics.testPlus_RP(TestLocalDate_Basics.java:521)

testPlusMonths_int(org.joda.time.TestLocalDate_Basics)  Time elapsed: 0.001 sec  <<< FAILURE!
junit.framework.AssertionFailedError: expected:<2002-06-03> but was:<2002-08-03>
	at junit.framework.Assert.fail(Assert.java:47)
	at junit.framework.Assert.failNotEquals(Assert.java:280)
	at junit.framework.Assert.assertEquals(Assert.java:64)
	at junit.framework.Assert.assertEquals(Assert.java:71)
	at org.joda.time.TestLocalDate_Basics.testPlusMonths_int(TestLocalDate_Basics.java:541)

testMinus_RP(org.joda.time.TestLocalDate_Basics)  Time elapsed: 0.001 sec  <<< FAILURE!
junit.framework.AssertionFailedError: expected:<2001-03-26> but was:<2001-05-26>
	at junit.framework.Assert.fail(Assert.java:47)
	at junit.framework.Assert.failNotEquals(Assert.java:280)
	at junit.framework.Assert.assertEquals(Assert.java:64)
	at junit.framework.Assert.assertEquals(Assert.java:71)
	at org.joda.time.TestLocalDate_Basics.testMinus_RP(TestLocalDate_Basics.java:576)

testMinusMonths_int(org.joda.time.TestLocalDate_Basics)  Time elapsed: 0.001 sec  <<< FAILURE!
junit.framework.AssertionFailedError: expected:<2002-04-03> but was:<2002-06-03>
	at junit.framework.Assert.fail(Assert.java:47)
	at junit.framework.Assert.failNotEquals(Assert.java:280)
	at junit.framework.Assert.assertEquals(Assert.java:64)
	at junit.framework.Assert.assertEquals(Assert.java:71)
	at org.joda.time.TestLocalDate_Basics.testMinusMonths_int(TestLocalDate_Basics.java:596)

testToDateTime_LocalTime_Zone_dstGap(org.joda.time.TestLocalDate_Basics)  Time elapsed: 0 sec  <<< FAILURE!
junit.framework.AssertionFailedError
	at junit.framework.Assert.fail(Assert.java:47)
	at junit.framework.Assert.fail(Assert.java:53)
	at org.joda.time.TestLocalDate_Basics.testToDateTime_LocalTime_Zone_dstGap(TestLocalDate_Basics.java:871)

testPropertyAddToCopyMonth(org.joda.time.TestLocalDate_Properties)  Time elapsed: 0 sec  <<< FAILURE!
junit.framework.AssertionFailedError: expected:<1972> but was:<1973>
	at junit.framework.Assert.fail(Assert.java:47)
	at junit.framework.Assert.failNotEquals(Assert.java:280)
	at junit.framework.Assert.assertEquals(Assert.java:64)
	at junit.framework.Assert.assertEquals(Assert.java:198)
	at junit.framework.Assert.assertEquals(Assert.java:204)
	at org.joda.time.TestLocalDate_Properties.check(TestLocalDate_Properties.java:551)
	at org.joda.time.TestLocalDate_Properties.testPropertyAddToCopyMonth(TestLocalDate_Properties.java:226)

testConstructor_long_long_PeriodType1(org.joda.time.TestPeriod_Constructors)  Time elapsed: 0.001 sec  <<< FAILURE!
junit.framework.AssertionFailedError: expected:<0> but was:<-8>
	at junit.framework.Assert.fail(Assert.java:47)
	at junit.framework.Assert.failNotEquals(Assert.java:280)
	at junit.framework.Assert.assertEquals(Assert.java:64)
	at junit.framework.Assert.assertEquals(Assert.java:198)
	at junit.framework.Assert.assertEquals(Assert.java:204)
	at org.joda.time.TestPeriod_Constructors.testConstructor_long_long_PeriodType1(TestPeriod_Constructors.java:500)

testConstructor_long_long_PeriodType_Chronology1(org.joda.time.TestPeriod_Constructors)  Time elapsed: 0.001 sec  <<< FAILURE!
junit.framework.AssertionFailedError: expected:<0> but was:<-8>
	at junit.framework.Assert.fail(Assert.java:47)
	at junit.framework.Assert.failNotEquals(Assert.java:280)
	at junit.framework.Assert.assertEquals(Assert.java:64)
	at junit.framework.Assert.assertEquals(Assert.java:198)
	at junit.framework.Assert.assertEquals(Assert.java:204)
	at org.joda.time.TestPeriod_Constructors.testConstructor_long_long_PeriodType_Chronology1(TestPeriod_Constructors.java:593)

testConstructor_long_long_PeriodType_Chronology2(org.joda.time.TestPeriod_Constructors)  Time elapsed: 0.001 sec  <<< FAILURE!
junit.framework.AssertionFailedError: expected:<0> but was:<-8>
	at junit.framework.Assert.fail(Assert.java:47)
	at junit.framework.Assert.failNotEquals(Assert.java:280)
	at junit.framework.Assert.assertEquals(Assert.java:64)
	at junit.framework.Assert.assertEquals(Assert.java:198)
	at junit.framework.Assert.assertEquals(Assert.java:204)
	at org.joda.time.TestPeriod_Constructors.testConstructor_long_long_PeriodType_Chronology2(TestPeriod_Constructors.java:608)

testConstructor_RI_RI_PeriodType1(org.joda.time.TestPeriod_Constructors)  Time elapsed: 0 sec  <<< FAILURE!
junit.framework.AssertionFailedError: expected:<0> but was:<-8>
	at junit.framework.Assert.fail(Assert.java:47)
	at junit.framework.Assert.failNotEquals(Assert.java:280)
	at junit.framework.Assert.assertEquals(Assert.java:64)
	at junit.framework.Assert.assertEquals(Assert.java:198)
	at junit.framework.Assert.assertEquals(Assert.java:204)
	at org.joda.time.TestPeriod_Constructors.testConstructor_RI_RI_PeriodType1(TestPeriod_Constructors.java:732)

testConstructor_RI_RI_PeriodType4(org.joda.time.TestPeriod_Constructors)  Time elapsed: 0 sec  <<< FAILURE!
junit.framework.AssertionFailedError: expected:<1> but was:<-7>
	at junit.framework.Assert.fail(Assert.java:47)
	at junit.framework.Assert.failNotEquals(Assert.java:280)
	at junit.framework.Assert.assertEquals(Assert.java:64)
	at junit.framework.Assert.assertEquals(Assert.java:198)
	at junit.framework.Assert.assertEquals(Assert.java:204)
	at org.joda.time.TestPeriod_Constructors.testConstructor_RI_RI_PeriodType4(TestPeriod_Constructors.java:777)

testConstructor_RP_RP1(org.joda.time.TestPeriod_Constructors)  Time elapsed: 0 sec  <<< FAILURE!
junit.framework.AssertionFailedError: expected:<0> but was:<-8>
	at junit.framework.Assert.fail(Assert.java:47)
	at junit.framework.Assert.failNotEquals(Assert.java:280)
	at junit.framework.Assert.assertEquals(Assert.java:64)
	at junit.framework.Assert.assertEquals(Assert.java:198)
	at junit.framework.Assert.assertEquals(Assert.java:204)
	at org.joda.time.TestPeriod_Constructors.testConstructor_RP_RP1(TestPeriod_Constructors.java:809)

testConstructor_RP_RP2(org.joda.time.TestPeriod_Constructors)  Time elapsed: 0.001 sec  <<< FAILURE!
junit.framework.AssertionFailedError: expected:<1> but was:<-7>
	at junit.framework.Assert.fail(Assert.java:47)
	at junit.framework.Assert.failNotEquals(Assert.java:280)
	at junit.framework.Assert.assertEquals(Assert.java:64)
	at junit.framework.Assert.assertEquals(Assert.java:198)
	at junit.framework.Assert.assertEquals(Assert.java:204)
	at org.joda.time.TestPeriod_Constructors.testConstructor_RP_RP2(TestPeriod_Constructors.java:825)

testConstructor_RP_RP2Local(org.joda.time.TestPeriod_Constructors)  Time elapsed: 0 sec  <<< FAILURE!
junit.framework.AssertionFailedError: expected:<1> but was:<-7>
	at junit.framework.Assert.fail(Assert.java:47)
	at junit.framework.Assert.failNotEquals(Assert.java:280)
	at junit.framework.Assert.assertEquals(Assert.java:64)
	at junit.framework.Assert.assertEquals(Assert.java:198)
	at junit.framework.Assert.assertEquals(Assert.java:204)
	at org.joda.time.TestPeriod_Constructors.testConstructor_RP_RP2Local(TestPeriod_Constructors.java:840)

testConstructor_RP_RP_PeriodType1(org.joda.time.TestPeriod_Constructors)  Time elapsed: 0 sec  <<< FAILURE!
junit.framework.AssertionFailedError: expected:<0> but was:<-8>
	at junit.framework.Assert.fail(Assert.java:47)
	at junit.framework.Assert.failNotEquals(Assert.java:280)
	at junit.framework.Assert.assertEquals(Assert.java:64)
	at junit.framework.Assert.assertEquals(Assert.java:198)
	at junit.framework.Assert.assertEquals(Assert.java:204)
	at org.joda.time.TestPeriod_Constructors.testConstructor_RP_RP_PeriodType1(TestPeriod_Constructors.java:915)

testConstructor_RP_RP_PeriodType2(org.joda.time.TestPeriod_Constructors)  Time elapsed: 0.001 sec  <<< FAILURE!
junit.framework.AssertionFailedError: expected:<8> but was:<-53>
	at junit.framework.Assert.fail(Assert.java:47)
	at junit.framework.Assert.failNotEquals(Assert.java:280)
	at junit.framework.Assert.assertEquals(Assert.java:64)
	at junit.framework.Assert.assertEquals(Assert.java:198)
	at junit.framework.Assert.assertEquals(Assert.java:204)
	at org.joda.time.TestPeriod_Constructors.testConstructor_RP_RP_PeriodType2(TestPeriod_Constructors.java:932)

testConstructor_RP_RP_PeriodType2Local(org.joda.time.TestPeriod_Constructors)  Time elapsed: 0 sec  <<< FAILURE!
junit.framework.AssertionFailedError: expected:<8> but was:<-53>
	at junit.framework.Assert.fail(Assert.java:47)
	at junit.framework.Assert.failNotEquals(Assert.java:280)
	at junit.framework.Assert.assertEquals(Assert.java:64)
	at junit.framework.Assert.assertEquals(Assert.java:198)
	at junit.framework.Assert.assertEquals(Assert.java:204)
	at org.joda.time.TestPeriod_Constructors.testConstructor_RP_RP_PeriodType2Local(TestPeriod_Constructors.java:947)

testConstructor_trickyDifferences_RI_RI_toFeb_standardYear(org.joda.time.TestPeriod_Constructors)  Time elapsed: 0.001 sec  <<< FAILURE!
junit.framework.AssertionFailedError: expected:<P1M3W6D> but was:<P1M-4W-4D>
	at junit.framework.Assert.fail(Assert.java:47)
	at junit.framework.Assert.failNotEquals(Assert.java:280)
	at junit.framework.Assert.assertEquals(Assert.java:64)
	at junit.framework.Assert.assertEquals(Assert.java:71)
	at org.joda.time.TestPeriod_Constructors.testConstructor_trickyDifferences_RI_RI_toFeb_standardYear(TestPeriod_Constructors.java:1364)

testConstructor_trickyDifferences_RI_RI_toFeb_leapYear(org.joda.time.TestPeriod_Constructors)  Time elapsed: 0.001 sec  <<< FAILURE!
junit.framework.AssertionFailedError: expected:<P1M4W> but was:<P1M-4W-4D>
	at junit.framework.Assert.fail(Assert.java:47)
	at junit.framework.Assert.failNotEquals(Assert.java:280)
	at junit.framework.Assert.assertEquals(Assert.java:64)
	at junit.framework.Assert.assertEquals(Assert.java:71)
	at org.joda.time.TestPeriod_Constructors.testConstructor_trickyDifferences_RI_RI_toFeb_leapYear(TestPeriod_Constructors.java:1372)

testConstructor_trickyDifferences_RI_RI_toFeb_exactMonths(org.joda.time.TestPeriod_Constructors)  Time elapsed: 0 sec  <<< FAILURE!
junit.framework.AssertionFailedError: expected:<P2M> but was:<P2M-8W-3D>
	at junit.framework.Assert.fail(Assert.java:47)
	at junit.framework.Assert.failNotEquals(Assert.java:280)
	at junit.framework.Assert.assertEquals(Assert.java:64)
	at junit.framework.Assert.assertEquals(Assert.java:71)
	at org.joda.time.TestPeriod_Constructors.testConstructor_trickyDifferences_RI_RI_toFeb_exactMonths(TestPeriod_Constructors.java:1380)

testConstructor_trickyDifferences_RI_RI_toFeb_endOfMonth1(org.joda.time.TestPeriod_Constructors)  Time elapsed: 0.001 sec  <<< FAILURE!
junit.framework.AssertionFailedError: expected:<P2M> but was:<P2M-8W-4D>
	at junit.framework.Assert.fail(Assert.java:47)
	at junit.framework.Assert.failNotEquals(Assert.java:280)
	at junit.framework.Assert.assertEquals(Assert.java:64)
	at junit.framework.Assert.assertEquals(Assert.java:71)
	at org.joda.time.TestPeriod_Constructors.testConstructor_trickyDifferences_RI_RI_toFeb_endOfMonth1(TestPeriod_Constructors.java:1388)

testConstructor_trickyDifferences_RI_RI_toFeb_endOfMonth2(org.joda.time.TestPeriod_Constructors)  Time elapsed: 0.001 sec  <<< FAILURE!
junit.framework.AssertionFailedError: expected:<P2M> but was:<P2M-8W-5D>
	at junit.framework.Assert.fail(Assert.java:47)
	at junit.framework.Assert.failNotEquals(Assert.java:280)
	at junit.framework.Assert.assertEquals(Assert.java:64)
	at junit.framework.Assert.assertEquals(Assert.java:71)
	at org.joda.time.TestPeriod_Constructors.testConstructor_trickyDifferences_RI_RI_toFeb_endOfMonth2(TestPeriod_Constructors.java:1396)

testConstructor_trickyDifferences_RI_RI_toFeb_endOfMonth3(org.joda.time.TestPeriod_Constructors)  Time elapsed: 0 sec  <<< FAILURE!
junit.framework.AssertionFailedError: expected:<P2M> but was:<P2M-8W-5D>
	at junit.framework.Assert.fail(Assert.java:47)
	at junit.framework.Assert.failNotEquals(Assert.java:280)
	at junit.framework.Assert.assertEquals(Assert.java:64)
	at junit.framework.Assert.assertEquals(Assert.java:71)
	at org.joda.time.TestPeriod_Constructors.testConstructor_trickyDifferences_RI_RI_toFeb_endOfMonth3(TestPeriod_Constructors.java:1404)

testConstructor_trickyDifferences_RI_RI_toMar_endOfMonth1(org.joda.time.TestPeriod_Constructors)  Time elapsed: 0 sec  <<< FAILURE!
junit.framework.AssertionFailedError: expected:<P1M4W2D> but was:<P1M-4W-3D>
	at junit.framework.Assert.fail(Assert.java:47)
	at junit.framework.Assert.failNotEquals(Assert.java:280)
	at junit.framework.Assert.assertEquals(Assert.java:64)
	at junit.framework.Assert.assertEquals(Assert.java:71)
	at org.joda.time.TestPeriod_Constructors.testConstructor_trickyDifferences_RI_RI_toMar_endOfMonth1(TestPeriod_Constructors.java:1412)

testConstructor_trickyDifferences_RI_RI_toMar_endOfMonth2(org.joda.time.TestPeriod_Constructors)  Time elapsed: 0.001 sec  <<< FAILURE!
junit.framework.AssertionFailedError: expected:<P2M> but was:<P2M-8W-5D>
	at junit.framework.Assert.fail(Assert.java:47)
	at junit.framework.Assert.failNotEquals(Assert.java:280)
	at junit.framework.Assert.assertEquals(Assert.java:64)
	at junit.framework.Assert.assertEquals(Assert.java:71)
	at org.joda.time.TestPeriod_Constructors.testConstructor_trickyDifferences_RI_RI_toMar_endOfMonth2(TestPeriod_Constructors.java:1420)

testConstructor_trickyDifferences_LD_LD_toFeb_standardYear(org.joda.time.TestPeriod_Constructors)  Time elapsed: 0.001 sec  <<< FAILURE!
junit.framework.AssertionFailedError: expected:<P1M3W6D> but was:<P1M-4W-4D>
	at junit.framework.Assert.fail(Assert.java:47)
	at junit.framework.Assert.failNotEquals(Assert.java:280)
	at junit.framework.Assert.assertEquals(Assert.java:64)
	at junit.framework.Assert.assertEquals(Assert.java:71)
	at org.joda.time.TestPeriod_Constructors.testConstructor_trickyDifferences_LD_LD_toFeb_standardYear(TestPeriod_Constructors.java:1429)

testConstructor_trickyDifferences_LD_LD_toFeb_leapYear(org.joda.time.TestPeriod_Constructors)  Time elapsed: 0 sec  <<< FAILURE!
junit.framework.AssertionFailedError: expected:<P1M4W> but was:<P1M-4W-4D>
	at junit.framework.Assert.fail(Assert.java:47)
	at junit.framework.Assert.failNotEquals(Assert.java:280)
	at junit.framework.Assert.assertEquals(Assert.java:64)
	at junit.framework.Assert.assertEquals(Assert.java:71)
	at org.joda.time.TestPeriod_Constructors.testConstructor_trickyDifferences_LD_LD_toFeb_leapYear(TestPeriod_Constructors.java:1437)

testConstructor_trickyDifferences_LD_LD_toFeb_exactMonths(org.joda.time.TestPeriod_Constructors)  Time elapsed: 0.001 sec  <<< FAILURE!
junit.framework.AssertionFailedError: expected:<P2M> but was:<P2M-8W-3D>
	at junit.framework.Assert.fail(Assert.java:47)
	at junit.framework.Assert.failNotEquals(Assert.java:280)
	at junit.framework.Assert.assertEquals(Assert.java:64)
	at junit.framework.Assert.assertEquals(Assert.java:71)
	at org.joda.time.TestPeriod_Constructors.testConstructor_trickyDifferences_LD_LD_toFeb_exactMonths(TestPeriod_Constructors.java:1445)

testConstructor_trickyDifferences_LD_LD_toFeb_endOfMonth1(org.joda.time.TestPeriod_Constructors)  Time elapsed: 0 sec  <<< FAILURE!
junit.framework.AssertionFailedError: expected:<P2M> but was:<P2M-8W-4D>
	at junit.framework.Assert.fail(Assert.java:47)
	at junit.framework.Assert.failNotEquals(Assert.java:280)
	at junit.framework.Assert.assertEquals(Assert.java:64)
	at junit.framework.Assert.assertEquals(Assert.java:71)
	at org.joda.time.TestPeriod_Constructors.testConstructor_trickyDifferences_LD_LD_toFeb_endOfMonth1(TestPeriod_Constructors.java:1453)

testConstructor_trickyDifferences_LD_LD_toFeb_endOfMonth2(org.joda.time.TestPeriod_Constructors)  Time elapsed: 0.001 sec  <<< FAILURE!
junit.framework.AssertionFailedError: expected:<P2M> but was:<P2M-8W-5D>
	at junit.framework.Assert.fail(Assert.java:47)
	at junit.framework.Assert.failNotEquals(Assert.java:280)
	at junit.framework.Assert.assertEquals(Assert.java:64)
	at junit.framework.Assert.assertEquals(Assert.java:71)
	at org.joda.time.TestPeriod_Constructors.testConstructor_trickyDifferences_LD_LD_toFeb_endOfMonth2(TestPeriod_Constructors.java:1461)

testConstructor_trickyDifferences_LD_LD_toFeb_endOfMonth3(org.joda.time.TestPeriod_Constructors)  Time elapsed: 0 sec  <<< FAILURE!
junit.framework.AssertionFailedError: expected:<P2M> but was:<P2M-8W-5D>
	at junit.framework.Assert.fail(Assert.java:47)
	at junit.framework.Assert.failNotEquals(Assert.java:280)
	at junit.framework.Assert.assertEquals(Assert.java:64)
	at junit.framework.Assert.assertEquals(Assert.java:71)
	at org.joda.time.TestPeriod_Constructors.testConstructor_trickyDifferences_LD_LD_toFeb_endOfMonth3(TestPeriod_Constructors.java:1469)

testConstructor_trickyDifferences_LD_LD_toMar_endOfMonth1(org.joda.time.TestPeriod_Constructors)  Time elapsed: 0.001 sec  <<< FAILURE!
junit.framework.AssertionFailedError: expected:<P1M4W2D> but was:<P1M-4W-3D>
	at junit.framework.Assert.fail(Assert.java:47)
	at junit.framework.Assert.failNotEquals(Assert.java:280)
	at junit.framework.Assert.assertEquals(Assert.java:64)
	at junit.framework.Assert.assertEquals(Assert.java:71)
	at org.joda.time.TestPeriod_Constructors.testConstructor_trickyDifferences_LD_LD_toMar_endOfMonth1(TestPeriod_Constructors.java:1477)

testConstructor_trickyDifferences_LD_LD_toMar_endOfMonth2(org.joda.time.TestPeriod_Constructors)  Time elapsed: 0.001 sec  <<< FAILURE!
junit.framework.AssertionFailedError: expected:<P2M> but was:<P2M-8W-5D>
	at junit.framework.Assert.fail(Assert.java:47)
	at junit.framework.Assert.failNotEquals(Assert.java:280)
	at junit.framework.Assert.assertEquals(Assert.java:64)
	at junit.framework.Assert.assertEquals(Assert.java:71)
	at org.joda.time.TestPeriod_Constructors.testConstructor_trickyDifferences_LD_LD_toMar_endOfMonth2(TestPeriod_Constructors.java:1485)

testConstructor_long_long1(org.joda.time.TestPeriod_Constructors)  Time elapsed: 0 sec  <<< FAILURE!
junit.framework.AssertionFailedError: expected:<0> but was:<-8>
	at junit.framework.Assert.fail(Assert.java:47)
	at junit.framework.Assert.failNotEquals(Assert.java:280)
	at junit.framework.Assert.assertEquals(Assert.java:64)
	at junit.framework.Assert.assertEquals(Assert.java:198)
	at junit.framework.Assert.assertEquals(Assert.java:204)
	at org.joda.time.TestPeriod_Constructors.testConstructor_long_long1(TestPeriod_Constructors.java:469)

testConstructor_RI_RI1(org.joda.time.TestPeriod_Constructors)  Time elapsed: 0.001 sec  <<< FAILURE!
junit.framework.AssertionFailedError: expected:<0> but was:<-8>
	at junit.framework.Assert.fail(Assert.java:47)
	at junit.framework.Assert.failNotEquals(Assert.java:280)
	at junit.framework.Assert.assertEquals(Assert.java:64)
	at junit.framework.Assert.assertEquals(Assert.java:198)
	at junit.framework.Assert.assertEquals(Assert.java:204)
	at org.joda.time.TestPeriod_Constructors.testConstructor_RI_RI1(TestPeriod_Constructors.java:624)

testConstructor_RI_RI2(org.joda.time.TestPeriod_Constructors)  Time elapsed: 0 sec  <<< FAILURE!
junit.framework.AssertionFailedError: expected:<1> but was:<-7>
	at junit.framework.Assert.fail(Assert.java:47)
	at junit.framework.Assert.failNotEquals(Assert.java:280)
	at junit.framework.Assert.assertEquals(Assert.java:64)
	at junit.framework.Assert.assertEquals(Assert.java:198)
	at junit.framework.Assert.assertEquals(Assert.java:204)
	at org.joda.time.TestPeriod_Constructors.testConstructor_RI_RI2(TestPeriod_Constructors.java:639)

testConstructor_RI_RI3(org.joda.time.TestPeriod_Constructors)  Time elapsed: 0 sec  <<< FAILURE!
junit.framework.AssertionFailedError: expected:<1> but was:<-7>
	at junit.framework.Assert.fail(Assert.java:47)
	at junit.framework.Assert.failNotEquals(Assert.java:280)
	at junit.framework.Assert.assertEquals(Assert.java:64)
	at junit.framework.Assert.assertEquals(Assert.java:198)
	at junit.framework.Assert.assertEquals(Assert.java:204)
	at org.joda.time.TestPeriod_Constructors.testConstructor_RI_RI3(TestPeriod_Constructors.java:654)

testConstructor_RI_RI4(org.joda.time.TestPeriod_Constructors)  Time elapsed: 0.001 sec  <<< FAILURE!
junit.framework.AssertionFailedError: expected:<-1> but was:<-9>
	at junit.framework.Assert.fail(Assert.java:47)
	at junit.framework.Assert.failNotEquals(Assert.java:280)
	at junit.framework.Assert.assertEquals(Assert.java:64)
	at junit.framework.Assert.assertEquals(Assert.java:198)
	at junit.framework.Assert.assertEquals(Assert.java:204)
	at org.joda.time.TestPeriod_Constructors.testConstructor_RI_RI4(TestPeriod_Constructors.java:669)

testConstructor_long_long_Chronology1(org.joda.time.TestPeriod_Constructors)  Time elapsed: 0.001 sec  <<< FAILURE!
junit.framework.AssertionFailedError: expected:<0> but was:<-8>
	at junit.framework.Assert.fail(Assert.java:47)
	at junit.framework.Assert.failNotEquals(Assert.java:280)
	at junit.framework.Assert.assertEquals(Assert.java:64)
	at junit.framework.Assert.assertEquals(Assert.java:198)
	at junit.framework.Assert.assertEquals(Assert.java:204)
	at org.joda.time.TestPeriod_Constructors.testConstructor_long_long_Chronology1(TestPeriod_Constructors.java:562)

testConstructor_long_long_Chronology2(org.joda.time.TestPeriod_Constructors)  Time elapsed: 0.001 sec  <<< FAILURE!
junit.framework.AssertionFailedError: expected:<0> but was:<-8>
	at junit.framework.Assert.fail(Assert.java:47)
	at junit.framework.Assert.failNotEquals(Assert.java:280)
	at junit.framework.Assert.assertEquals(Assert.java:64)
	at junit.framework.Assert.assertEquals(Assert.java:198)
	at junit.framework.Assert.assertEquals(Assert.java:204)
	at org.joda.time.TestPeriod_Constructors.testConstructor_long_long_Chronology2(TestPeriod_Constructors.java:577)

testConstructor_RI_RI7(org.joda.time.TestPeriod_Constructors)  Time elapsed: 0.001 sec  <<< FAILURE!
junit.framework.AssertionFailedError: expected:<1> but was:<0>
	at junit.framework.Assert.fail(Assert.java:47)
	at junit.framework.Assert.failNotEquals(Assert.java:280)
	at junit.framework.Assert.assertEquals(Assert.java:64)
	at junit.framework.Assert.assertEquals(Assert.java:198)
	at junit.framework.Assert.assertEquals(Assert.java:204)
	at org.joda.time.TestPeriod_Constructors.testConstructor_RI_RI7(TestPeriod_Constructors.java:718)

testConstructor_RI_RD1(org.joda.time.TestPeriod_Constructors)  Time elapsed: 0.001 sec  <<< FAILURE!
junit.framework.AssertionFailedError: expected:<0> but was:<-8>
	at junit.framework.Assert.fail(Assert.java:47)
	at junit.framework.Assert.failNotEquals(Assert.java:280)
	at junit.framework.Assert.assertEquals(Assert.java:64)
	at junit.framework.Assert.assertEquals(Assert.java:198)
	at junit.framework.Assert.assertEquals(Assert.java:204)
	at org.joda.time.TestPeriod_Constructors.testConstructor_RI_RD1(TestPeriod_Constructors.java:1021)

testConstructor_RD_RI1(org.joda.time.TestPeriod_Constructors)  Time elapsed: 0.001 sec  <<< FAILURE!
junit.framework.AssertionFailedError: expected:<0> but was:<-8>
	at junit.framework.Assert.fail(Assert.java:47)
	at junit.framework.Assert.failNotEquals(Assert.java:280)
	at junit.framework.Assert.assertEquals(Assert.java:64)
	at junit.framework.Assert.assertEquals(Assert.java:198)
	at junit.framework.Assert.assertEquals(Assert.java:204)
	at org.joda.time.TestPeriod_Constructors.testConstructor_RD_RI1(TestPeriod_Constructors.java:1085)

testConstructor_long_long2(org.joda.time.TestPeriod_Constructors)  Time elapsed: 0.001 sec  <<< FAILURE!
junit.framework.AssertionFailedError: expected:<1> but was:<-7>
	at junit.framework.Assert.fail(Assert.java:47)
	at junit.framework.Assert.failNotEquals(Assert.java:280)
	at junit.framework.Assert.assertEquals(Assert.java:64)
	at junit.framework.Assert.assertEquals(Assert.java:198)
	at junit.framework.Assert.assertEquals(Assert.java:204)
	at org.joda.time.TestPeriod_Constructors.testConstructor_long_long2(TestPeriod_Constructors.java:484)

testConstructor_long_long_PeriodType1(org.joda.time.TestMutablePeriod_Constructors)  Time elapsed: 0.001 sec  <<< FAILURE!
junit.framework.AssertionFailedError: expected:<0> but was:<-8>
	at junit.framework.Assert.fail(Assert.java:47)
	at junit.framework.Assert.failNotEquals(Assert.java:280)
	at junit.framework.Assert.assertEquals(Assert.java:64)
	at junit.framework.Assert.assertEquals(Assert.java:198)
	at junit.framework.Assert.assertEquals(Assert.java:204)
	at org.joda.time.TestMutablePeriod_Constructors.testConstructor_long_long_PeriodType1(TestMutablePeriod_Constructors.java:506)

testConstructor_long_long_PeriodType_Chronology1(org.joda.time.TestMutablePeriod_Constructors)  Time elapsed: 0.001 sec  <<< FAILURE!
junit.framework.AssertionFailedError: expected:<0> but was:<-8>
	at junit.framework.Assert.fail(Assert.java:47)
	at junit.framework.Assert.failNotEquals(Assert.java:280)
	at junit.framework.Assert.assertEquals(Assert.java:64)
	at junit.framework.Assert.assertEquals(Assert.java:198)
	at junit.framework.Assert.assertEquals(Assert.java:204)
	at org.joda.time.TestMutablePeriod_Constructors.testConstructor_long_long_PeriodType_Chronology1(TestMutablePeriod_Constructors.java:583)

testConstructor_long_long_PeriodType_Chronology2(org.joda.time.TestMutablePeriod_Constructors)  Time elapsed: 0 sec  <<< FAILURE!
junit.framework.AssertionFailedError: expected:<0> but was:<-8>
	at junit.framework.Assert.fail(Assert.java:47)
	at junit.framework.Assert.failNotEquals(Assert.java:280)
	at junit.framework.Assert.assertEquals(Assert.java:64)
	at junit.framework.Assert.assertEquals(Assert.java:198)
	at junit.framework.Assert.assertEquals(Assert.java:204)
	at org.joda.time.TestMutablePeriod_Constructors.testConstructor_long_long_PeriodType_Chronology2(TestMutablePeriod_Constructors.java:598)

testConstructor_RI_RI_PeriodType1(org.joda.time.TestMutablePeriod_Constructors)  Time elapsed: 0.001 sec  <<< FAILURE!
junit.framework.AssertionFailedError: expected:<0> but was:<-8>
	at junit.framework.Assert.fail(Assert.java:47)
	at junit.framework.Assert.failNotEquals(Assert.java:280)
	at junit.framework.Assert.assertEquals(Assert.java:64)
	at junit.framework.Assert.assertEquals(Assert.java:198)
	at junit.framework.Assert.assertEquals(Assert.java:204)
	at org.joda.time.TestMutablePeriod_Constructors.testConstructor_RI_RI_PeriodType1(TestMutablePeriod_Constructors.java:690)

testConstructor_RI_RI_PeriodType4(org.joda.time.TestMutablePeriod_Constructors)  Time elapsed: 0.001 sec  <<< FAILURE!
junit.framework.AssertionFailedError: expected:<1> but was:<-7>
	at junit.framework.Assert.fail(Assert.java:47)
	at junit.framework.Assert.failNotEquals(Assert.java:280)
	at junit.framework.Assert.assertEquals(Assert.java:64)
	at junit.framework.Assert.assertEquals(Assert.java:198)
	at junit.framework.Assert.assertEquals(Assert.java:204)
	at org.joda.time.TestMutablePeriod_Constructors.testConstructor_RI_RI_PeriodType4(TestMutablePeriod_Constructors.java:735)

testConstructor_long_long1(org.joda.time.TestMutablePeriod_Constructors)  Time elapsed: 0.001 sec  <<< FAILURE!
junit.framework.AssertionFailedError: expected:<0> but was:<-8>
	at junit.framework.Assert.fail(Assert.java:47)
	at junit.framework.Assert.failNotEquals(Assert.java:280)
	at junit.framework.Assert.assertEquals(Assert.java:64)
	at junit.framework.Assert.assertEquals(Assert.java:198)
	at junit.framework.Assert.assertEquals(Assert.java:204)
	at org.joda.time.TestMutablePeriod_Constructors.testConstructor_long_long1(TestMutablePeriod_Constructors.java:475)

testConstructor_RI_RI1(org.joda.time.TestMutablePeriod_Constructors)  Time elapsed: 0 sec  <<< FAILURE!
junit.framework.AssertionFailedError: expected:<0> but was:<-8>
	at junit.framework.Assert.fail(Assert.java:47)
	at junit.framework.Assert.failNotEquals(Assert.java:280)
	at junit.framework.Assert.assertEquals(Assert.java:64)
	at junit.framework.Assert.assertEquals(Assert.java:198)
	at junit.framework.Assert.assertEquals(Assert.java:204)
	at org.joda.time.TestMutablePeriod_Constructors.testConstructor_RI_RI1(TestMutablePeriod_Constructors.java:614)

testConstructor_RI_RI2(org.joda.time.TestMutablePeriod_Constructors)  Time elapsed: 0.001 sec  <<< FAILURE!
junit.framework.AssertionFailedError: expected:<1> but was:<-7>
	at junit.framework.Assert.fail(Assert.java:47)
	at junit.framework.Assert.failNotEquals(Assert.java:280)
	at junit.framework.Assert.assertEquals(Assert.java:64)
	at junit.framework.Assert.assertEquals(Assert.java:198)
	at junit.framework.Assert.assertEquals(Assert.java:204)
	at org.joda.time.TestMutablePeriod_Constructors.testConstructor_RI_RI2(TestMutablePeriod_Constructors.java:629)

testConstructor_RI_RI3(org.joda.time.TestMutablePeriod_Constructors)  Time elapsed: 0 sec  <<< FAILURE!
junit.framework.AssertionFailedError: expected:<1> but was:<-7>
	at junit.framework.Assert.fail(Assert.java:47)
	at junit.framework.Assert.failNotEquals(Assert.java:280)
	at junit.framework.Assert.assertEquals(Assert.java:64)
	at junit.framework.Assert.assertEquals(Assert.java:198)
	at junit.framework.Assert.assertEquals(Assert.java:204)
	at org.joda.time.TestMutablePeriod_Constructors.testConstructor_RI_RI3(TestMutablePeriod_Constructors.java:644)

testConstructor_RI_RI4(org.joda.time.TestMutablePeriod_Constructors)  Time elapsed: 0 sec  <<< FAILURE!
junit.framework.AssertionFailedError: expected:<-1> but was:<-9>
	at junit.framework.Assert.fail(Assert.java:47)
	at junit.framework.Assert.failNotEquals(Assert.java:280)
	at junit.framework.Assert.assertEquals(Assert.java:64)
	at junit.framework.Assert.assertEquals(Assert.java:198)
	at junit.framework.Assert.assertEquals(Assert.java:204)
	at org.joda.time.TestMutablePeriod_Constructors.testConstructor_RI_RI4(TestMutablePeriod_Constructors.java:659)

testConstructor_long_long_Chronology1(org.joda.time.TestMutablePeriod_Constructors)  Time elapsed: 0 sec  <<< FAILURE!
junit.framework.AssertionFailedError: expected:<0> but was:<-8>
	at junit.framework.Assert.fail(Assert.java:47)
	at junit.framework.Assert.failNotEquals(Assert.java:280)
	at junit.framework.Assert.assertEquals(Assert.java:64)
	at junit.framework.Assert.assertEquals(Assert.java:198)
	at junit.framework.Assert.assertEquals(Assert.java:204)
	at org.joda.time.TestMutablePeriod_Constructors.testConstructor_long_long_Chronology1(TestMutablePeriod_Constructors.java:552)

testConstructor_long_long_Chronology2(org.joda.time.TestMutablePeriod_Constructors)  Time elapsed: 0.001 sec  <<< FAILURE!
junit.framework.AssertionFailedError: expected:<0> but was:<-8>
	at junit.framework.Assert.fail(Assert.java:47)
	at junit.framework.Assert.failNotEquals(Assert.java:280)
	at junit.framework.Assert.assertEquals(Assert.java:64)
	at junit.framework.Assert.assertEquals(Assert.java:198)
	at junit.framework.Assert.assertEquals(Assert.java:204)
	at org.joda.time.TestMutablePeriod_Constructors.testConstructor_long_long_Chronology2(TestMutablePeriod_Constructors.java:567)

testConstructor_RI_RD1(org.joda.time.TestMutablePeriod_Constructors)  Time elapsed: 0 sec  <<< FAILURE!
junit.framework.AssertionFailedError: expected:<0> but was:<-8>
	at junit.framework.Assert.fail(Assert.java:47)
	at junit.framework.Assert.failNotEquals(Assert.java:280)
	at junit.framework.Assert.assertEquals(Assert.java:64)
	at junit.framework.Assert.assertEquals(Assert.java:198)
	at junit.framework.Assert.assertEquals(Assert.java:204)
	at org.joda.time.TestMutablePeriod_Constructors.testConstructor_RI_RD1(TestMutablePeriod_Constructors.java:767)

testConstructor_long_long2(org.joda.time.TestMutablePeriod_Constructors)  Time elapsed: 0 sec  <<< FAILURE!
junit.framework.AssertionFailedError: expected:<1> but was:<-7>
	at junit.framework.Assert.fail(Assert.java:47)
	at junit.framework.Assert.failNotEquals(Assert.java:280)
	at junit.framework.Assert.assertEquals(Assert.java:64)
	at junit.framework.Assert.assertEquals(Assert.java:198)
	at junit.framework.Assert.assertEquals(Assert.java:204)
	at org.joda.time.TestMutablePeriod_Constructors.testConstructor_long_long2(TestMutablePeriod_Constructors.java:490)

testAdd_RInterval2(org.joda.time.TestMutablePeriod_Updates)  Time elapsed: 0.001 sec  <<< FAILURE!
junit.framework.AssertionFailedError: expected:<1> but was:<-7>
	at junit.framework.Assert.fail(Assert.java:47)
	at junit.framework.Assert.failNotEquals(Assert.java:280)
	at junit.framework.Assert.assertEquals(Assert.java:64)
	at junit.framework.Assert.assertEquals(Assert.java:198)
	at junit.framework.Assert.assertEquals(Assert.java:204)
	at org.joda.time.TestMutablePeriod_Updates.testAdd_RInterval2(TestMutablePeriod_Updates.java:1337)

testAdd_RInterval4(org.joda.time.TestMutablePeriod_Updates)  Time elapsed: 0 sec  <<< FAILURE!
junit.framework.AssertionFailedError: expected:<8> but was:<-53>
	at junit.framework.Assert.fail(Assert.java:47)
	at junit.framework.Assert.failNotEquals(Assert.java:280)
	at junit.framework.Assert.assertEquals(Assert.java:64)
	at junit.framework.Assert.assertEquals(Assert.java:198)
	at junit.framework.Assert.assertEquals(Assert.java:204)
	at org.joda.time.TestMutablePeriod_Updates.testAdd_RInterval4(TestMutablePeriod_Updates.java:1366)

testSetPeriod_long_long1(org.joda.time.TestMutablePeriod_Updates)  Time elapsed: 0 sec  <<< FAILURE!
junit.framework.AssertionFailedError: expected:<1> but was:<-7>
	at junit.framework.Assert.fail(Assert.java:47)
	at junit.framework.Assert.failNotEquals(Assert.java:280)
	at junit.framework.Assert.assertEquals(Assert.java:64)
	at junit.framework.Assert.assertEquals(Assert.java:198)
	at junit.framework.Assert.assertEquals(Assert.java:204)
	at org.joda.time.TestMutablePeriod_Updates.testSetPeriod_long_long1(TestMutablePeriod_Updates.java:565)

testSetPeriod_long_long2(org.joda.time.TestMutablePeriod_Updates)  Time elapsed: 0 sec  <<< FAILURE!
junit.framework.AssertionFailedError: expected:<-1> but was:<-9>
	at junit.framework.Assert.fail(Assert.java:47)
	at junit.framework.Assert.failNotEquals(Assert.java:280)
	at junit.framework.Assert.assertEquals(Assert.java:64)
	at junit.framework.Assert.assertEquals(Assert.java:198)
	at junit.framework.Assert.assertEquals(Assert.java:204)
	at org.joda.time.TestMutablePeriod_Updates.testSetPeriod_long_long2(TestMutablePeriod_Updates.java:580)

testSetPeriod_long_long_NoYears(org.joda.time.TestMutablePeriod_Updates)  Time elapsed: 0.001 sec  <<< FAILURE!
junit.framework.AssertionFailedError: expected:<1> but was:<-7>
	at junit.framework.Assert.fail(Assert.java:47)
	at junit.framework.Assert.failNotEquals(Assert.java:280)
	at junit.framework.Assert.assertEquals(Assert.java:64)
	at junit.framework.Assert.assertEquals(Assert.java:198)
	at junit.framework.Assert.assertEquals(Assert.java:204)
	at org.joda.time.TestMutablePeriod_Updates.testSetPeriod_long_long_NoYears(TestMutablePeriod_Updates.java:609)

testSetPeriod_long_long_NoWeeks(org.joda.time.TestMutablePeriod_Updates)  Time elapsed: 0.001 sec  <<< FAILURE!
junit.framework.AssertionFailedError: expected:<8> but was:<-53>
	at junit.framework.Assert.fail(Assert.java:47)
	at junit.framework.Assert.failNotEquals(Assert.java:280)
	at junit.framework.Assert.assertEquals(Assert.java:64)
	at junit.framework.Assert.assertEquals(Assert.java:198)
	at junit.framework.Assert.assertEquals(Assert.java:204)
	at org.joda.time.TestMutablePeriod_Updates.testSetPeriod_long_long_NoWeeks(TestMutablePeriod_Updates.java:640)

testSetPeriod_long_long_NoDays(org.joda.time.TestMutablePeriod_Updates)  Time elapsed: 0 sec  <<< FAILURE!
junit.framework.AssertionFailedError: expected:<1> but was:<-7>
	at junit.framework.Assert.fail(Assert.java:47)
	at junit.framework.Assert.failNotEquals(Assert.java:280)
	at junit.framework.Assert.assertEquals(Assert.java:64)
	at junit.framework.Assert.assertEquals(Assert.java:198)
	at junit.framework.Assert.assertEquals(Assert.java:204)
	at org.joda.time.TestMutablePeriod_Updates.testSetPeriod_long_long_NoDays(TestMutablePeriod_Updates.java:654)

testSetPeriod_long_long_NoHours(org.joda.time.TestMutablePeriod_Updates)  Time elapsed: 0.001 sec  <<< FAILURE!
junit.framework.AssertionFailedError: expected:<1> but was:<-7>
	at junit.framework.Assert.fail(Assert.java:47)
	at junit.framework.Assert.failNotEquals(Assert.java:280)
	at junit.framework.Assert.assertEquals(Assert.java:64)
	at junit.framework.Assert.assertEquals(Assert.java:198)
	at junit.framework.Assert.assertEquals(Assert.java:204)
	at org.joda.time.TestMutablePeriod_Updates.testSetPeriod_long_long_NoHours(TestMutablePeriod_Updates.java:669)

testSetPeriod_long_long_NoMinutes(org.joda.time.TestMutablePeriod_Updates)  Time elapsed: 0 sec  <<< FAILURE!
junit.framework.AssertionFailedError: expected:<1> but was:<-7>
	at junit.framework.Assert.fail(Assert.java:47)
	at junit.framework.Assert.failNotEquals(Assert.java:280)
	at junit.framework.Assert.assertEquals(Assert.java:64)
	at junit.framework.Assert.assertEquals(Assert.java:198)
	at junit.framework.Assert.assertEquals(Assert.java:204)
	at org.joda.time.TestMutablePeriod_Updates.testSetPeriod_long_long_NoMinutes(TestMutablePeriod_Updates.java:684)

testSetPeriod_long_long_NoSeconds(org.joda.time.TestMutablePeriod_Updates)  Time elapsed: 0 sec  <<< FAILURE!
junit.framework.AssertionFailedError: expected:<1> but was:<-7>
	at junit.framework.Assert.fail(Assert.java:47)
	at junit.framework.Assert.failNotEquals(Assert.java:280)
	at junit.framework.Assert.assertEquals(Assert.java:64)
	at junit.framework.Assert.assertEquals(Assert.java:198)
	at junit.framework.Assert.assertEquals(Assert.java:204)
	at org.joda.time.TestMutablePeriod_Updates.testSetPeriod_long_long_NoSeconds(TestMutablePeriod_Updates.java:699)

testSetPeriod_long_long_NoMillis(org.joda.time.TestMutablePeriod_Updates)  Time elapsed: 0.001 sec  <<< FAILURE!
junit.framework.AssertionFailedError: expected:<1> but was:<-7>
	at junit.framework.Assert.fail(Assert.java:47)
	at junit.framework.Assert.failNotEquals(Assert.java:280)
	at junit.framework.Assert.assertEquals(Assert.java:64)
	at junit.framework.Assert.assertEquals(Assert.java:198)
	at junit.framework.Assert.assertEquals(Assert.java:204)
	at org.joda.time.TestMutablePeriod_Updates.testSetPeriod_long_long_NoMillis(TestMutablePeriod_Updates.java:714)

testSetPeriod_RI_RI1(org.joda.time.TestMutablePeriod_Updates)  Time elapsed: 0 sec  <<< FAILURE!
junit.framework.AssertionFailedError: expected:<1> but was:<-7>
	at junit.framework.Assert.fail(Assert.java:47)
	at junit.framework.Assert.failNotEquals(Assert.java:280)
	at junit.framework.Assert.assertEquals(Assert.java:64)
	at junit.framework.Assert.assertEquals(Assert.java:198)
	at junit.framework.Assert.assertEquals(Assert.java:204)
	at org.joda.time.TestMutablePeriod_Updates.testSetPeriod_RI_RI1(TestMutablePeriod_Updates.java:730)

testSetPeriod_RI_RI2(org.joda.time.TestMutablePeriod_Updates)  Time elapsed: 0.001 sec  <<< FAILURE!
junit.framework.AssertionFailedError: expected:<-1> but was:<-9>
	at junit.framework.Assert.fail(Assert.java:47)
	at junit.framework.Assert.failNotEquals(Assert.java:280)
	at junit.framework.Assert.assertEquals(Assert.java:64)
	at junit.framework.Assert.assertEquals(Assert.java:198)
	at junit.framework.Assert.assertEquals(Assert.java:204)
	at org.joda.time.TestMutablePeriod_Updates.testSetPeriod_RI_RI2(TestMutablePeriod_Updates.java:745)

testSetPeriod_RInterval1(org.joda.time.TestMutablePeriod_Updates)  Time elapsed: 0.001 sec  <<< FAILURE!
junit.framework.AssertionFailedError: expected:<1> but was:<-7>
	at junit.framework.Assert.fail(Assert.java:47)
	at junit.framework.Assert.failNotEquals(Assert.java:280)
	at junit.framework.Assert.assertEquals(Assert.java:64)
	at junit.framework.Assert.assertEquals(Assert.java:198)
	at junit.framework.Assert.assertEquals(Assert.java:204)
	at org.joda.time.TestMutablePeriod_Updates.testSetPeriod_RInterval1(TestMutablePeriod_Updates.java:775)

testAddToLocalDate(org.joda.time.TestMonths)  Time elapsed: 0.001 sec  <<< FAILURE!
junit.framework.AssertionFailedError: expected:<2006-09-01> but was:<2006-11-01>
	at junit.framework.Assert.fail(Assert.java:47)
	at junit.framework.Assert.failNotEquals(Assert.java:280)
	at junit.framework.Assert.assertEquals(Assert.java:64)
	at junit.framework.Assert.assertEquals(Assert.java:71)
	at org.joda.time.TestMonths.testAddToLocalDate(TestMonths.java:363)

testPropertyAddMonth(org.joda.time.TestYearMonthDay_Properties)  Time elapsed: 0 sec  <<< FAILURE!
junit.framework.AssertionFailedError: expected:<1972> but was:<1973>
	at junit.framework.Assert.fail(Assert.java:47)
	at junit.framework.Assert.failNotEquals(Assert.java:280)
	at junit.framework.Assert.assertEquals(Assert.java:64)
	at junit.framework.Assert.assertEquals(Assert.java:198)
	at junit.framework.Assert.assertEquals(Assert.java:204)
	at org.joda.time.TestYearMonthDay_Properties.check(TestYearMonthDay_Properties.java:555)
	at org.joda.time.TestYearMonthDay_Properties.testPropertyAddMonth(TestYearMonthDay_Properties.java:229)

testPropertyAddDay(org.joda.time.TestYearMonthDay_Properties)  Time elapsed: 0 sec  <<< FAILURE!
junit.framework.AssertionFailedError: expected:<7> but was:<9>
	at junit.framework.Assert.fail(Assert.java:47)
	at junit.framework.Assert.failNotEquals(Assert.java:280)
	at junit.framework.Assert.assertEquals(Assert.java:64)
	at junit.framework.Assert.assertEquals(Assert.java:198)
	at junit.framework.Assert.assertEquals(Assert.java:204)
	at org.joda.time.TestYearMonthDay_Properties.check(TestYearMonthDay_Properties.java:556)
	at org.joda.time.TestYearMonthDay_Properties.testPropertyAddDay(TestYearMonthDay_Properties.java:383)

testPropertyAddMonth(org.joda.time.TestYearMonth_Properties)  Time elapsed: 0.001 sec  <<< FAILURE!
junit.framework.AssertionFailedError: expected:<1972> but was:<1973>
	at junit.framework.Assert.fail(Assert.java:47)
	at junit.framework.Assert.failNotEquals(Assert.java:280)
	at junit.framework.Assert.assertEquals(Assert.java:64)
	at junit.framework.Assert.assertEquals(Assert.java:198)
	at junit.framework.Assert.assertEquals(Assert.java:204)
	at org.joda.time.TestYearMonth_Properties.check(TestYearMonth_Properties.java:363)
	at org.joda.time.TestYearMonth_Properties.testPropertyAddMonth(TestYearMonth_Properties.java:228)

testIsLocalDateTimeGap_Berlin(org.joda.time.TestDateTimeZone)  Time elapsed: 0 sec  <<< FAILURE!
junit.framework.AssertionFailedError: expected:<true> but was:<false>
	at junit.framework.Assert.fail(Assert.java:47)
	at junit.framework.Assert.failNotEquals(Assert.java:280)
	at junit.framework.Assert.assertEquals(Assert.java:64)
	at junit.framework.Assert.assertEquals(Assert.java:146)
	at junit.framework.Assert.assertEquals(Assert.java:152)
	at org.joda.time.TestDateTimeZone.testIsLocalDateTimeGap_Berlin(TestDateTimeZone.java:934)

testCommentParse(org.joda.time.TestDateTimeZone)  Time elapsed: 0.001 sec  <<< FAILURE!
junit.framework.AssertionFailedError: expected:<1115313015000> but was:<1115316615000>
	at junit.framework.Assert.fail(Assert.java:47)
	at junit.framework.Assert.failNotEquals(Assert.java:280)
	at junit.framework.Assert.assertEquals(Assert.java:64)
	at junit.framework.Assert.assertEquals(Assert.java:133)
	at junit.framework.Assert.assertEquals(Assert.java:139)
	at org.joda.time.TestDateTimeZone.testCommentParse(TestDateTimeZone.java:1063)

test_MoscowIsCorrect_Spring(org.joda.time.TestDateTimeZoneCutover)  Time elapsed: 0.001 sec  <<< FAILURE!
junit.framework.ComparisonFailure: expected:<2007-03-25T0[3:00:00.000+04]:00> but was:<2007-03-25T0[2:00:00.000+03]:00>
	at junit.framework.Assert.assertEquals(Assert.java:81)
	at junit.framework.Assert.assertEquals(Assert.java:87)
	at org.joda.time.TestDateTimeZoneCutover.test_MoscowIsCorrect_Spring(TestDateTimeZoneCutover.java:824)

test_DateTime_setHourAcross_Moscow_Spring(org.joda.time.TestDateTimeZoneCutover)  Time elapsed: 0 sec  <<< FAILURE!
junit.framework.ComparisonFailure: expected:<...03-25T04:00:00.000+0[4]:00> but was:<...03-25T04:00:00.000+0[3]:00>
	at junit.framework.Assert.assertEquals(Assert.java:81)
	at junit.framework.Assert.assertEquals(Assert.java:87)
	at org.joda.time.TestDateTimeZoneCutover.test_DateTime_setHourAcross_Moscow_Spring(TestDateTimeZoneCutover.java:849)

test_DateTime_setHourForward_Moscow_Spring(org.joda.time.TestDateTimeZoneCutover)  Time elapsed: 0.001 sec  <<< FAILURE!
junit.framework.AssertionFailedError
	at junit.framework.Assert.fail(Assert.java:47)
	at junit.framework.Assert.fail(Assert.java:53)
	at org.joda.time.TestDateTimeZoneCutover.test_DateTime_setHourForward_Moscow_Spring(TestDateTimeZoneCutover.java:858)

test_DateTime_setHourBack_Moscow_Spring(org.joda.time.TestDateTimeZoneCutover)  Time elapsed: 0 sec  <<< FAILURE!
junit.framework.ComparisonFailure: expected:<...03-25T08:00:00.000+0[4]:00> but was:<...03-25T08:00:00.000+0[3]:00>
	at junit.framework.Assert.assertEquals(Assert.java:81)
	at junit.framework.Assert.assertEquals(Assert.java:87)
	at org.joda.time.TestDateTimeZoneCutover.test_DateTime_setHourBack_Moscow_Spring(TestDateTimeZoneCutover.java:866)

test_MoscowIsCorrect_Autumn(org.joda.time.TestDateTimeZoneCutover)  Time elapsed: 0.001 sec  <<< FAILURE!
junit.framework.ComparisonFailure: expected:<2007-10-28T0[2:00:00.000+03]:00> but was:<2007-10-28T0[3:00:00.000+04]:00>
	at junit.framework.Assert.assertEquals(Assert.java:81)
	at junit.framework.Assert.assertEquals(Assert.java:87)
	at org.joda.time.TestDateTimeZoneCutover.test_MoscowIsCorrect_Autumn(TestDateTimeZoneCutover.java:885)

test_getOffsetFromLocal_Moscow_Autumn(org.joda.time.TestDateTimeZoneCutover)  Time elapsed: 0.001 sec  <<< FAILURE!
junit.framework.AssertionFailedError: expected:<10800000> but was:<14400000>
	at junit.framework.Assert.fail(Assert.java:47)
	at junit.framework.Assert.failNotEquals(Assert.java:280)
	at junit.framework.Assert.assertEquals(Assert.java:64)
	at junit.framework.Assert.assertEquals(Assert.java:133)
	at junit.framework.Assert.assertEquals(Assert.java:139)
	at org.joda.time.TestDateTimeZoneCutover.doTest_getOffsetFromLocal(TestDateTimeZoneCutover.java:1369)
	at org.joda.time.TestDateTimeZoneCutover.doTest_getOffsetFromLocal(TestDateTimeZoneCutover.java:1355)
	at org.joda.time.TestDateTimeZoneCutover.test_getOffsetFromLocal_Moscow_Autumn(TestDateTimeZoneCutover.java:902)

test_DateTime_plusHour_Moscow_Autumn(org.joda.time.TestDateTimeZoneCutover)  Time elapsed: 0 sec  <<< FAILURE!
junit.framework.ComparisonFailure: expected:<2007-10-28T0[2:00:00.000+03]:00> but was:<2007-10-28T0[3:00:00.000+04]:00>
	at junit.framework.Assert.assertEquals(Assert.java:81)
	at junit.framework.Assert.assertEquals(Assert.java:87)
	at org.joda.time.TestDateTimeZoneCutover.test_DateTime_plusHour_Moscow_Autumn(TestDateTimeZoneCutover.java:935)

test_DateTime_minusHour_Moscow_Autumn(org.joda.time.TestDateTimeZoneCutover)  Time elapsed: 0.001 sec  <<< FAILURE!
junit.framework.ComparisonFailure: expected:<...10-28T09:00:00.000+0[3]:00> but was:<...10-28T09:00:00.000+0[4]:00>
	at junit.framework.Assert.assertEquals(Assert.java:81)
	at junit.framework.Assert.assertEquals(Assert.java:87)
	at org.joda.time.TestDateTimeZoneCutover.test_DateTime_minusHour_Moscow_Autumn(TestDateTimeZoneCutover.java:942)

testWithMillisOfSecondInDstChange_Paris_winter(org.joda.time.TestDateTimeZoneCutover)  Time elapsed: 0.001 sec  <<< FAILURE!
junit.framework.ComparisonFailure: expected:<2010-10-31T0[2:30:10.123+01]:00> but was:<2010-10-31T0[3:30:10.123+02]:00>
	at junit.framework.Assert.assertEquals(Assert.java:81)
	at junit.framework.Assert.assertEquals(Assert.java:87)
	at org.joda.time.TestDateTimeZoneCutover.testWithMillisOfSecondInDstChange_Paris_winter(TestDateTimeZoneCutover.java:1168)

testBug3192457_adjustOffset(org.joda.time.TestDateTimeZoneCutover)  Time elapsed: 0 sec  <<< FAILURE!
junit.framework.AssertionFailedError: expected:<2007-10-28T02:15:00.000+02:00> but was:<2007-10-28T01:15:00.000+02:00>
	at junit.framework.Assert.fail(Assert.java:47)
	at junit.framework.Assert.failNotEquals(Assert.java:280)
	at junit.framework.Assert.assertEquals(Assert.java:64)
	at junit.framework.Assert.assertEquals(Assert.java:71)
	at org.joda.time.TestDateTimeZoneCutover.testBug3192457_adjustOffset(TestDateTimeZoneCutover.java:1276)

testDateTimeCreation_athens(org.joda.time.TestDateTimeZoneCutover)  Time elapsed: 0 sec  <<< FAILURE!
junit.framework.ComparisonFailure: expected:<2011-10-30T0[3:15:00.000+02]:00> but was:<2011-10-30T0[4:15:00.000+03]:00>
	at junit.framework.Assert.assertEquals(Assert.java:81)
	at junit.framework.Assert.assertEquals(Assert.java:87)
	at org.joda.time.TestDateTimeZoneCutover.testDateTimeCreation_athens(TestDateTimeZoneCutover.java:1320)

testDateTimeCreation_paris(org.joda.time.TestDateTimeZoneCutover)  Time elapsed: 0 sec  <<< FAILURE!
junit.framework.ComparisonFailure: expected:<2011-10-30T0[2:15:00.000+01]:00> but was:<2011-10-30T0[3:15:00.000+02]:00>
	at junit.framework.Assert.assertEquals(Assert.java:81)
	at junit.framework.Assert.assertEquals(Assert.java:87)
	at org.joda.time.TestDateTimeZoneCutover.testDateTimeCreation_paris(TestDateTimeZoneCutover.java:1327)

testDateTimeCreation_london(org.joda.time.TestDateTimeZoneCutover)  Time elapsed: 0.001 sec  <<< FAILURE!
junit.framework.ComparisonFailure: expected:<2011-10-30T0[1:15:00.000Z]> but was:<2011-10-30T0[2:15:00.000+01:00]>
	at junit.framework.Assert.assertEquals(Assert.java:81)
	at junit.framework.Assert.assertEquals(Assert.java:87)
	at org.joda.time.TestDateTimeZoneCutover.testDateTimeCreation_london(TestDateTimeZoneCutover.java:1334)

test_getOffsetFromLocal_Moscow_Spring(org.joda.time.TestDateTimeZoneCutover)  Time elapsed: 0.001 sec  <<< FAILURE!
junit.framework.ComparisonFailure: 2007-03-25T02:00:00.000+03:00 expected:<2007-03-25T0[3:00:00.000+04]:00> but was:<2007-03-25T0[2:00:00.000+03]:00>
	at junit.framework.Assert.assertEquals(Assert.java:81)
	at org.joda.time.TestDateTimeZoneCutover.doTest_getOffsetFromLocal(TestDateTimeZoneCutover.java:1371)
	at org.joda.time.TestDateTimeZoneCutover.doTest_getOffsetFromLocal(TestDateTimeZoneCutover.java:1355)
	at org.joda.time.TestDateTimeZoneCutover.test_getOffsetFromLocal_Moscow_Spring(TestDateTimeZoneCutover.java:833)

testSampleDate(org.joda.time.chrono.TestCopticChronology)  Time elapsed: 0.001 sec  <<< FAILURE!
junit.framework.AssertionFailedError: expected:<1721-01-02T00:00:00.000Z> but was:<1721-03-02T00:00:00.000Z>
	at junit.framework.Assert.fail(Assert.java:47)
	at junit.framework.Assert.failNotEquals(Assert.java:280)
	at junit.framework.Assert.assertEquals(Assert.java:64)
	at junit.framework.Assert.assertEquals(Assert.java:71)
	at org.joda.time.chrono.TestCopticChronology.testSampleDate(TestCopticChronology.java:423)

testDurationMonth(org.joda.time.chrono.TestCopticChronology)  Time elapsed: 0.001 sec  <<< FAILURE!
junit.framework.AssertionFailedError: expected:<2592000000> but was:<5702400000>
	at junit.framework.Assert.fail(Assert.java:47)
	at junit.framework.Assert.failNotEquals(Assert.java:280)
	at junit.framework.Assert.assertEquals(Assert.java:64)
	at junit.framework.Assert.assertEquals(Assert.java:133)
	at junit.framework.Assert.assertEquals(Assert.java:139)
	at org.joda.time.chrono.TestCopticChronology.testDurationMonth(TestCopticChronology.java:539)

testSampleDate(org.joda.time.chrono.TestEthiopicChronology)  Time elapsed: 0.001 sec  <<< FAILURE!
junit.framework.AssertionFailedError: expected:<1997-01-02T00:00:00.000Z> but was:<1997-03-02T00:00:00.000Z>
	at junit.framework.Assert.fail(Assert.java:47)
	at junit.framework.Assert.failNotEquals(Assert.java:280)
	at junit.framework.Assert.assertEquals(Assert.java:64)
	at junit.framework.Assert.assertEquals(Assert.java:71)
	at org.joda.time.chrono.TestEthiopicChronology.testSampleDate(TestEthiopicChronology.java:423)

testDurationMonth(org.joda.time.chrono.TestEthiopicChronology)  Time elapsed: 0.001 sec  <<< FAILURE!
junit.framework.AssertionFailedError: expected:<2592000000> but was:<5702400000>
	at junit.framework.Assert.fail(Assert.java:47)
	at junit.framework.Assert.failNotEquals(Assert.java:280)
	at junit.framework.Assert.assertEquals(Assert.java:64)
	at junit.framework.Assert.assertEquals(Assert.java:133)
	at junit.framework.Assert.assertEquals(Assert.java:139)
	at org.joda.time.chrono.TestEthiopicChronology.testDurationMonth(TestEthiopicChronology.java:539)

testCutoverAddMonths(org.joda.time.chrono.TestGJChronology)  Time elapsed: 0.001 sec  <<< FAILURE!
junit.framework.AssertionFailedError: expected:<1582-02-01T00:00:00.000Z> but was:<1582-04-01T00:00:00.000Z>
	at junit.framework.Assert.fail(Assert.java:47)
	at junit.framework.Assert.failNotEquals(Assert.java:280)
	at junit.framework.Assert.assertEquals(Assert.java:64)
	at junit.framework.Assert.assertEquals(Assert.java:71)
	at org.joda.time.chrono.TestGJChronology.testAdd(TestGJChronology.java:484)
	at org.joda.time.chrono.TestGJChronology.testCutoverAddMonths(TestGJChronology.java:422)

testSampleDateWithZone(org.joda.time.chrono.TestIslamicChronology)  Time elapsed: 0.001 sec  <<< FAILURE!
junit.framework.AssertionFailedError: expected:<11> but was:<10>
	at junit.framework.Assert.fail(Assert.java:47)
	at junit.framework.Assert.failNotEquals(Assert.java:280)
	at junit.framework.Assert.assertEquals(Assert.java:64)
	at junit.framework.Assert.assertEquals(Assert.java:198)
	at junit.framework.Assert.assertEquals(Assert.java:204)
	at org.joda.time.chrono.TestIslamicChronology.testSampleDateWithZone(TestIslamicChronology.java:601)

testSampleDate1(org.joda.time.chrono.TestIslamicChronology)  Time elapsed: 0 sec  <<< FAILURE!
junit.framework.AssertionFailedError: expected:<1365-01-06T00:00:00.000Z> but was:<1365-03-06T00:00:00.000Z>
	at junit.framework.Assert.fail(Assert.java:47)
	at junit.framework.Assert.failNotEquals(Assert.java:280)
	at junit.framework.Assert.assertEquals(Assert.java:64)
	at junit.framework.Assert.assertEquals(Assert.java:71)
	at org.joda.time.chrono.TestIslamicChronology.testSampleDate1(TestIslamicChronology.java:437)

testAddMonths(org.joda.time.chrono.TestISOChronology)  Time elapsed: 0.001 sec  <<< FAILURE!
junit.framework.AssertionFailedError: expected:<1582-02-01T00:00:00.000Z> but was:<1582-04-01T00:00:00.000Z>
	at junit.framework.Assert.fail(Assert.java:47)
	at junit.framework.Assert.failNotEquals(Assert.java:280)
	at junit.framework.Assert.assertEquals(Assert.java:64)
	at junit.framework.Assert.assertEquals(Assert.java:71)
	at org.joda.time.chrono.TestISOChronology.testAdd(TestISOChronology.java:413)
	at org.joda.time.chrono.TestISOChronology.testAddMonths(TestISOChronology.java:394)

test_setMonthOfYear(org.joda.time.chrono.TestLenientChronology)  Time elapsed: 0.001 sec  <<< FAILURE!
junit.framework.ComparisonFailure: expected:<2008-0[1]-01T00:00:00.000Z> but was:<2008-0[3]-01T00:00:00.000Z>
	at junit.framework.Assert.assertEquals(Assert.java:81)
	at junit.framework.Assert.assertEquals(Assert.java:87)
	at org.joda.time.chrono.TestLenientChronology.test_setMonthOfYear(TestLenientChronology.java:65)

test_lenientChrononolgy_Chicago(org.joda.time.chrono.TestLenientChronology)  Time elapsed: 0.002 sec  <<< FAILURE!
junit.framework.ComparisonFailure: expected:<2007-0[3-11T03]:30:00.000-05:00> but was:<2007-0[5-11T02]:30:00.000-05:00>
	at junit.framework.Assert.assertEquals(Assert.java:81)
	at junit.framework.Assert.assertEquals(Assert.java:87)
	at org.joda.time.chrono.TestLenientChronology.test_lenientChrononolgy_Chicago(TestLenientChronology.java:139)

test_lenientChrononolgy_Turk(org.joda.time.chrono.TestLenientChronology)  Time elapsed: 0 sec  <<< FAILURE!
junit.framework.ComparisonFailure: expected:<2007-0[4-01T01]:30:00.000-04:00> but was:<2007-0[6-01T00]:30:00.000-04:00>
	at junit.framework.Assert.assertEquals(Assert.java:81)
	at junit.framework.Assert.assertEquals(Assert.java:87)
	at org.joda.time.chrono.TestLenientChronology.test_lenientChrononolgy_Turk(TestLenientChronology.java:145)

testChronology(org.joda.time.chrono.gj.MainTest)  Time elapsed: 0.003 sec  <<< FAILURE!
junit.framework.AssertionFailedError
	at junit.framework.Assert.fail(Assert.java:47)
	at org.joda.time.chrono.gj.MainTest.testChronology(MainTest.java:158)

testChronology(org.joda.time.chrono.gj.MainTest)  Time elapsed: 0.003 sec  <<< FAILURE!
junit.framework.AssertionFailedError
	at junit.framework.Assert.fail(Assert.java:47)
	at org.joda.time.chrono.gj.MainTest.testChronology(MainTest.java:158)

testSetIntoInterval_Object_Chronology1(org.joda.time.convert.TestStringConverter)  Time elapsed: 0.001 sec  <<< FAILURE!
junit.framework.AssertionFailedError: expected:<2005-08-09T00:00:00.000+01:00> but was:<2005-10-09T00:00:00.000+01:00>
	at junit.framework.Assert.fail(Assert.java:47)
	at junit.framework.Assert.failNotEquals(Assert.java:280)
	at junit.framework.Assert.assertEquals(Assert.java:64)
	at junit.framework.Assert.assertEquals(Assert.java:71)
	at org.joda.time.convert.TestStringConverter.testSetIntoInterval_Object_Chronology1(TestStringConverter.java:478)

testSetIntoInterval_Object_Chronology2(org.joda.time.convert.TestStringConverter)  Time elapsed: 0.001 sec  <<< FAILURE!
junit.framework.AssertionFailedError: expected:<2003-04-09T00:00:00.000Z> but was:<2003-06-09T00:00:00.000+01:00>
	at junit.framework.Assert.fail(Assert.java:47)
	at junit.framework.Assert.failNotEquals(Assert.java:280)
	at junit.framework.Assert.assertEquals(Assert.java:64)
	at junit.framework.Assert.assertEquals(Assert.java:71)
	at org.joda.time.convert.TestStringConverter.testSetIntoInterval_Object_Chronology2(TestStringConverter.java:485)

testSetIntoInterval_Object_Chronology4(org.joda.time.convert.TestStringConverter)  Time elapsed: 0.002 sec  <<< FAILURE!
junit.framework.AssertionFailedError: expected:<2005-08-08T19:00:00.000+01:00> but was:<2005-10-08T19:00:00.000+01:00>
	at junit.framework.Assert.fail(Assert.java:47)
	at junit.framework.Assert.failNotEquals(Assert.java:280)
	at junit.framework.Assert.assertEquals(Assert.java:64)
	at junit.framework.Assert.assertEquals(Assert.java:71)
	at org.joda.time.convert.TestStringConverter.testSetIntoInterval_Object_Chronology4(TestStringConverter.java:502)

testSetIntoInterval_Object_Chronology5(org.joda.time.convert.TestStringConverter)  Time elapsed: 0 sec  <<< FAILURE!
junit.framework.AssertionFailedError: expected:<2003-04-08T18:00:00.000Z> but was:<2003-06-08T19:00:00.000+01:00>
	at junit.framework.Assert.fail(Assert.java:47)
	at junit.framework.Assert.failNotEquals(Assert.java:280)
	at junit.framework.Assert.assertEquals(Assert.java:64)
	at junit.framework.Assert.assertEquals(Assert.java:71)
	at org.joda.time.convert.TestStringConverter.testSetIntoInterval_Object_Chronology5(TestStringConverter.java:509)

testZoneNameNearTransition(org.joda.time.format.TestDateTimeFormatter)  Time elapsed: 0.003 sec  <<< FAILURE!
junit.framework.ComparisonFailure: expected:<... 02:00:00.0 Eastern [Standard] Time> but was:<... 02:00:00.0 Eastern [Daylight] Time>
	at junit.framework.Assert.assertEquals(Assert.java:81)
	at junit.framework.Assert.assertEquals(Assert.java:87)
	at org.joda.time.format.TestDateTimeFormatter.testZoneNameNearTransition(TestDateTimeFormatter.java:1005)

testZoneShortNameNearTransition(org.joda.time.format.TestDateTimeFormatter)  Time elapsed: 0.001 sec  <<< FAILURE!
junit.framework.ComparisonFailure: expected:<...5-10-30 02:00:00.0 E[S]T> but was:<...5-10-30 02:00:00.0 E[D]T>
	at junit.framework.Assert.assertEquals(Assert.java:81)
	at junit.framework.Assert.assertEquals(Assert.java:87)
	at org.joda.time.format.TestDateTimeFormatter.testZoneShortNameNearTransition(TestDateTimeFormatter.java:1021)

testHalfdayNames(org.joda.time.format.TestTextFields)  Time elapsed: 0 sec  <<< ERROR!
org.joda.time.IllegalFieldValueException: Value 2 for hourOfDay is not supported: Illegal instant due to time zone offset transition (daylight savings time 'gap'): 2004-05-30T02:20:30.040 (Europe/Paris)
	at org.joda.time.chrono.ZonedChronology$ZonedDateTimeField.set(ZonedChronology.java:486)
	at org.joda.time.MutableDateTime.setHourOfDay(MutableDateTime.java:786)
	at org.joda.time.format.TestTextFields.testHalfdayNames(TestTextFields.java:144)
Caused by: org.joda.time.IllegalInstantException: Illegal instant due to time zone offset transition (daylight savings time 'gap'): 2004-05-30T02:20:30.040 (Europe/Paris)
	at org.joda.time.chrono.ZonedChronology$ZonedDateTimeField.set(ZonedChronology.java:485)
	... 28 more

testSerialization(org.joda.time.tz.TestBuilder)  Time elapsed: 0.007 sec  <<< FAILURE!
junit.framework.AssertionFailedError: expected:<-1633269600000> but was:<-1628431200000>
	at junit.framework.Assert.fail(Assert.java:47)
	at junit.framework.Assert.failNotEquals(Assert.java:280)
	at junit.framework.Assert.assertEquals(Assert.java:64)
	at junit.framework.Assert.assertEquals(Assert.java:133)
	at junit.framework.Assert.assertEquals(Assert.java:139)
	at org.joda.time.tz.TestBuilder.testForwardTransitions(TestBuilder.java:234)
	at org.joda.time.tz.TestBuilder.testSerialization(TestBuilder.java:282)

testForwardTransitions(org.joda.time.tz.TestBuilder)  Time elapsed: 0.007 sec  <<< FAILURE!
junit.framework.AssertionFailedError: expected:<-1633269600000> but was:<-1628431200000>
	at junit.framework.Assert.fail(Assert.java:47)
	at junit.framework.Assert.failNotEquals(Assert.java:280)
	at junit.framework.Assert.assertEquals(Assert.java:64)
	at junit.framework.Assert.assertEquals(Assert.java:133)
	at junit.framework.Assert.assertEquals(Assert.java:139)
	at org.joda.time.tz.TestBuilder.testForwardTransitions(TestBuilder.java:234)
	at org.joda.time.tz.TestBuilder.testForwardTransitions(TestBuilder.java:217)

testReverseTransitions(org.joda.time.tz.TestBuilder)  Time elapsed: 0.01 sec  <<< FAILURE!
junit.framework.AssertionFailedError: expected:<972809999999> but was:<954669599999>
	at junit.framework.Assert.fail(Assert.java:47)
	at junit.framework.Assert.failNotEquals(Assert.java:280)
	at junit.framework.Assert.assertEquals(Assert.java:64)
	at junit.framework.Assert.assertEquals(Assert.java:133)
	at junit.framework.Assert.assertEquals(Assert.java:139)
	at org.joda.time.tz.TestBuilder.testReverseTransitions(TestBuilder.java:270)
	at org.joda.time.tz.TestBuilder.testReverseTransitions(TestBuilder.java:255)

testCompile(org.joda.time.tz.TestCompiler)  Time elapsed: 0.028 sec  <<< FAILURE!
junit.framework.AssertionFailedError: expected:<-1633269600000> but was:<-1628431200000>
	at junit.framework.Assert.fail(Assert.java:47)
	at junit.framework.Assert.failNotEquals(Assert.java:280)
	at junit.framework.Assert.assertEquals(Assert.java:64)
	at junit.framework.Assert.assertEquals(Assert.java:133)
	at junit.framework.Assert.assertEquals(Assert.java:139)
	at org.joda.time.tz.TestBuilder.testForwardTransitions(TestBuilder.java:234)
	at org.joda.time.tz.TestCompiler.testCompile(TestCompiler.java:117)

test_2400_last(org.joda.time.tz.TestCompiler)  Time elapsed: 0 sec  <<< FAILURE!
junit.framework.AssertionFailedError: expected:<4> but was:<6>
	at junit.framework.Assert.fail(Assert.java:47)
	at junit.framework.Assert.failNotEquals(Assert.java:280)
	at junit.framework.Assert.assertEquals(Assert.java:64)
	at junit.framework.Assert.assertEquals(Assert.java:198)
	at junit.framework.Assert.assertEquals(Assert.java:204)
	at org.joda.time.tz.TestCompiler.test_2400_last(TestCompiler.java:189)

test_Amman_2003(org.joda.time.tz.TestCompiler)  Time elapsed: 0.001 sec  <<< FAILURE!
junit.framework.AssertionFailedError: expected:<1054245600000> but was:<1048802400000>
	at junit.framework.Assert.fail(Assert.java:47)
	at junit.framework.Assert.failNotEquals(Assert.java:280)
	at junit.framework.Assert.assertEquals(Assert.java:64)
	at junit.framework.Assert.assertEquals(Assert.java:133)
	at junit.framework.Assert.assertEquals(Assert.java:139)
	at org.joda.time.tz.TestCompiler.test_Amman_2003(TestCompiler.java:210)

test_Amman_2004(org.joda.time.tz.TestCompiler)  Time elapsed: 0.001 sec  <<< FAILURE!
junit.framework.AssertionFailedError: expected:<1085695200000> but was:<1080252000000>
	at junit.framework.Assert.fail(Assert.java:47)
	at junit.framework.Assert.failNotEquals(Assert.java:280)
	at junit.framework.Assert.assertEquals(Assert.java:64)
	at junit.framework.Assert.assertEquals(Assert.java:133)
	at junit.framework.Assert.assertEquals(Assert.java:139)
	at org.joda.time.tz.TestCompiler.test_Amman_2004(TestCompiler.java:217)

test_Amman_2005(org.joda.time.tz.TestCompiler)  Time elapsed: 0 sec  <<< FAILURE!
junit.framework.AssertionFailedError: expected:<1117144800000> but was:<1112306400000>
	at junit.framework.Assert.fail(Assert.java:47)
	at junit.framework.Assert.failNotEquals(Assert.java:280)
	at junit.framework.Assert.assertEquals(Assert.java:64)
	at junit.framework.Assert.assertEquals(Assert.java:133)
	at junit.framework.Assert.assertEquals(Assert.java:139)
	at org.joda.time.tz.TestCompiler.test_Amman_2005(TestCompiler.java:224)

test_Amman_2006(org.joda.time.tz.TestCompiler)  Time elapsed: 0 sec  <<< FAILURE!
junit.framework.AssertionFailedError: expected:<1148594400000> but was:<1143756000000>
	at junit.framework.Assert.fail(Assert.java:47)
	at junit.framework.Assert.failNotEquals(Assert.java:280)
	at junit.framework.Assert.assertEquals(Assert.java:64)
	at junit.framework.Assert.assertEquals(Assert.java:133)
	at junit.framework.Assert.assertEquals(Assert.java:139)
	at org.joda.time.tz.TestCompiler.test_Amman_2006(TestCompiler.java:231)


Results :

Failed tests: 
  org.joda.time.TestDateMidnight_Basics#testCompareTo AssertionFailedError expec...
  org.joda.time.TestDateMidnight_Basics#testEqualsHashCode AssertionFailedError ...
  org.joda.time.TestDateMidnight_Basics#testIsAfter AssertionFailedError expecte...
  org.joda.time.TestDateMidnight_Basics#testIsEqual AssertionFailedError expecte...
  org.joda.time.TestDateMidnight_Basics#testMinusMonths_int AssertionFailedError
  org.joda.time.TestDateMidnight_Basics#testMinus_RP AssertionFailedError expect...
  org.joda.time.TestDateMidnight_Basics#testPlusMonths_int AssertionFailedError ...
  org.joda.time.TestDateMidnight_Basics#testPlus_RP AssertionFailedError expecte...
  org.joda.time.TestDateMidnight_Basics#testToDateTime AssertionFailedError expe...
  org.joda.time.TestDateMidnight_Basics#testToDateTime_Chronology AssertionFailedError
  org.joda.time.TestDateMidnight_Basics#testToDateTime_DateTimeZone AssertionFailedError
  org.joda.time.TestDateMidnight_Basics#testToInstant AssertionFailedError expec...
  org.joda.time.TestDateMidnight_Basics#testWithChronology_Chronology AssertionFailedError
  org.joda.time.TestDateMidnight_Basics#testWithDurationAdded_RP_int AssertionFailedError
  org.joda.time.TestDateMidnight_Basics#testWithMillis_long AssertionFailedError
  org.joda.time.TestDateMidnight_Basics#testWithZoneRetainFields_DateTimeZone AssertionFailedError
  org.joda.time.TestDateMidnight_Constructors#testConstructor_Object AssertionFailedError
  org.joda.time.TestDateMidnight_Constructors#testConstructor_Object_Chronology AssertionFailedError
  org.joda.time.TestDateMidnight_Constructors#testConstructor_Object_DateTimeZone AssertionFailedError
  org.joda.time.TestDateMidnight_Constructors#testConstructor_Object_nullChronology AssertionFailedError
  org.joda.time.TestDateMidnight_Constructors#testConstructor_Object_nullDateTimeZone AssertionFailedError
  org.joda.time.TestDateMidnight_Constructors#testConstructor_long1 AssertionFailedError
  org.joda.time.TestDateMidnight_Constructors#testConstructor_long1_Chronology AssertionFailedError
  org.joda.time.TestDateMidnight_Constructors#testConstructor_long1_DateTimeZone AssertionFailedError
  org.joda.time.TestDateMidnight_Constructors#testConstructor_long2 AssertionFailedError
  org.joda.time.TestDateMidnight_Constructors#testConstructor_long2_Chronology AssertionFailedError
  org.joda.time.TestDateMidnight_Constructors#testConstructor_long2_DateTimeZone AssertionFailedError
  org.joda.time.TestDateMidnight_Constructors#testConstructor_long_nullChronology AssertionFailedError
  org.joda.time.TestDateMidnight_Constructors#testConstructor_long_nullDateTimeZone AssertionFailedError
  org.joda.time.TestDateMidnight_Properties#testPropertyAddLongMonthOfYear AssertionFailedError
  org.joda.time.TestDateMidnight_Properties#testPropertyAddMonthOfYear AssertionFailedError
  org.joda.time.TestDateMidnight_Properties#testPropertyRoundCeilingMonthOfYear ComparisonFailure
  org.joda.time.TestDateMidnight_Properties#testPropertyRoundHalfCeilingMonthOfYear ComparisonFailure
  org.joda.time.TestDateMidnight_Properties#testPropertyRoundHalfEvenMonthOfYear ComparisonFailure
  org.joda.time.TestDateMidnight_Properties#testPropertyRoundHalfFloorMonthOfYear ComparisonFailure
  org.joda.time.TestDateMidnight_Properties#testPropertyToIntervalMonthOfYear AssertionFailedError
  org.joda.time.TestDateTimeZone#testCommentParse AssertionFailedError expected:...
  org.joda.time.TestDateTimeZone#testIsLocalDateTimeGap_Berlin AssertionFailedError
  org.joda.time.TestDateTimeZoneCutover#testBug3192457_adjustOffset AssertionFailedError
  org.joda.time.TestDateTimeZoneCutover#testDateTimeCreation_athens ComparisonFailure
  org.joda.time.TestDateTimeZoneCutover#testDateTimeCreation_london ComparisonFailure
  org.joda.time.TestDateTimeZoneCutover#testDateTimeCreation_paris ComparisonFailure
  org.joda.time.TestDateTimeZoneCutover#testWithMillisOfSecondInDstChange_Paris_winter ComparisonFailure
  org.joda.time.TestDateTimeZoneCutover#test_DateTime_minusHour_Moscow_Autumn ComparisonFailure
  org.joda.time.TestDateTimeZoneCutover#test_DateTime_plusHour_Moscow_Autumn ComparisonFailure
  org.joda.time.TestDateTimeZoneCutover#test_DateTime_setHourAcross_Moscow_Spring ComparisonFailure
  org.joda.time.TestDateTimeZoneCutover#test_DateTime_setHourBack_Moscow_Spring ComparisonFailure
  org.joda.time.TestDateTimeZoneCutover#test_DateTime_setHourForward_Moscow_Spring AssertionFailedError
  org.joda.time.TestDateTimeZoneCutover#test_MoscowIsCorrect_Autumn ComparisonFailure
  org.joda.time.TestDateTimeZoneCutover#test_MoscowIsCorrect_Spring ComparisonFailure
  org.joda.time.TestDateTimeZoneCutover#test_getOffsetFromLocal_Moscow_Autumn AssertionFailedError
  org.joda.time.TestDateTimeZoneCutover#test_getOffsetFromLocal_Moscow_Spring ComparisonFailure
  org.joda.time.TestDateTime_Basics#testMinusMonths_int AssertionFailedError exp...
  org.joda.time.TestDateTime_Basics#testMinus_RP AssertionFailedError expected:<...
  org.joda.time.TestDateTime_Basics#testPlusMonths_int AssertionFailedError expe...
  org.joda.time.TestDateTime_Basics#testPlus_RP AssertionFailedError expected:<2...
  org.joda.time.TestDateTime_Basics#testWithDate_int_int_int_toDST1 AssertionFailedError
  org.joda.time.TestDateTime_Basics#testWithDate_int_int_int_toDST2 AssertionFailedError
  org.joda.time.TestDateTime_Basics#testWithDurationAdded_RP_int AssertionFailedError
  org.joda.time.TestDateTime_Basics#testWithTime_int_int_int_int_toDST AssertionFailedError
  org.joda.time.TestDateTime_Properties#testPropertyAddMonthOfYear ComparisonFailure
  org.joda.time.TestDateTime_Properties#testPropertyAddWrapFieldDayOfYear ComparisonFailure
  org.joda.time.TestDateTime_Properties#testPropertyAddWrapFieldMonthOfYear ComparisonFailure
  org.joda.time.TestDateTime_Properties#testPropertySetMonthOfYear ComparisonFailure
  org.joda.time.TestDateTime_Properties#testPropertySetTextMonthOfYear ComparisonFailure
  org.joda.time.TestDateTime_Properties#testPropertyToIntervalMonthOfYear AssertionFailedError
  org.joda.time.TestLocalDateTime_Basics#testMinusMonths_int AssertionFailedError
  org.joda.time.TestLocalDateTime_Basics#testMinus_RP AssertionFailedError expec...
  org.joda.time.TestLocalDateTime_Basics#testPlusMonths_int AssertionFailedError
  org.joda.time.TestLocalDateTime_Basics#testPlus_RP AssertionFailedError expect...
  org.joda.time.TestLocalDateTime_Basics#testToDateTime_Zone_dstGap AssertionFailedError
  org.joda.time.TestLocalDateTime_Properties#testPropertyAddToCopyMonth AssertionFailedError
  org.joda.time.TestLocalDate_Basics#testMinusMonths_int AssertionFailedError ex...
  org.joda.time.TestLocalDate_Basics#testMinus_RP AssertionFailedError expected:...
  org.joda.time.TestLocalDate_Basics#testPlusMonths_int AssertionFailedError exp...
  org.joda.time.TestLocalDate_Basics#testPlus_RP AssertionFailedError expected:<...
  org.joda.time.TestLocalDate_Basics#testToDateTime_LocalTime_Zone_dstGap AssertionFailedError
  org.joda.time.TestLocalDate_Properties#testPropertyAddToCopyMonth AssertionFailedError
  org.joda.time.TestMonths#testAddToLocalDate AssertionFailedError expected:<200...
  org.joda.time.TestMutableDateTime_Adds#testAddDays_int_dstOverlapWinter_addZero ComparisonFailure
  org.joda.time.TestMutableDateTime_Adds#testAddHours_int_dstOverlapWinter_addZero ComparisonFailure
  org.joda.time.TestMutableDateTime_Adds#testAddMillis_int_dstOverlapWinter_addZero ComparisonFailure
  org.joda.time.TestMutableDateTime_Adds#testAddMinutes_int_dstOverlapWinter_addZero ComparisonFailure
  org.joda.time.TestMutableDateTime_Adds#testAddMonths_int1 ComparisonFailure ex...
  org.joda.time.TestMutableDateTime_Adds#testAddMonths_int_dstOverlapWinter_addZero ComparisonFailure
  org.joda.time.TestMutableDateTime_Adds#testAddSeconds_int_dstOverlapWinter_addZero ComparisonFailure
  org.joda.time.TestMutableDateTime_Adds#testAddWeeks_int_dstOverlapWinter_addZero ComparisonFailure
  org.joda.time.TestMutableDateTime_Adds#testAddYears_int_dstOverlapWinter_addZero ComparisonFailure
  org.joda.time.TestMutableDateTime_Adds#testAdd_DurationFieldType_int_dstOverlapWinter_addZero ComparisonFailure
  org.joda.time.TestMutableDateTime_Adds#testAdd_RP1 ComparisonFailure expected:...
  org.joda.time.TestMutableDateTime_Properties#testPropertyAddMonthOfYear ComparisonFailure
  org.joda.time.TestMutableDateTime_Properties#testPropertySetMonthOfYear ComparisonFailure
  org.joda.time.TestMutableDateTime_Properties#testPropertySetTextMonthOfYear ComparisonFailure
  org.joda.time.TestMutableDateTime_Properties#testPropertyToIntervalMonthOfYear AssertionFailedError
  org.joda.time.TestMutableDateTime_Sets#testSetDayOfMonth_int_dstOverlapWinter_addZero ComparisonFailure
  org.joda.time.TestMutableDateTime_Sets#testSetDayOfYear_int_dstOverlapWinter_addZero ComparisonFailure
  org.joda.time.TestMutableDateTime_Sets#testSetMonthOfYear_int1 ComparisonFailure
  org.joda.time.TestMutableDateTime_Sets#testSetMonthOfYear_int_dstOverlapWinter_addZero ComparisonFailure
  org.joda.time.TestMutableDateTime_Sets#testSetTime_Object3 AssertionFailedError
  org.joda.time.TestMutableDateTime_Sets#testSetTime_long1 AssertionFailedError ...
  org.joda.time.TestMutablePeriod_Constructors#testConstructor_RI_RD1 AssertionFailedError
  org.joda.time.TestMutablePeriod_Constructors#testConstructor_RI_RI1 AssertionFailedError
  org.joda.time.TestMutablePeriod_Constructors#testConstructor_RI_RI2 AssertionFailedError
  org.joda.time.TestMutablePeriod_Constructors#testConstructor_RI_RI3 AssertionFailedError
  org.joda.time.TestMutablePeriod_Constructors#testConstructor_RI_RI4 AssertionFailedError
  org.joda.time.TestMutablePeriod_Constructors#testConstructor_RI_RI_PeriodType1 AssertionFailedError
  org.joda.time.TestMutablePeriod_Constructors#testConstructor_RI_RI_PeriodType4 AssertionFailedError
  org.joda.time.TestMutablePeriod_Constructors#testConstructor_long_long1 AssertionFailedError
  org.joda.time.TestMutablePeriod_Constructors#testConstructor_long_long2 AssertionFailedError
  org.joda.time.TestMutablePeriod_Constructors#testConstructor_long_long_Chronology1 AssertionFailedError
  org.joda.time.TestMutablePeriod_Constructors#testConstructor_long_long_Chronology2 AssertionFailedError
  org.joda.time.TestMutablePeriod_Constructors#testConstructor_long_long_PeriodType1 AssertionFailedError
  org.joda.time.TestMutablePeriod_Constructors#testConstructor_long_long_PeriodType_Chronology1 AssertionFailedError
  org.joda.time.TestMutablePeriod_Constructors#testConstructor_long_long_PeriodType_Chronology2 AssertionFailedError
  org.joda.time.TestMutablePeriod_Updates#testAdd_RInterval2 AssertionFailedError
  org.joda.time.TestMutablePeriod_Updates#testAdd_RInterval4 AssertionFailedError
  org.joda.time.TestMutablePeriod_Updates#testSetPeriod_RI_RI1 AssertionFailedError
  org.joda.time.TestMutablePeriod_Updates#testSetPeriod_RI_RI2 AssertionFailedError
  org.joda.time.TestMutablePeriod_Updates#testSetPeriod_RInterval1 AssertionFailedError
  org.joda.time.TestMutablePeriod_Updates#testSetPeriod_long_long1 AssertionFailedError
  org.joda.time.TestMutablePeriod_Updates#testSetPeriod_long_long2 AssertionFailedError
  org.joda.time.TestMutablePeriod_Updates#testSetPeriod_long_long_NoDays AssertionFailedError
  org.joda.time.TestMutablePeriod_Updates#testSetPeriod_long_long_NoHours AssertionFailedError
  org.joda.time.TestMutablePeriod_Updates#testSetPeriod_long_long_NoMillis AssertionFailedError
  org.joda.time.TestMutablePeriod_Updates#testSetPeriod_long_long_NoMinutes AssertionFailedError
  org.joda.time.TestMutablePeriod_Updates#testSetPeriod_long_long_NoSeconds AssertionFailedError
  org.joda.time.TestMutablePeriod_Updates#testSetPeriod_long_long_NoWeeks AssertionFailedError
  org.joda.time.TestMutablePeriod_Updates#testSetPeriod_long_long_NoYears AssertionFailedError
  org.joda.time.TestPeriod_Constructors#testConstructor_RD_RI1 AssertionFailedError
  org.joda.time.TestPeriod_Constructors#testConstructor_RI_RD1 AssertionFailedError
  org.joda.time.TestPeriod_Constructors#testConstructor_RI_RI1 AssertionFailedError
  org.joda.time.TestPeriod_Constructors#testConstructor_RI_RI2 AssertionFailedError
  org.joda.time.TestPeriod_Constructors#testConstructor_RI_RI3 AssertionFailedError
  org.joda.time.TestPeriod_Constructors#testConstructor_RI_RI4 AssertionFailedError
  org.joda.time.TestPeriod_Constructors#testConstructor_RI_RI7 AssertionFailedError
  org.joda.time.TestPeriod_Constructors#testConstructor_RI_RI_PeriodType1 AssertionFailedError
  org.joda.time.TestPeriod_Constructors#testConstructor_RI_RI_PeriodType4 AssertionFailedError
  org.joda.time.TestPeriod_Constructors#testConstructor_RP_RP1 AssertionFailedError
  org.joda.time.TestPeriod_Constructors#testConstructor_RP_RP2 AssertionFailedError
  org.joda.time.TestPeriod_Constructors#testConstructor_RP_RP2Local AssertionFailedError
  org.joda.time.TestPeriod_Constructors#testConstructor_RP_RP_PeriodType1 AssertionFailedError
  org.joda.time.TestPeriod_Constructors#testConstructor_RP_RP_PeriodType2 AssertionFailedError
  org.joda.time.TestPeriod_Constructors#testConstructor_RP_RP_PeriodType2Local AssertionFailedError
  org.joda.time.TestPeriod_Constructors#testConstructor_long_long1 AssertionFailedError
  org.joda.time.TestPeriod_Constructors#testConstructor_long_long2 AssertionFailedError
  org.joda.time.TestPeriod_Constructors#testConstructor_long_long_Chronology1 AssertionFailedError
  org.joda.time.TestPeriod_Constructors#testConstructor_long_long_Chronology2 AssertionFailedError
  org.joda.time.TestPeriod_Constructors#testConstructor_long_long_PeriodType1 AssertionFailedError
  org.joda.time.TestPeriod_Constructors#testConstructor_long_long_PeriodType_Chronology1 AssertionFailedError
  org.joda.time.TestPeriod_Constructors#testConstructor_long_long_PeriodType_Chronology2 AssertionFailedError
  org.joda.time.TestPeriod_Constructors#testConstructor_trickyDifferences_LD_LD_toFeb_endOfMonth1 AssertionFailedError
  org.joda.time.TestPeriod_Constructors#testConstructor_trickyDifferences_LD_LD_toFeb_endOfMonth2 AssertionFailedError
  org.joda.time.TestPeriod_Constructors#testConstructor_trickyDifferences_LD_LD_toFeb_endOfMonth3 AssertionFailedError
  org.joda.time.TestPeriod_Constructors#testConstructor_trickyDifferences_LD_LD_toFeb_exactMonths AssertionFailedError
  org.joda.time.TestPeriod_Constructors#testConstructor_trickyDifferences_LD_LD_toFeb_leapYear AssertionFailedError
  org.joda.time.TestPeriod_Constructors#testConstructor_trickyDifferences_LD_LD_toFeb_standardYear AssertionFailedError
  org.joda.time.TestPeriod_Constructors#testConstructor_trickyDifferences_LD_LD_toMar_endOfMonth1 AssertionFailedError
  org.joda.time.TestPeriod_Constructors#testConstructor_trickyDifferences_LD_LD_toMar_endOfMonth2 AssertionFailedError
  org.joda.time.TestPeriod_Constructors#testConstructor_trickyDifferences_RI_RI_toFeb_endOfMonth1 AssertionFailedError
  org.joda.time.TestPeriod_Constructors#testConstructor_trickyDifferences_RI_RI_toFeb_endOfMonth2 AssertionFailedError
  org.joda.time.TestPeriod_Constructors#testConstructor_trickyDifferences_RI_RI_toFeb_endOfMonth3 AssertionFailedError
  org.joda.time.TestPeriod_Constructors#testConstructor_trickyDifferences_RI_RI_toFeb_exactMonths AssertionFailedError
  org.joda.time.TestPeriod_Constructors#testConstructor_trickyDifferences_RI_RI_toFeb_leapYear AssertionFailedError
  org.joda.time.TestPeriod_Constructors#testConstructor_trickyDifferences_RI_RI_toFeb_standardYear AssertionFailedError
  org.joda.time.TestPeriod_Constructors#testConstructor_trickyDifferences_RI_RI_toMar_endOfMonth1 AssertionFailedError
  org.joda.time.TestPeriod_Constructors#testConstructor_trickyDifferences_RI_RI_toMar_endOfMonth2 AssertionFailedError
  org.joda.time.TestYearMonthDay_Properties#testPropertyAddDay AssertionFailedError
  org.joda.time.TestYearMonthDay_Properties#testPropertyAddMonth AssertionFailedError
  org.joda.time.TestYearMonth_Properties#testPropertyAddMonth AssertionFailedError
  org.joda.time.chrono.TestCopticChronology#testDurationMonth AssertionFailedError
  org.joda.time.chrono.TestCopticChronology#testSampleDate AssertionFailedError ...
  org.joda.time.chrono.TestEthiopicChronology#testDurationMonth AssertionFailedError
  org.joda.time.chrono.TestEthiopicChronology#testSampleDate AssertionFailedError
  org.joda.time.chrono.TestGJChronology#testCutoverAddMonths AssertionFailedError
  org.joda.time.chrono.TestISOChronology#testAddMonths AssertionFailedError expe...
  org.joda.time.chrono.TestIslamicChronology#testSampleDate1 AssertionFailedError
  org.joda.time.chrono.TestIslamicChronology#testSampleDateWithZone AssertionFailedError
  org.joda.time.chrono.TestLenientChronology#test_lenientChrononolgy_Chicago ComparisonFailure
  org.joda.time.chrono.TestLenientChronology#test_lenientChrononolgy_Turk ComparisonFailure
  org.joda.time.chrono.TestLenientChronology#test_setMonthOfYear ComparisonFailure
org.joda.time.chrono.gj.MainTest.testChronology(org.joda.time.chrono.gj.MainTest)
  Run 1: org.joda.time.chrono.gj.MainTest#testChronology AssertionFailedError
  Run 2: org.joda.time.chrono.gj.MainTest#testChronology AssertionFailedError

  org.joda.time.convert.TestStringConverter#testSetIntoInterval_Object_Chronology1 AssertionFailedError
  org.joda.time.convert.TestStringConverter#testSetIntoInterval_Object_Chronology2 AssertionFailedError
  org.joda.time.convert.TestStringConverter#testSetIntoInterval_Object_Chronology4 AssertionFailedError
  org.joda.time.convert.TestStringConverter#testSetIntoInterval_Object_Chronology5 AssertionFailedError
  org.joda.time.format.TestDateTimeFormatter#testZoneNameNearTransition ComparisonFailure
  org.joda.time.format.TestDateTimeFormatter#testZoneShortNameNearTransition ComparisonFailure
  org.joda.time.tz.TestBuilder#testForwardTransitions AssertionFailedError expec...
  org.joda.time.tz.TestBuilder#testReverseTransitions AssertionFailedError expec...
  org.joda.time.tz.TestBuilder#testSerialization AssertionFailedError expected:<...
  org.joda.time.tz.TestCompiler#testCompile AssertionFailedError expected:<-1633...
  org.joda.time.tz.TestCompiler#test_2400_last AssertionFailedError expected:<4>...
  org.joda.time.tz.TestCompiler#test_Amman_2003 AssertionFailedError expected:<1...
  org.joda.time.tz.TestCompiler#test_Amman_2004 AssertionFailedError expected:<1...
  org.joda.time.tz.TestCompiler#test_Amman_2005 AssertionFailedError expected:<1...
  org.joda.time.tz.TestCompiler#test_Amman_2006 AssertionFailedError expected:<1...
Tests in error: 
  org.joda.time.format.TestTextFields#testHalfdayNames IllegalFieldValueException

Tests run: 4156, Failures: 196, Errors: 1, Skipped: 0

[INFO] ------------------------------------------------------------------------
[INFO] BUILD FAILURE
[INFO] ------------------------------------------------------------------------
[INFO] Total time: 15.030s
[INFO] Finished at: Wed Aug 05 23:21:11 BST 2015
[INFO] Final Memory: 8M/213M
[INFO] ------------------------------------------------------------------------
[ERROR] Failed to execute goal org.apache.maven.plugins:maven-surefire-plugin:2.18.1:test (default-test) on project joda-time: There are test failures.
[ERROR] 
[ERROR] Please refer to /home/perham/Study/LittleDarwin/Cases/joda-time-2.8.1/target/surefire-reports for the individual test results.
[ERROR] -> [Help 1]
[ERROR] 
[ERROR] To see the full stack trace of the errors, re-run Maven with the -e switch.
[ERROR] Re-run Maven using the -X switch to enable full debug logging.
[ERROR] 
[ERROR] For more information about the errors and possible solutions, please read the following articles:
[ERROR] [Help 1] http://cwiki.apache.org/confluence/display/MAVEN/MojoFailureException
