[INFO] Scanning for projects...
[INFO]                                                                         
[INFO] ------------------------------------------------------------------------
[INFO] Building Joda-Time 2.8.1
[INFO] ------------------------------------------------------------------------
[INFO] 
[INFO] --- maven-resources-plugin:2.7:resources (default-resources) @ joda-time ---
[INFO] Using 'UTF-8' encoding to copy filtered resources.
[INFO] Copying 2 resources to META-INF
[INFO] Copying 10 resources
[INFO] 
[INFO] --- maven-compiler-plugin:3.3:compile (default-compile) @ joda-time ---
[INFO] Changes detected - recompiling the module!
[INFO] Compiling 166 source files to /home/perham/Study/LittleDarwin/Cases/joda-time-2.8.1/target/classes
[INFO] 
[INFO] --- exec-maven-plugin:1.4.0:java (compile-tzdb) @ joda-time ---
Writing zoneinfo files
Writing ZoneInfoMap
[INFO] 
[INFO] --- maven-resources-plugin:2.7:testResources (default-testResources) @ joda-time ---
[INFO] Using 'UTF-8' encoding to copy filtered resources.
[INFO] Copying 34 resources
[INFO] 
[INFO] --- maven-compiler-plugin:3.3:testCompile (default-testCompile) @ joda-time ---
[INFO] Nothing to compile - all classes are up to date
[INFO] 
[INFO] --- maven-surefire-plugin:2.18.1:test (default-test) @ joda-time ---
[INFO] Surefire report directory: /home/perham/Study/LittleDarwin/Cases/joda-time-2.8.1/target/surefire-reports

-------------------------------------------------------
 T E S T S
-------------------------------------------------------
Running org.joda.time.TestAllPackages

TestBuddhistChronology.testCalendar

TestCopticChronology.testCalendar

TestEthiopicChronology.testCalendar

TestIslamicChronology.testCalendar

Testing Gregorian chronology over 1000 iterations
Failure on monthOfYear.add
org.joda.time.chrono.gj.TestGJMonthOfYearField
	vs. org.joda.time.chrono.GJMonthOfYearDateTimeField
Datetime: Sat 1960-03-26T03:29:34.468Z / 1960-W12-6
Millis from 1970: -308262625532
Sun 1956-02-26T03:29:34.468Z / 1956-W8-7 != Thu 1395-02-26T03:29:34.468Z / 1395-W9-4
-436998625532 != -18140358625532
Original value as reported by first field: 3
Original value as reported by second field: 3
First new value as reported by first field: 2
First new value as reported by second field: 2
Second new value as reported by first field: 2
Second new value as reported by second field: 2
Failure index: 0
Test millis: -308262625532
Test value: -49
Test millis2: -46922557997542

Testing Julian chronology over 1000 iterations
Failure on monthOfYear.add
org.joda.time.chrono.gj.TestJulianMonthOfYearField
	vs. org.joda.time.chrono.GJMonthOfYearDateTimeField
Datetime: Sat 1960-03-13T03:29:34.468Z / 1960-W11-6
Millis from 1970: -308262625532
Sun 1956-02-13T03:29:34.468Z / 1956-W6-7 != Sat 1395-02-13T03:29:34.468Z / 1395-W6-6
-436998625532 != -18140790625532
Original value as reported by first field: 3
Original value as reported by second field: 3
First new value as reported by first field: 2
First new value as reported by second field: 2
Second new value as reported by first field: 2
Second new value as reported by second field: 2
Failure index: 0
Test millis: -308262625532
Test value: -49
Test millis2: -46922557997542
Writing zoneinfo files
Writing ZoneInfoMap
Tests run: 4157, Failures: 11, Errors: 0, Skipped: 0, Time elapsed: 4.971 sec <<< FAILURE! - in org.joda.time.TestAllPackages
testPropertyAddMonthOfYear(org.joda.time.TestDateTime_Properties)  Time elapsed: 0.006 sec  <<< FAILURE!
junit.framework.ComparisonFailure: expected:<[2003]-12-09T00:00:00.000Z> but was:<[1991]-12-09T00:00:00.000Z>
	at junit.framework.Assert.assertEquals(Assert.java:81)
	at junit.framework.Assert.assertEquals(Assert.java:87)
	at org.joda.time.TestDateTime_Properties.testPropertyAddMonthOfYear(TestDateTime_Properties.java:410)

testPropertyAddToCopyMonth(org.joda.time.TestLocalDateTime_Properties)  Time elapsed: 0 sec  <<< FAILURE!
junit.framework.AssertionFailedError: expected:<1971> but was:<1959>
	at junit.framework.Assert.fail(Assert.java:47)
	at junit.framework.Assert.failNotEquals(Assert.java:280)
	at junit.framework.Assert.assertEquals(Assert.java:64)
	at junit.framework.Assert.assertEquals(Assert.java:198)
	at junit.framework.Assert.assertEquals(Assert.java:204)
	at org.joda.time.TestLocalDateTime_Properties.check(TestLocalDateTime_Properties.java:1076)
	at org.joda.time.TestLocalDateTime_Properties.testPropertyAddToCopyMonth(TestLocalDateTime_Properties.java:240)

testPropertyAddToCopyMonth(org.joda.time.TestLocalDate_Properties)  Time elapsed: 0 sec  <<< FAILURE!
junit.framework.AssertionFailedError: expected:<1971> but was:<1959>
	at junit.framework.Assert.fail(Assert.java:47)
	at junit.framework.Assert.failNotEquals(Assert.java:280)
	at junit.framework.Assert.assertEquals(Assert.java:64)
	at junit.framework.Assert.assertEquals(Assert.java:198)
	at junit.framework.Assert.assertEquals(Assert.java:204)
	at org.joda.time.TestLocalDate_Properties.check(TestLocalDate_Properties.java:551)
	at org.joda.time.TestLocalDate_Properties.testPropertyAddToCopyMonth(TestLocalDate_Properties.java:235)

testPropertyAddMonth(org.joda.time.TestYearMonthDay_Properties)  Time elapsed: 0.001 sec  <<< FAILURE!
junit.framework.AssertionFailedError: expected:<1971> but was:<1959>
	at junit.framework.Assert.fail(Assert.java:47)
	at junit.framework.Assert.failNotEquals(Assert.java:280)
	at junit.framework.Assert.assertEquals(Assert.java:64)
	at junit.framework.Assert.assertEquals(Assert.java:198)
	at junit.framework.Assert.assertEquals(Assert.java:204)
	at org.joda.time.TestYearMonthDay_Properties.check(TestYearMonthDay_Properties.java:555)
	at org.joda.time.TestYearMonthDay_Properties.testPropertyAddMonth(TestYearMonthDay_Properties.java:238)

testPropertyAddDay(org.joda.time.TestYearMonthDay_Properties)  Time elapsed: 0 sec  <<< FAILURE!
junit.framework.AssertionFailedError: expected:<1971> but was:<1959>
	at junit.framework.Assert.fail(Assert.java:47)
	at junit.framework.Assert.failNotEquals(Assert.java:280)
	at junit.framework.Assert.assertEquals(Assert.java:64)
	at junit.framework.Assert.assertEquals(Assert.java:198)
	at junit.framework.Assert.assertEquals(Assert.java:204)
	at org.joda.time.TestYearMonthDay_Properties.check(TestYearMonthDay_Properties.java:555)
	at org.joda.time.TestYearMonthDay_Properties.testPropertyAddDay(TestYearMonthDay_Properties.java:407)

testPropertyAddMonth(org.joda.time.TestYearMonth_Properties)  Time elapsed: 0.001 sec  <<< FAILURE!
junit.framework.AssertionFailedError: expected:<1971> but was:<1959>
	at junit.framework.Assert.fail(Assert.java:47)
	at junit.framework.Assert.failNotEquals(Assert.java:280)
	at junit.framework.Assert.assertEquals(Assert.java:64)
	at junit.framework.Assert.assertEquals(Assert.java:198)
	at junit.framework.Assert.assertEquals(Assert.java:204)
	at org.joda.time.TestYearMonth_Properties.check(TestYearMonth_Properties.java:363)
	at org.joda.time.TestYearMonth_Properties.testPropertyAddMonth(TestYearMonth_Properties.java:237)

testCutoverAddMonths(org.joda.time.chrono.TestGJChronology)  Time elapsed: 0.001 sec  <<< FAILURE!
junit.framework.AssertionFailedError: expected:<1582-01-01T00:00:00.000Z> but was:<1439-01-01T00:00:00.000Z>
	at junit.framework.Assert.fail(Assert.java:47)
	at junit.framework.Assert.failNotEquals(Assert.java:280)
	at junit.framework.Assert.assertEquals(Assert.java:64)
	at junit.framework.Assert.assertEquals(Assert.java:71)
	at org.joda.time.chrono.TestGJChronology.testAdd(TestGJChronology.java:485)
	at org.joda.time.chrono.TestGJChronology.testCutoverAddMonths(TestGJChronology.java:424)

testAddMonths(org.joda.time.chrono.TestISOChronology)  Time elapsed: 0.001 sec  <<< FAILURE!
junit.framework.AssertionFailedError: expected:<1582-01-01T00:00:00.000Z> but was:<1439-01-01T00:00:00.000Z>
	at junit.framework.Assert.fail(Assert.java:47)
	at junit.framework.Assert.failNotEquals(Assert.java:280)
	at junit.framework.Assert.assertEquals(Assert.java:64)
	at junit.framework.Assert.assertEquals(Assert.java:71)
	at org.joda.time.chrono.TestISOChronology.testAdd(TestISOChronology.java:414)
	at org.joda.time.chrono.TestISOChronology.testAddMonths(TestISOChronology.java:396)

test_setMonthOfYear(org.joda.time.chrono.TestLenientChronology)  Time elapsed: 0.001 sec  <<< FAILURE!
junit.framework.ComparisonFailure: expected:<[2007]-12-01T00:00:00.000Z> but was:<[1995]-12-01T00:00:00.000Z>
	at junit.framework.Assert.assertEquals(Assert.java:81)
	at junit.framework.Assert.assertEquals(Assert.java:87)
	at org.joda.time.chrono.TestLenientChronology.test_setMonthOfYear(TestLenientChronology.java:67)

testChronology(org.joda.time.chrono.gj.MainTest)  Time elapsed: 0.005 sec  <<< FAILURE!
junit.framework.AssertionFailedError
	at junit.framework.Assert.fail(Assert.java:47)
	at org.joda.time.chrono.gj.MainTest.testChronology(MainTest.java:158)

testChronology(org.joda.time.chrono.gj.MainTest)  Time elapsed: 0.004 sec  <<< FAILURE!
junit.framework.AssertionFailedError
	at junit.framework.Assert.fail(Assert.java:47)
	at org.joda.time.chrono.gj.MainTest.testChronology(MainTest.java:158)


Results :

Failed tests: 
  org.joda.time.TestDateTime_Properties#testPropertyAddMonthOfYear ComparisonFailure
  org.joda.time.TestLocalDateTime_Properties#testPropertyAddToCopyMonth AssertionFailedError
  org.joda.time.TestLocalDate_Properties#testPropertyAddToCopyMonth AssertionFailedError
  org.joda.time.TestYearMonthDay_Properties#testPropertyAddDay AssertionFailedError
  org.joda.time.TestYearMonthDay_Properties#testPropertyAddMonth AssertionFailedError
  org.joda.time.TestYearMonth_Properties#testPropertyAddMonth AssertionFailedError
  org.joda.time.chrono.TestGJChronology#testCutoverAddMonths AssertionFailedError
  org.joda.time.chrono.TestISOChronology#testAddMonths AssertionFailedError expe...
  org.joda.time.chrono.TestLenientChronology#test_setMonthOfYear ComparisonFailure
org.joda.time.chrono.gj.MainTest.testChronology(org.joda.time.chrono.gj.MainTest)
  Run 1: org.joda.time.chrono.gj.MainTest#testChronology AssertionFailedError
  Run 2: org.joda.time.chrono.gj.MainTest#testChronology AssertionFailedError


Tests run: 4156, Failures: 10, Errors: 0, Skipped: 0

[INFO] ------------------------------------------------------------------------
[INFO] BUILD FAILURE
[INFO] ------------------------------------------------------------------------
[INFO] Total time: 15.125s
[INFO] Finished at: Wed Aug 05 23:15:52 BST 2015
[INFO] Final Memory: 9M/213M
[INFO] ------------------------------------------------------------------------
[ERROR] Failed to execute goal org.apache.maven.plugins:maven-surefire-plugin:2.18.1:test (default-test) on project joda-time: There are test failures.
[ERROR] 
[ERROR] Please refer to /home/perham/Study/LittleDarwin/Cases/joda-time-2.8.1/target/surefire-reports for the individual test results.
[ERROR] -> [Help 1]
[ERROR] 
[ERROR] To see the full stack trace of the errors, re-run Maven with the -e switch.
[ERROR] Re-run Maven using the -X switch to enable full debug logging.
[ERROR] 
[ERROR] For more information about the errors and possible solutions, please read the following articles:
[ERROR] [Help 1] http://cwiki.apache.org/confluence/display/MAVEN/MojoFailureException
