[INFO] Scanning for projects...
[INFO]                                                                         
[INFO] ------------------------------------------------------------------------
[INFO] Building Joda-Time 2.8.1
[INFO] ------------------------------------------------------------------------
[INFO] 
[INFO] --- maven-resources-plugin:2.7:resources (default-resources) @ joda-time ---
[INFO] Using 'UTF-8' encoding to copy filtered resources.
[INFO] Copying 2 resources to META-INF
[INFO] Copying 10 resources
[INFO] 
[INFO] --- maven-compiler-plugin:3.3:compile (default-compile) @ joda-time ---
[INFO] Changes detected - recompiling the module!
[INFO] Compiling 166 source files to /home/perham/Study/LittleDarwin/Cases/joda-time-2.8.1/target/classes
[INFO] 
[INFO] --- exec-maven-plugin:1.4.0:java (compile-tzdb) @ joda-time ---
Writing zoneinfo files
Writing ZoneInfoMap
[INFO] 
[INFO] --- maven-resources-plugin:2.7:testResources (default-testResources) @ joda-time ---
[INFO] Using 'UTF-8' encoding to copy filtered resources.
[INFO] Copying 34 resources
[INFO] 
[INFO] --- maven-compiler-plugin:3.3:testCompile (default-testCompile) @ joda-time ---
[INFO] Nothing to compile - all classes are up to date
[INFO] 
[INFO] --- maven-surefire-plugin:2.18.1:test (default-test) @ joda-time ---
[INFO] Surefire report directory: /home/perham/Study/LittleDarwin/Cases/joda-time-2.8.1/target/surefire-reports

-------------------------------------------------------
 T E S T S
-------------------------------------------------------
Running org.joda.time.TestAllPackages

TestBuddhistChronology.testCalendar

TestCopticChronology.testCalendar

TestEthiopicChronology.testCalendar

TestIslamicChronology.testCalendar

Testing Gregorian chronology over 1000 iterations
Failure index: 0
Test millis: -308262625532
Test value: -49
Test millis2: -46922557997542

Testing Julian chronology over 1000 iterations
Failure index: 0
Test millis: -308262625532
Test value: -49
Test millis2: -46922557997542
Writing zoneinfo files
Writing ZoneInfoMap
Tests run: 4157, Failures: 2, Errors: 21, Skipped: 0, Time elapsed: 5.071 sec <<< FAILURE! - in org.joda.time.TestAllPackages
testPropertyAddMonthOfYear(org.joda.time.TestDateTime_Properties)  Time elapsed: 0.005 sec  <<< ERROR!
java.lang.ArrayIndexOutOfBoundsException: 13
	at org.joda.time.chrono.BasicGJChronology.getDaysInYearMonth(BasicGJChronology.java:128)
	at org.joda.time.chrono.BasicMonthOfYearDateTimeField.add(BasicMonthOfYearDateTimeField.java:42)
	at org.joda.time.chrono.ZonedChronology$ZonedDateTimeField.add(ZonedChronology.java:451)
	at org.joda.time.DateTime$Property.addToCopy(DateTime.java:2169)
	at org.joda.time.TestDateTime_Properties.testPropertyAddMonthOfYear(TestDateTime_Properties.java:409)

testConstructor_RP_RI7(org.joda.time.TestInterval_Constructors)  Time elapsed: 0.001 sec  <<< ERROR!
java.lang.ArrayIndexOutOfBoundsException: 13
	at org.joda.time.chrono.BasicGJChronology.getDaysInYearMonth(BasicGJChronology.java:128)
	at org.joda.time.chrono.BasicMonthOfYearDateTimeField.add(BasicMonthOfYearDateTimeField.java:42)
	at org.joda.time.chrono.ZonedChronology$ZonedDateTimeField.add(ZonedChronology.java:451)
	at org.joda.time.TestInterval_Constructors.testConstructor_RP_RI7(TestInterval_Constructors.java:418)

testConstructor_RD_RI1(org.joda.time.TestInterval_Constructors)  Time elapsed: 0.001 sec  <<< ERROR!
java.lang.ArrayIndexOutOfBoundsException: 13
	at org.joda.time.chrono.BasicGJChronology.getDaysInYearMonth(BasicGJChronology.java:128)
	at org.joda.time.chrono.BasicMonthOfYearDateTimeField.add(BasicMonthOfYearDateTimeField.java:42)
	at org.joda.time.field.ImpreciseDateTimeField$LinkedDurationField.add(ImpreciseDateTimeField.java:183)
	at org.joda.time.chrono.ZonedChronology$ZonedDurationField.add(ZonedChronology.java:317)
	at org.joda.time.TestInterval_Constructors.testConstructor_RD_RI1(TestInterval_Constructors.java:486)

testConstructor_RD_RI4(org.joda.time.TestInterval_Constructors)  Time elapsed: 0 sec  <<< ERROR!
java.lang.ArrayIndexOutOfBoundsException: 13
	at org.joda.time.chrono.BasicGJChronology.getDaysInYearMonth(BasicGJChronology.java:128)
	at org.joda.time.chrono.BasicMonthOfYearDateTimeField.add(BasicMonthOfYearDateTimeField.java:42)
	at org.joda.time.chrono.ZonedChronology$ZonedDateTimeField.add(ZonedChronology.java:451)
	at org.joda.time.TestInterval_Constructors.testConstructor_RD_RI4(TestInterval_Constructors.java:512)

testConstructor_RP_RI1(org.joda.time.TestInterval_Constructors)  Time elapsed: 0 sec  <<< ERROR!
java.lang.ArrayIndexOutOfBoundsException: 13
	at org.joda.time.chrono.BasicGJChronology.getDaysInYearMonth(BasicGJChronology.java:128)
	at org.joda.time.chrono.BasicMonthOfYearDateTimeField.add(BasicMonthOfYearDateTimeField.java:42)
	at org.joda.time.field.ImpreciseDateTimeField$LinkedDurationField.add(ImpreciseDateTimeField.java:183)
	at org.joda.time.chrono.ZonedChronology$ZonedDurationField.add(ZonedChronology.java:317)
	at org.joda.time.TestInterval_Constructors.testConstructor_RP_RI1(TestInterval_Constructors.java:356)

testConstructor_RP_RI2(org.joda.time.TestInterval_Constructors)  Time elapsed: 0.001 sec  <<< ERROR!
java.lang.ArrayIndexOutOfBoundsException: 13
	at org.joda.time.chrono.BasicGJChronology.getDaysInYearMonth(BasicGJChronology.java:128)
	at org.joda.time.chrono.BasicMonthOfYearDateTimeField.add(BasicMonthOfYearDateTimeField.java:42)
	at org.joda.time.field.ImpreciseDateTimeField$LinkedDurationField.add(ImpreciseDateTimeField.java:183)
	at org.joda.time.TestInterval_Constructors.testConstructor_RP_RI2(TestInterval_Constructors.java:368)

testPropertyAddToCopyMonth(org.joda.time.TestLocalDateTime_Properties)  Time elapsed: 0.002 sec  <<< ERROR!
java.lang.ArrayIndexOutOfBoundsException: 13
	at org.joda.time.chrono.BasicGJChronology.getDaysInYearMonth(BasicGJChronology.java:128)
	at org.joda.time.chrono.BasicMonthOfYearDateTimeField.add(BasicMonthOfYearDateTimeField.java:42)
	at org.joda.time.LocalDateTime$Property.addToCopy(LocalDateTime.java:2234)
	at org.joda.time.TestLocalDateTime_Properties.testPropertyAddToCopyMonth(TestLocalDateTime_Properties.java:239)

testPropertyAddToCopyMonth(org.joda.time.TestLocalDate_Properties)  Time elapsed: 0 sec  <<< ERROR!
java.lang.ArrayIndexOutOfBoundsException: 13
	at org.joda.time.chrono.BasicGJChronology.getDaysInYearMonth(BasicGJChronology.java:128)
	at org.joda.time.chrono.BasicMonthOfYearDateTimeField.add(BasicMonthOfYearDateTimeField.java:42)
	at org.joda.time.LocalDate$Property.addToCopy(LocalDate.java:1978)
	at org.joda.time.TestLocalDate_Properties.testPropertyAddToCopyMonth(TestLocalDate_Properties.java:234)

testMinus_RP(org.joda.time.TestLocalTime_Basics)  Time elapsed: 0.001 sec  <<< ERROR!
java.lang.ArrayIndexOutOfBoundsException: 13
	at org.joda.time.chrono.BasicGJChronology.getDaysInYearMonth(BasicGJChronology.java:126)
	at org.joda.time.chrono.BasicMonthOfYearDateTimeField.add(BasicMonthOfYearDateTimeField.java:42)
	at org.joda.time.chrono.BasicMonthOfYearDateTimeField.add(BasicMonthOfYearDateTimeField.java:47)
	at org.joda.time.chrono.GJChronology$ImpreciseCutoverField.add(GJChronology.java:1028)
	at org.joda.time.chrono.GJChronology$LinkedDurationField.add(GJChronology.java:1145)
	at org.joda.time.chrono.LimitChronology$LimitDurationField.add(LimitChronology.java:424)
	at org.joda.time.chrono.BaseChronology.add(BaseChronology.java:307)
	at org.joda.time.LocalTime.withPeriodAdded(LocalTime.java:848)
	at org.joda.time.LocalTime.minus(LocalTime.java:978)
	at org.joda.time.TestLocalTime_Basics.testMinus_RP(TestLocalTime_Basics.java:591)

testConstructor_RP_RI7(org.joda.time.TestMutableInterval_Constructors)  Time elapsed: 0 sec  <<< ERROR!
java.lang.ArrayIndexOutOfBoundsException: 13
	at org.joda.time.chrono.BasicGJChronology.getDaysInYearMonth(BasicGJChronology.java:128)
	at org.joda.time.chrono.BasicMonthOfYearDateTimeField.add(BasicMonthOfYearDateTimeField.java:42)
	at org.joda.time.chrono.ZonedChronology$ZonedDateTimeField.add(ZonedChronology.java:451)
	at org.joda.time.TestMutableInterval_Constructors.testConstructor_RP_RI7(TestMutableInterval_Constructors.java:394)

testConstructor_RD_RI1(org.joda.time.TestMutableInterval_Constructors)  Time elapsed: 0.001 sec  <<< ERROR!
java.lang.ArrayIndexOutOfBoundsException: 13
	at org.joda.time.chrono.BasicGJChronology.getDaysInYearMonth(BasicGJChronology.java:128)
	at org.joda.time.chrono.BasicMonthOfYearDateTimeField.add(BasicMonthOfYearDateTimeField.java:42)
	at org.joda.time.field.ImpreciseDateTimeField$LinkedDurationField.add(ImpreciseDateTimeField.java:183)
	at org.joda.time.chrono.ZonedChronology$ZonedDurationField.add(ZonedChronology.java:317)
	at org.joda.time.TestMutableInterval_Constructors.testConstructor_RD_RI1(TestMutableInterval_Constructors.java:462)

testConstructor_RD_RI4(org.joda.time.TestMutableInterval_Constructors)  Time elapsed: 0 sec  <<< ERROR!
java.lang.ArrayIndexOutOfBoundsException: 13
	at org.joda.time.chrono.BasicGJChronology.getDaysInYearMonth(BasicGJChronology.java:128)
	at org.joda.time.chrono.BasicMonthOfYearDateTimeField.add(BasicMonthOfYearDateTimeField.java:42)
	at org.joda.time.chrono.ZonedChronology$ZonedDateTimeField.add(ZonedChronology.java:451)
	at org.joda.time.TestMutableInterval_Constructors.testConstructor_RD_RI4(TestMutableInterval_Constructors.java:488)

testConstructor_RP_RI1(org.joda.time.TestMutableInterval_Constructors)  Time elapsed: 0 sec  <<< ERROR!
java.lang.ArrayIndexOutOfBoundsException: 13
	at org.joda.time.chrono.BasicGJChronology.getDaysInYearMonth(BasicGJChronology.java:128)
	at org.joda.time.chrono.BasicMonthOfYearDateTimeField.add(BasicMonthOfYearDateTimeField.java:42)
	at org.joda.time.field.ImpreciseDateTimeField$LinkedDurationField.add(ImpreciseDateTimeField.java:183)
	at org.joda.time.chrono.ZonedChronology$ZonedDurationField.add(ZonedChronology.java:317)
	at org.joda.time.TestMutableInterval_Constructors.testConstructor_RP_RI1(TestMutableInterval_Constructors.java:332)

testConstructor_RP_RI2(org.joda.time.TestMutableInterval_Constructors)  Time elapsed: 0 sec  <<< ERROR!
java.lang.ArrayIndexOutOfBoundsException: 13
	at org.joda.time.chrono.BasicGJChronology.getDaysInYearMonth(BasicGJChronology.java:128)
	at org.joda.time.chrono.BasicMonthOfYearDateTimeField.add(BasicMonthOfYearDateTimeField.java:42)
	at org.joda.time.field.ImpreciseDateTimeField$LinkedDurationField.add(ImpreciseDateTimeField.java:183)
	at org.joda.time.TestMutableInterval_Constructors.testConstructor_RP_RI2(TestMutableInterval_Constructors.java:344)

testConstructor_RP_RI3(org.joda.time.TestMutableInterval_Constructors)  Time elapsed: 0 sec  <<< ERROR!
java.lang.ArrayIndexOutOfBoundsException: 13
	at org.joda.time.chrono.BasicGJChronology.getDaysInYearMonth(BasicGJChronology.java:128)
	at org.joda.time.chrono.BasicMonthOfYearDateTimeField.add(BasicMonthOfYearDateTimeField.java:42)
	at org.joda.time.field.ImpreciseDateTimeField$LinkedDurationField.add(ImpreciseDateTimeField.java:183)
	at org.joda.time.TestMutableInterval_Constructors.testConstructor_RP_RI3(TestMutableInterval_Constructors.java:357)

testPropertyAddMonth(org.joda.time.TestYearMonthDay_Properties)  Time elapsed: 0 sec  <<< ERROR!
java.lang.ArrayIndexOutOfBoundsException

testPropertyAddDay(org.joda.time.TestYearMonthDay_Properties)  Time elapsed: 0 sec  <<< ERROR!
java.lang.ArrayIndexOutOfBoundsException

testPropertyAddMonth(org.joda.time.TestYearMonth_Properties)  Time elapsed: 0.001 sec  <<< ERROR!
java.lang.ArrayIndexOutOfBoundsException

testCutoverAddMonths(org.joda.time.chrono.TestGJChronology)  Time elapsed: 0.001 sec  <<< ERROR!
java.lang.ArrayIndexOutOfBoundsException

testAddMonths(org.joda.time.chrono.TestISOChronology)  Time elapsed: 0.001 sec  <<< ERROR!
java.lang.ArrayIndexOutOfBoundsException

test_setMonthOfYear(org.joda.time.chrono.TestLenientChronology)  Time elapsed: 0.001 sec  <<< ERROR!
java.lang.ArrayIndexOutOfBoundsException

testChronology(org.joda.time.chrono.gj.MainTest)  Time elapsed: 0.003 sec  <<< FAILURE!
junit.framework.AssertionFailedError
	at junit.framework.Assert.fail(Assert.java:47)
	at org.joda.time.chrono.gj.MainTest.testChronology(MainTest.java:158)

testChronology(org.joda.time.chrono.gj.MainTest)  Time elapsed: 0.002 sec  <<< FAILURE!
junit.framework.AssertionFailedError
	at junit.framework.Assert.fail(Assert.java:47)
	at org.joda.time.chrono.gj.MainTest.testChronology(MainTest.java:158)


Results :

Failed tests: 
org.joda.time.chrono.gj.MainTest.testChronology(org.joda.time.chrono.gj.MainTest)
  Run 1: org.joda.time.chrono.gj.MainTest#testChronology AssertionFailedError
  Run 2: org.joda.time.chrono.gj.MainTest#testChronology AssertionFailedError

Tests in error: 
  org.joda.time.TestDateTime_Properties#testPropertyAddMonthOfYear ArrayIndexOutOfBoundsException
  org.joda.time.TestInterval_Constructors#testConstructor_RD_RI1 ArrayIndexOutOfBoundsException
  org.joda.time.TestInterval_Constructors#testConstructor_RD_RI4 ArrayIndexOutOfBoundsException
  org.joda.time.TestInterval_Constructors#testConstructor_RP_RI1 ArrayIndexOutOfBoundsException
  org.joda.time.TestInterval_Constructors#testConstructor_RP_RI2 ArrayIndexOutOfBoundsException
  org.joda.time.TestInterval_Constructors#testConstructor_RP_RI7 ArrayIndexOutOfBoundsException
  org.joda.time.TestLocalDateTime_Properties#testPropertyAddToCopyMonth ArrayIndexOutOfBoundsException
  org.joda.time.TestLocalDate_Properties#testPropertyAddToCopyMonth ArrayIndexOutOfBoundsException
  org.joda.time.TestLocalTime_Basics#testMinus_RP ArrayIndexOutOfBoundsException
  org.joda.time.TestMutableInterval_Constructors#testConstructor_RD_RI1 ArrayIndexOutOfBoundsException
  org.joda.time.TestMutableInterval_Constructors#testConstructor_RD_RI4 ArrayIndexOutOfBoundsException
  org.joda.time.TestMutableInterval_Constructors#testConstructor_RP_RI1 ArrayIndexOutOfBoundsException
  org.joda.time.TestMutableInterval_Constructors#testConstructor_RP_RI2 ArrayIndexOutOfBoundsException
  org.joda.time.TestMutableInterval_Constructors#testConstructor_RP_RI3 ArrayIndexOutOfBoundsException
  org.joda.time.TestMutableInterval_Constructors#testConstructor_RP_RI7 ArrayIndexOutOfBoundsException
  org.joda.time.TestYearMonthDay_Properties#testPropertyAddDay ArrayIndexOutOfBoundsException
  org.joda.time.TestYearMonthDay_Properties#testPropertyAddMonth ArrayIndexOutOfBoundsException
  org.joda.time.TestYearMonth_Properties#testPropertyAddMonth ArrayIndexOutOfBoundsException
  org.joda.time.chrono.TestGJChronology#testCutoverAddMonths ArrayIndexOutOfBoundsException
  org.joda.time.chrono.TestISOChronology#testAddMonths ArrayIndexOutOfBoundsException
  org.joda.time.chrono.TestLenientChronology#test_setMonthOfYear ArrayIndexOutOfBoundsException

Tests run: 4156, Failures: 1, Errors: 21, Skipped: 0

[INFO] ------------------------------------------------------------------------
[INFO] BUILD FAILURE
[INFO] ------------------------------------------------------------------------
[INFO] Total time: 15.206s
[INFO] Finished at: Wed Aug 05 23:15:02 BST 2015
[INFO] Final Memory: 9M/213M
[INFO] ------------------------------------------------------------------------
[ERROR] Failed to execute goal org.apache.maven.plugins:maven-surefire-plugin:2.18.1:test (default-test) on project joda-time: There are test failures.
[ERROR] 
[ERROR] Please refer to /home/perham/Study/LittleDarwin/Cases/joda-time-2.8.1/target/surefire-reports for the individual test results.
[ERROR] -> [Help 1]
[ERROR] 
[ERROR] To see the full stack trace of the errors, re-run Maven with the -e switch.
[ERROR] Re-run Maven using the -X switch to enable full debug logging.
[ERROR] 
[ERROR] For more information about the errors and possible solutions, please read the following articles:
[ERROR] [Help 1] http://cwiki.apache.org/confluence/display/MAVEN/MojoFailureException
