[INFO] Scanning for projects...
[INFO]                                                                         
[INFO] ------------------------------------------------------------------------
[INFO] Building Joda-Time 2.8.1
[INFO] ------------------------------------------------------------------------
[INFO] 
[INFO] --- maven-resources-plugin:2.7:resources (default-resources) @ joda-time ---
[INFO] Using 'UTF-8' encoding to copy filtered resources.
[INFO] Copying 2 resources to META-INF
[INFO] Copying 10 resources
[INFO] 
[INFO] --- maven-compiler-plugin:3.3:compile (default-compile) @ joda-time ---
[INFO] Changes detected - recompiling the module!
[INFO] Compiling 166 source files to /home/perham/Study/LittleDarwin/Cases/joda-time-2.8.1/target/classes
[INFO] 
[INFO] --- exec-maven-plugin:1.4.0:java (compile-tzdb) @ joda-time ---
Writing zoneinfo files
*d* Error in Africa/Casablanca 2038-03-28T22:00:00.000Z
*d* Error in Africa/El_Aaiun 2038-03-28T22:00:00.000Z
*d* Error in Antarctica/Troll 2006-03-26T01:00:00.000Z
*d* Error in Asia/Baku 1998-03-29T00:00:00.000Z
*d* Error in Asia/Nicosia 1999-03-28T23:00:00.000Z
*r* Error in Asia/Jerusalem 2049-10-23T22:59:59.999Z != 2049-10-24T18:59:59.999Z
*d* Error in Asia/Hovd 2016-03-25T19:00:00.000Z
*d* Error in Asia/Ulaanbaatar 2016-03-25T18:00:00.000Z
*d* Error in Asia/Choibalsan 2016-03-25T18:00:00.000Z
*r* Error in Pacific/Auckland 2049-09-25T13:59:59.999Z != 2049-09-26T09:59:59.999Z
*r* Error in Pacific/Chatham 2049-09-25T13:59:59.999Z != 2049-09-26T08:29:59.999Z
*r* Error in Pacific/Apia 2049-09-25T13:59:59.999Z != 2049-09-26T07:59:59.999Z
*d* Error in Europe/London 1997-03-30T01:00:00.000Z
*d* Error in Europe/Dublin 1997-03-30T01:00:00.000Z
*d* Error in WET 1997-03-30T01:00:00.000Z
*d* Error in CET 1997-03-30T01:00:00.000Z
*d* Error in MET 1997-03-30T01:00:00.000Z
*d* Error in EET 1997-03-30T01:00:00.000Z
*d* Error in Europe/Tirane 1997-03-30T01:00:00.000Z
*d* Error in Europe/Andorra 1997-03-30T01:00:00.000Z
*d* Error in Europe/Vienna 1997-03-30T01:00:00.000Z
*d* Error in Europe/Brussels 1997-03-30T01:00:00.000Z
*d* Error in Europe/Sofia 1998-03-29T01:00:00.000Z
*d* Error in Europe/Prague 1997-03-30T01:00:00.000Z
*d* Error in Europe/Copenhagen 1997-03-30T01:00:00.000Z
*d* Error in Atlantic/Faroe 1997-03-30T01:00:00.000Z
*d* Error in America/Scoresbysund 1997-03-30T01:00:00.000Z
*d* Error in America/Godthab 1997-03-30T01:00:00.000Z
*d* Error in Europe/Tallinn 2003-03-30T01:00:00.000Z
*d* Error in Europe/Helsinki 1997-03-30T01:00:00.000Z
*d* Error in Europe/Paris 1997-03-30T01:00:00.000Z
*d* Error in Europe/Berlin 1997-03-30T01:00:00.000Z
*d* Error in Europe/Gibraltar 1997-03-30T01:00:00.000Z
*d* Error in Europe/Athens 1997-03-30T01:00:00.000Z
*d* Error in Europe/Budapest 1997-03-30T01:00:00.000Z
*d* Error in Europe/Rome 1997-03-30T01:00:00.000Z
*d* Error in Europe/Riga 2002-03-24T01:00:00.000Z
*d* Error in Europe/Vilnius 2004-03-28T01:00:00.000Z
*d* Error in Europe/Luxembourg 1997-03-30T01:00:00.000Z
*d* Error in Europe/Malta 1997-03-30T01:00:00.000Z
*d* Error in Europe/Chisinau 1998-03-29T01:00:00.000Z
*d* Error in Europe/Monaco 1997-03-30T01:00:00.000Z
*d* Error in Europe/Amsterdam 1997-03-30T01:00:00.000Z
*d* Error in Europe/Oslo 1997-03-30T01:00:00.000Z
*d* Error in Europe/Warsaw 1997-03-30T01:00:00.000Z
*d* Error in Europe/Lisbon 1997-03-30T23:00:00.000Z
*d* Error in Atlantic/Azores 1997-03-30T01:00:00.000Z
*d* Error in Atlantic/Madeira 1997-03-30T01:00:00.000Z
*d* Error in Europe/Bucharest 1998-03-29T01:00:00.000Z
*d* Error in Europe/Belgrade 1997-03-30T01:00:00.000Z
*d* Error in Europe/Madrid 1997-03-30T01:00:00.000Z
*d* Error in Africa/Ceuta 1997-03-30T01:00:00.000Z
*d* Error in Atlantic/Canary 1997-03-30T01:00:00.000Z
*d* Error in Europe/Stockholm 1997-03-30T01:00:00.000Z
*d* Error in Europe/Zurich 1997-03-30T01:00:00.000Z
*d* Error in Europe/Istanbul 2015-03-29T23:00:00.000Z
*d* Error in Europe/Kiev 1997-03-30T01:00:00.000Z
*d* Error in Europe/Uzhgorod 1997-03-30T01:00:00.000Z
*d* Error in Europe/Zaporozhye 1997-03-30T01:00:00.000Z
*r* Error in America/Merida 2048-10-25T06:59:59.999Z != 2048-10-26T02:59:59.999Z
*r* Error in America/Monterrey 2048-10-25T06:59:59.999Z != 2048-10-26T02:59:59.999Z
*r* Error in America/Mexico_City 2048-10-25T06:59:59.999Z != 2048-10-26T02:59:59.999Z
*r* Error in America/Chihuahua 2048-10-25T07:59:59.999Z != 2048-10-26T03:59:59.999Z
*r* Error in America/Mazatlan 2048-10-25T07:59:59.999Z != 2048-10-26T03:59:59.999Z
*r* Error in America/Bahia_Banderas 2048-10-25T06:59:59.999Z != 2048-10-26T02:59:59.999Z
*r* Error in America/Santa_Isabel 2048-10-25T08:59:59.999Z != 2048-10-26T04:59:59.999Z
Cannot find source zone 'Asia/Nicosia' to link alias 'Europe/Nicosia' to
Cannot find source zone 'Pacific/Auckland' to link alias 'Antarctica/McMurdo' to
Cannot find source zone 'Europe/London' to link alias 'Europe/Jersey' to
Cannot find source zone 'Europe/London' to link alias 'Europe/Guernsey' to
Cannot find source zone 'Europe/London' to link alias 'Europe/Isle_of_Man' to
Cannot find source zone 'Europe/Helsinki' to link alias 'Europe/Mariehamn' to
Cannot find source zone 'Europe/Zurich' to link alias 'Europe/Busingen' to
Cannot find source zone 'Europe/Rome' to link alias 'Europe/Vatican' to
Cannot find source zone 'Europe/Rome' to link alias 'Europe/San_Marino' to
Cannot find source zone 'Europe/Zurich' to link alias 'Europe/Vaduz' to
Cannot find source zone 'Europe/Oslo' to link alias 'Arctic/Longyearbyen' to
Cannot find source zone 'Europe/Belgrade' to link alias 'Europe/Ljubljana' to
Cannot find source zone 'Europe/Belgrade' to link alias 'Europe/Podgorica' to
Cannot find source zone 'Europe/Belgrade' to link alias 'Europe/Sarajevo' to
Cannot find source zone 'Europe/Belgrade' to link alias 'Europe/Skopje' to
Cannot find source zone 'Europe/Belgrade' to link alias 'Europe/Zagreb' to
Cannot find source zone 'Europe/Prague' to link alias 'Europe/Bratislava' to
Cannot find source zone 'Europe/Istanbul' to link alias 'Asia/Istanbul' to
Cannot find time zone 'Pacific/Auckland' to link alias 'Antarctica/South_Pole' to
Cannot find time zone 'Asia/Jerusalem' to link alias 'Asia/Tel_Aviv' to
Cannot find time zone 'Asia/Ulaanbaatar' to link alias 'Asia/Ulan_Bator' to
Cannot find time zone 'Atlantic/Faroe' to link alias 'Atlantic/Faeroe' to
Cannot find time zone 'Europe/Oslo' to link alias 'Atlantic/Jan_Mayen' to
Cannot find time zone 'Europe/Dublin' to link alias 'Eire' to
Cannot find time zone 'Europe/London' to link alias 'Europe/Belfast' to
Cannot find time zone 'Europe/Chisinau' to link alias 'Europe/Tiraspol' to
Cannot find time zone 'Europe/London' to link alias 'GB' to
Cannot find time zone 'Europe/London' to link alias 'GB-Eire' to
Cannot find time zone 'Asia/Jerusalem' to link alias 'Israel' to
Cannot find time zone 'America/Mazatlan' to link alias 'Mexico/BajaSur' to
Cannot find time zone 'America/Mexico_City' to link alias 'Mexico/General' to
Cannot find time zone 'Pacific/Auckland' to link alias 'NZ' to
Cannot find time zone 'Pacific/Chatham' to link alias 'NZ-CHAT' to
Cannot find time zone 'Europe/Warsaw' to link alias 'Poland' to
Cannot find time zone 'Europe/Lisbon' to link alias 'Portugal' to
Cannot find time zone 'Europe/Istanbul' to link alias 'Turkey' to
Writing ZoneInfoMap
[INFO] 
[INFO] --- maven-resources-plugin:2.7:testResources (default-testResources) @ joda-time ---
[INFO] Using 'UTF-8' encoding to copy filtered resources.
[INFO] Copying 34 resources
[INFO] 
[INFO] --- maven-compiler-plugin:3.3:testCompile (default-testCompile) @ joda-time ---
[INFO] Nothing to compile - all classes are up to date
[INFO] 
[INFO] --- maven-surefire-plugin:2.18.1:test (default-test) @ joda-time ---
[INFO] Surefire report directory: /home/perham/Study/LittleDarwin/Cases/joda-time-2.8.1/target/surefire-reports

-------------------------------------------------------
 T E S T S
-------------------------------------------------------
Running org.joda.time.TestAllPackages

Results :

Tests run: 0, Failures: 0, Errors: 0, Skipped: 0

[INFO] ------------------------------------------------------------------------
[INFO] BUILD FAILURE
[INFO] ------------------------------------------------------------------------
[INFO] Total time: 10.203s
[INFO] Finished at: Wed Aug 05 23:14:45 BST 2015
[INFO] Final Memory: 9M/213M
[INFO] ------------------------------------------------------------------------
[ERROR] Failed to execute goal org.apache.maven.plugins:maven-surefire-plugin:2.18.1:test (default-test) on project joda-time: Execution default-test of goal org.apache.maven.plugins:maven-surefire-plugin:2.18.1:test failed: There was an error in the forked process
[ERROR] org.apache.maven.surefire.testset.TestSetFailedException: org.joda.time.TestAllPackages
[ERROR] at org.apache.maven.surefire.junit.JUnitTestSet.execute(JUnitTestSet.java:115)
[ERROR] at org.apache.maven.surefire.junit.JUnit3Provider.executeTestSet(JUnit3Provider.java:130)
[ERROR] at org.apache.maven.surefire.junit.JUnit3Provider.invoke(JUnit3Provider.java:107)
[ERROR] at org.apache.maven.surefire.booter.ForkedBooter.invokeProviderInSameClassLoader(ForkedBooter.java:203)
[ERROR] at org.apache.maven.surefire.booter.ForkedBooter.runSuitesInProcess(ForkedBooter.java:155)
[ERROR] at org.apache.maven.surefire.booter.ForkedBooter.main(ForkedBooter.java:103)
[ERROR] Caused by: java.lang.ExceptionInInitializerError
[ERROR] at org.joda.time.TestAll.suite(TestAll.java:37)
[ERROR] at org.joda.time.TestAllPackages.suite(TestAllPackages.java:36)
[ERROR] at sun.reflect.NativeMethodAccessorImpl.invoke0(Native Method)
[ERROR] at sun.reflect.NativeMethodAccessorImpl.invoke(NativeMethodAccessorImpl.java:57)
[ERROR] at sun.reflect.DelegatingMethodAccessorImpl.invoke(DelegatingMethodAccessorImpl.java:43)
[ERROR] at java.lang.reflect.Method.invoke(Method.java:606)
[ERROR] at org.apache.maven.surefire.common.junit3.JUnit3Reflector.createInstanceFromSuiteMethod(JUnit3Reflector.java:159)
[ERROR] at org.apache.maven.surefire.common.junit3.JUnit3Reflector.constructTestObject(JUnit3Reflector.java:124)
[ERROR] at org.apache.maven.surefire.junit.JUnitTestSet.execute(JUnitTestSet.java:74)
[ERROR] ... 5 more
[ERROR] Caused by: java.lang.IllegalArgumentException: The datetime zone id 'Europe/London' is not recognised
[ERROR] at org.joda.time.DateTimeZone.forID(DateTimeZone.java:229)
[ERROR] at org.joda.time.TestChronology.<clinit>(TestChronology.java:47)
[ERROR] ... 14 more
[ERROR] -> [Help 1]
[ERROR] 
[ERROR] To see the full stack trace of the errors, re-run Maven with the -e switch.
[ERROR] Re-run Maven using the -X switch to enable full debug logging.
[ERROR] 
[ERROR] For more information about the errors and possible solutions, please read the following articles:
[ERROR] [Help 1] http://cwiki.apache.org/confluence/display/MAVEN/PluginExecutionException
