[INFO] Scanning for projects...
[INFO]                                                                         
[INFO] ------------------------------------------------------------------------
[INFO] Building Joda-Time 2.8.1
[INFO] ------------------------------------------------------------------------
[INFO] 
[INFO] --- maven-resources-plugin:2.7:resources (default-resources) @ joda-time ---
[INFO] Using 'UTF-8' encoding to copy filtered resources.
[INFO] Copying 2 resources to META-INF
[INFO] Copying 10 resources
[INFO] 
[INFO] --- maven-compiler-plugin:3.3:compile (default-compile) @ joda-time ---
[INFO] Changes detected - recompiling the module!
[INFO] Compiling 166 source files to /home/perham/Study/LittleDarwin/Cases/joda-time-2.8.1/target/classes
[INFO] 
[INFO] --- exec-maven-plugin:1.4.0:java (compile-tzdb) @ joda-time ---
Writing zoneinfo files
Writing ZoneInfoMap
[INFO] 
[INFO] --- maven-resources-plugin:2.7:testResources (default-testResources) @ joda-time ---
[INFO] Using 'UTF-8' encoding to copy filtered resources.
[INFO] Copying 34 resources
[INFO] 
[INFO] --- maven-compiler-plugin:3.3:testCompile (default-testCompile) @ joda-time ---
[INFO] Nothing to compile - all classes are up to date
[INFO] 
[INFO] --- maven-surefire-plugin:2.18.1:test (default-test) @ joda-time ---
[INFO] Surefire report directory: /home/perham/Study/LittleDarwin/Cases/joda-time-2.8.1/target/surefire-reports

-------------------------------------------------------
 T E S T S
-------------------------------------------------------
Running org.joda.time.TestAllPackages

TestBuddhistChronology.testCalendar

TestCopticChronology.testCalendar

TestEthiopicChronology.testCalendar

TestIslamicChronology.testCalendar

Testing Gregorian chronology over 1000 iterations
100% complete (i=1000)

Testing Julian chronology over 1000 iterations
100% complete (i=1000)
Writing zoneinfo files
Writing ZoneInfoMap
Tests run: 4157, Failures: 6, Errors: 15, Skipped: 0, Time elapsed: 5.254 sec <<< FAILURE! - in org.joda.time.TestAllPackages
testPlusMonths_int_negativeEndOfMonthAdjust(org.joda.time.TestMonthDay_Basics)  Time elapsed: 0.005 sec  <<< FAILURE!
junit.framework.AssertionFailedError: expected:<--02-29> but was:<--02-30>
	at junit.framework.Assert.fail(Assert.java:47)
	at junit.framework.Assert.failNotEquals(Assert.java:280)
	at junit.framework.Assert.assertEquals(Assert.java:64)
	at junit.framework.Assert.assertEquals(Assert.java:71)
	at org.joda.time.TestMonthDay_Basics.testPlusMonths_int_negativeEndOfMonthAdjust(TestMonthDay_Basics.java:476)

testPlusMonths_int_adjust(org.joda.time.TestMonthDay_Basics)  Time elapsed: 0 sec  <<< ERROR!
org.joda.time.IllegalFieldValueException: Value 31 for dayOfMonth must not be larger than 30
	at org.joda.time.chrono.BaseChronology.validate(BaseChronology.java:208)
	at org.joda.time.base.BasePartial.<init>(BasePartial.java:183)
	at org.joda.time.MonthDay.<init>(MonthDay.java:352)
	at org.joda.time.TestMonthDay_Basics.testPlusMonths_int_adjust(TestMonthDay_Basics.java:493)

testPlusDays_int_wrapMonth(org.joda.time.TestMonthDay_Basics)  Time elapsed: 0 sec  <<< ERROR!
java.lang.ArrayIndexOutOfBoundsException: 12
	at org.joda.time.chrono.BasicGJChronology.getDaysInMonthMax(BasicGJChronology.java:35)
	at org.joda.time.chrono.BasicDayOfMonthDateTimeField.getMaximumValue(BasicDayOfMonthDateTimeField.java:90)
	at org.joda.time.chrono.BaseChronology.validate(BaseChronology.java:207)
	at org.joda.time.base.BasePartial.<init>(BasePartial.java:183)
	at org.joda.time.MonthDay.<init>(MonthDay.java:352)
	at org.joda.time.TestMonthDay_Basics.testPlusDays_int_wrapMonth(TestMonthDay_Basics.java:508)

testPlusDays_int_wrapMonthTwice(org.joda.time.TestMonthDay_Basics)  Time elapsed: 0.001 sec  <<< ERROR!
java.lang.ArrayIndexOutOfBoundsException: 12
	at org.joda.time.chrono.BasicGJChronology.getDaysInMonthMax(BasicGJChronology.java:35)
	at org.joda.time.chrono.BasicDayOfMonthDateTimeField.getMaximumValue(BasicDayOfMonthDateTimeField.java:90)
	at org.joda.time.field.BaseDateTimeField.set(BaseDateTimeField.java:591)
	at org.joda.time.chrono.BasicMonthOfYearDateTimeField.add(BasicMonthOfYearDateTimeField.java:214)
	at org.joda.time.field.BaseDateTimeField.add(BaseDateTimeField.java:324)
	at org.joda.time.MonthDay.withFieldAdded(MonthDay.java:519)
	at org.joda.time.MonthDay.plusDays(MonthDay.java:615)
	at org.joda.time.TestMonthDay_Basics.testPlusDays_int_wrapMonthTwice(TestMonthDay_Basics.java:516)

testPlusDays_int_wrapMonthIntoNextYear(org.joda.time.TestMonthDay_Basics)  Time elapsed: 0.001 sec  <<< ERROR!
java.lang.ArrayIndexOutOfBoundsException: 13
	at org.joda.time.chrono.BasicGJChronology.getDaysInMonthMax(BasicGJChronology.java:35)
	at org.joda.time.chrono.BasicDayOfMonthDateTimeField.getMaximumValue(BasicDayOfMonthDateTimeField.java:90)
	at org.joda.time.chrono.BaseChronology.validate(BaseChronology.java:207)
	at org.joda.time.base.BasePartial.<init>(BasePartial.java:183)
	at org.joda.time.MonthDay.<init>(MonthDay.java:352)
	at org.joda.time.TestMonthDay_Basics.testPlusDays_int_wrapMonthIntoNextYear(TestMonthDay_Basics.java:522)

testPlusDays_int_wrapMonthTwiceIntoNextYear(org.joda.time.TestMonthDay_Basics)  Time elapsed: 0.001 sec  <<< ERROR!
java.lang.ArrayIndexOutOfBoundsException: 12
	at org.joda.time.chrono.BasicGJChronology.getDaysInMonthMax(BasicGJChronology.java:35)
	at org.joda.time.chrono.BasicDayOfMonthDateTimeField.getMaximumValue(BasicDayOfMonthDateTimeField.java:90)
	at org.joda.time.chrono.BaseChronology.validate(BaseChronology.java:207)
	at org.joda.time.base.BasePartial.<init>(BasePartial.java:183)
	at org.joda.time.MonthDay.<init>(MonthDay.java:352)
	at org.joda.time.TestMonthDay_Basics.testPlusDays_int_wrapMonthTwiceIntoNextYear(TestMonthDay_Basics.java:529)

testPlusDays_int_wrap50(org.joda.time.TestMonthDay_Basics)  Time elapsed: 0.001 sec  <<< FAILURE!
junit.framework.AssertionFailedError: expected:<--07-04> but was:<--07-03>
	at junit.framework.Assert.fail(Assert.java:47)
	at junit.framework.Assert.failNotEquals(Assert.java:280)
	at junit.framework.Assert.assertEquals(Assert.java:64)
	at junit.framework.Assert.assertEquals(Assert.java:71)
	at org.joda.time.TestMonthDay_Basics.testPlusDays_int_wrap50(TestMonthDay_Basics.java:539)

testPlusDays_int_fromLeap(org.joda.time.TestMonthDay_Basics)  Time elapsed: 0.001 sec  <<< FAILURE!
junit.framework.AssertionFailedError: expected:<--03-01> but was:<--02-30>
	at junit.framework.Assert.fail(Assert.java:47)
	at junit.framework.Assert.failNotEquals(Assert.java:280)
	at junit.framework.Assert.assertEquals(Assert.java:64)
	at junit.framework.Assert.assertEquals(Assert.java:71)
	at org.joda.time.TestMonthDay_Basics.testPlusDays_int_fromLeap(TestMonthDay_Basics.java:553)

testMinusMonths_int_endOfMonthAdjust(org.joda.time.TestMonthDay_Basics)  Time elapsed: 0.001 sec  <<< FAILURE!
junit.framework.AssertionFailedError: expected:<--02-29> but was:<--02-30>
	at junit.framework.Assert.fail(Assert.java:47)
	at junit.framework.Assert.failNotEquals(Assert.java:280)
	at junit.framework.Assert.assertEquals(Assert.java:64)
	at junit.framework.Assert.assertEquals(Assert.java:71)
	at org.joda.time.TestMonthDay_Basics.testMinusMonths_int_endOfMonthAdjust(TestMonthDay_Basics.java:605)

testMinusMonths_int_adjust(org.joda.time.TestMonthDay_Basics)  Time elapsed: 0.001 sec  <<< ERROR!
org.joda.time.IllegalFieldValueException: Value 31 for dayOfMonth must not be larger than 30
	at org.joda.time.chrono.BaseChronology.validate(BaseChronology.java:208)
	at org.joda.time.base.BasePartial.<init>(BasePartial.java:183)
	at org.joda.time.MonthDay.<init>(MonthDay.java:352)
	at org.joda.time.TestMonthDay_Basics.testMinusMonths_int_adjust(TestMonthDay_Basics.java:629)

testMinusDays_int_wrapMonth(org.joda.time.TestMonthDay_Basics)  Time elapsed: 0 sec  <<< ERROR!
java.lang.ArrayIndexOutOfBoundsException: 13
	at org.joda.time.chrono.BasicGJChronology.getDaysInMonthMax(BasicGJChronology.java:35)
	at org.joda.time.chrono.BasicDayOfMonthDateTimeField.getMaximumValue(BasicDayOfMonthDateTimeField.java:90)
	at org.joda.time.chrono.BaseChronology.validate(BaseChronology.java:207)
	at org.joda.time.base.BasePartial.<init>(BasePartial.java:183)
	at org.joda.time.MonthDay.<init>(MonthDay.java:352)
	at org.joda.time.TestMonthDay_Basics.testMinusDays_int_wrapMonth(TestMonthDay_Basics.java:644)

testMinusDays_int_wrapMonthTwice(org.joda.time.TestMonthDay_Basics)  Time elapsed: 0.001 sec  <<< ERROR!
java.lang.ArrayIndexOutOfBoundsException: 13
	at org.joda.time.chrono.BasicGJChronology.getDaysInMonthMax(BasicGJChronology.java:35)
	at org.joda.time.chrono.BasicDayOfMonthDateTimeField.getMaximumValue(BasicDayOfMonthDateTimeField.java:90)
	at org.joda.time.chrono.BaseChronology.validate(BaseChronology.java:207)
	at org.joda.time.base.BasePartial.<init>(BasePartial.java:183)
	at org.joda.time.MonthDay.<init>(MonthDay.java:352)
	at org.joda.time.TestMonthDay_Basics.testMinusDays_int_wrapMonthTwice(TestMonthDay_Basics.java:651)

testMinusDays_int_wrapMonthIntoLastYear(org.joda.time.TestMonthDay_Basics)  Time elapsed: 0 sec  <<< ERROR!
java.lang.ArrayIndexOutOfBoundsException: 13
	at org.joda.time.chrono.BasicGJChronology.getDaysInMonthMax(BasicGJChronology.java:35)
	at org.joda.time.chrono.BasicDayOfMonthDateTimeField.getMaximumValue(BasicDayOfMonthDateTimeField.java:90)
	at org.joda.time.field.BaseDateTimeField.set(BaseDateTimeField.java:591)
	at org.joda.time.chrono.BasicMonthOfYearDateTimeField.add(BasicMonthOfYearDateTimeField.java:214)
	at org.joda.time.field.BaseDateTimeField.add(BaseDateTimeField.java:344)
	at org.joda.time.MonthDay.withFieldAdded(MonthDay.java:519)
	at org.joda.time.MonthDay.minusDays(MonthDay.java:675)
	at org.joda.time.TestMonthDay_Basics.testMinusDays_int_wrapMonthIntoLastYear(TestMonthDay_Basics.java:659)

testMinusDays_int_wrapMonthTwiceIntoLastYear(org.joda.time.TestMonthDay_Basics)  Time elapsed: 0.001 sec  <<< ERROR!
java.lang.ArrayIndexOutOfBoundsException: 13
	at org.joda.time.chrono.BasicGJChronology.getDaysInMonthMax(BasicGJChronology.java:35)
	at org.joda.time.chrono.BasicDayOfMonthDateTimeField.getMaximumValue(BasicDayOfMonthDateTimeField.java:90)
	at org.joda.time.field.BaseDateTimeField.set(BaseDateTimeField.java:591)
	at org.joda.time.chrono.BasicMonthOfYearDateTimeField.add(BasicMonthOfYearDateTimeField.java:214)
	at org.joda.time.field.BaseDateTimeField.add(BaseDateTimeField.java:344)
	at org.joda.time.MonthDay.withFieldAdded(MonthDay.java:519)
	at org.joda.time.MonthDay.minusDays(MonthDay.java:675)
	at org.joda.time.TestMonthDay_Basics.testMinusDays_int_wrapMonthTwiceIntoLastYear(TestMonthDay_Basics.java:666)

testMinusDays_int_toLeap(org.joda.time.TestMonthDay_Basics)  Time elapsed: 0 sec  <<< FAILURE!
junit.framework.AssertionFailedError: expected:<--02-29> but was:<--02-30>
	at junit.framework.Assert.fail(Assert.java:47)
	at junit.framework.Assert.failNotEquals(Assert.java:280)
	at junit.framework.Assert.assertEquals(Assert.java:64)
	at junit.framework.Assert.assertEquals(Assert.java:71)
	at org.joda.time.TestMonthDay_Basics.testMinusDays_int_toLeap(TestMonthDay_Basics.java:675)

testMinusDays_int_negativeFromLeap(org.joda.time.TestMonthDay_Basics)  Time elapsed: 0 sec  <<< FAILURE!
junit.framework.AssertionFailedError: expected:<--03-01> but was:<--02-30>
	at junit.framework.Assert.fail(Assert.java:47)
	at junit.framework.Assert.failNotEquals(Assert.java:280)
	at junit.framework.Assert.assertEquals(Assert.java:64)
	at junit.framework.Assert.assertEquals(Assert.java:71)
	at org.joda.time.TestMonthDay_Basics.testMinusDays_int_negativeFromLeap(TestMonthDay_Basics.java:689)

testPropertySetMonthOfYear(org.joda.time.TestMonthDay_Properties)  Time elapsed: 0.001 sec  <<< ERROR!
java.lang.ArrayIndexOutOfBoundsException: 13
	at org.joda.time.chrono.BasicGJChronology.getDaysInMonthMax(BasicGJChronology.java:35)
	at org.joda.time.chrono.BasicDayOfMonthDateTimeField.getMaximumValue(BasicDayOfMonthDateTimeField.java:90)
	at org.joda.time.field.BaseDateTimeField.set(BaseDateTimeField.java:591)
	at org.joda.time.MonthDay$Property.setCopy(MonthDay.java:941)
	at org.joda.time.TestMonthDay_Properties.testPropertySetMonthOfYear(TestMonthDay_Properties.java:141)

testPropertySetTextMonthOfYear(org.joda.time.TestMonthDay_Properties)  Time elapsed: 0 sec  <<< ERROR!
java.lang.ArrayIndexOutOfBoundsException: 13
	at org.joda.time.chrono.BasicGJChronology.getDaysInMonthMax(BasicGJChronology.java:35)
	at org.joda.time.chrono.BasicDayOfMonthDateTimeField.getMaximumValue(BasicDayOfMonthDateTimeField.java:90)
	at org.joda.time.field.BaseDateTimeField.set(BaseDateTimeField.java:591)
	at org.joda.time.field.BaseDateTimeField.set(BaseDateTimeField.java:655)
	at org.joda.time.MonthDay$Property.setCopy(MonthDay.java:958)
	at org.joda.time.MonthDay$Property.setCopy(MonthDay.java:973)
	at org.joda.time.TestMonthDay_Properties.testPropertySetTextMonthOfYear(TestMonthDay_Properties.java:148)

testPropertyAddMonthOfYear(org.joda.time.TestMonthDay_Properties)  Time elapsed: 0 sec  <<< ERROR!
java.lang.ArrayIndexOutOfBoundsException: 13
	at org.joda.time.chrono.BasicGJChronology.getDaysInMonthMax(BasicGJChronology.java:35)
	at org.joda.time.chrono.BasicDayOfMonthDateTimeField.getMaximumValue(BasicDayOfMonthDateTimeField.java:90)
	at org.joda.time.field.BaseDateTimeField.set(BaseDateTimeField.java:591)
	at org.joda.time.chrono.BasicMonthOfYearDateTimeField.add(BasicMonthOfYearDateTimeField.java:214)
	at org.joda.time.MonthDay$Property.addToCopy(MonthDay.java:900)
	at org.joda.time.TestMonthDay_Properties.testPropertyAddMonthOfYear(TestMonthDay_Properties.java:109)

testPropertyAddWrapFieldMonthOfYear(org.joda.time.TestMonthDay_Properties)  Time elapsed: 0.001 sec  <<< ERROR!
java.lang.ArrayIndexOutOfBoundsException: 12
	at org.joda.time.chrono.BasicGJChronology.getDaysInMonthMax(BasicGJChronology.java:35)
	at org.joda.time.chrono.BasicDayOfMonthDateTimeField.getMaximumValue(BasicDayOfMonthDateTimeField.java:90)
	at org.joda.time.field.BaseDateTimeField.set(BaseDateTimeField.java:591)
	at org.joda.time.field.BaseDateTimeField.addWrapField(BaseDateTimeField.java:498)
	at org.joda.time.MonthDay$Property.addWrapFieldToCopy(MonthDay.java:924)
	at org.joda.time.TestMonthDay_Properties.testPropertyAddWrapFieldMonthOfYear(TestMonthDay_Properties.java:132)

testPropertyEquals(org.joda.time.TestMonthDay_Properties)  Time elapsed: 0.001 sec  <<< ERROR!
java.lang.ArrayIndexOutOfBoundsException: 12
	at org.joda.time.chrono.BasicGJChronology.getDaysInMonthMax(BasicGJChronology.java:35)
	at org.joda.time.chrono.BasicDayOfMonthDateTimeField.getMaximumValue(BasicDayOfMonthDateTimeField.java:90)
	at org.joda.time.chrono.BaseChronology.validate(BaseChronology.java:207)
	at org.joda.time.base.BasePartial.<init>(BasePartial.java:183)
	at org.joda.time.MonthDay.<init>(MonthDay.java:352)
	at org.joda.time.MonthDay.<init>(MonthDay.java:334)
	at org.joda.time.TestMonthDay_Properties.testPropertyEquals(TestMonthDay_Properties.java:290)


Results :

Failed tests: 
  org.joda.time.TestMonthDay_Basics#testMinusDays_int_negativeFromLeap AssertionFailedError
  org.joda.time.TestMonthDay_Basics#testMinusDays_int_toLeap AssertionFailedError
  org.joda.time.TestMonthDay_Basics#testMinusMonths_int_endOfMonthAdjust AssertionFailedError
  org.joda.time.TestMonthDay_Basics#testPlusDays_int_fromLeap AssertionFailedError
  org.joda.time.TestMonthDay_Basics#testPlusDays_int_wrap50 AssertionFailedError
  org.joda.time.TestMonthDay_Basics#testPlusMonths_int_negativeEndOfMonthAdjust AssertionFailedError
Tests in error: 
  org.joda.time.TestMonthDay_Basics#testMinusDays_int_wrapMonth ArrayIndexOutOfBoundsException
  org.joda.time.TestMonthDay_Basics#testMinusDays_int_wrapMonthIntoLastYear ArrayIndexOutOfBoundsException
  org.joda.time.TestMonthDay_Basics#testMinusDays_int_wrapMonthTwice ArrayIndexOutOfBoundsException
  org.joda.time.TestMonthDay_Basics#testMinusDays_int_wrapMonthTwiceIntoLastYear ArrayIndexOutOfBoundsException
  org.joda.time.TestMonthDay_Basics#testMinusMonths_int_adjust IllegalFieldValueException
  org.joda.time.TestMonthDay_Basics#testPlusDays_int_wrapMonth ArrayIndexOutOfBoundsException
  org.joda.time.TestMonthDay_Basics#testPlusDays_int_wrapMonthIntoNextYear ArrayIndexOutOfBoundsException
  org.joda.time.TestMonthDay_Basics#testPlusDays_int_wrapMonthTwice ArrayIndexOutOfBoundsException
  org.joda.time.TestMonthDay_Basics#testPlusDays_int_wrapMonthTwiceIntoNextYear ArrayIndexOutOfBoundsException
  org.joda.time.TestMonthDay_Basics#testPlusMonths_int_adjust IllegalFieldValueException
  org.joda.time.TestMonthDay_Properties#testPropertyAddMonthOfYear ArrayIndexOutOfBoundsException
  org.joda.time.TestMonthDay_Properties#testPropertyAddWrapFieldMonthOfYear ArrayIndexOutOfBoundsException
  org.joda.time.TestMonthDay_Properties#testPropertyEquals ArrayIndexOutOfBoundsException
  org.joda.time.TestMonthDay_Properties#testPropertySetMonthOfYear ArrayIndexOutOfBoundsException
  org.joda.time.TestMonthDay_Properties#testPropertySetTextMonthOfYear ArrayIndexOutOfBoundsException

Tests run: 4157, Failures: 6, Errors: 15, Skipped: 0

[INFO] ------------------------------------------------------------------------
[INFO] BUILD FAILURE
[INFO] ------------------------------------------------------------------------
[INFO] Total time: 15.585s
[INFO] Finished at: Wed Aug 05 22:43:11 BST 2015
[INFO] Final Memory: 9M/213M
[INFO] ------------------------------------------------------------------------
[ERROR] Failed to execute goal org.apache.maven.plugins:maven-surefire-plugin:2.18.1:test (default-test) on project joda-time: There are test failures.
[ERROR] 
[ERROR] Please refer to /home/perham/Study/LittleDarwin/Cases/joda-time-2.8.1/target/surefire-reports for the individual test results.
[ERROR] -> [Help 1]
[ERROR] 
[ERROR] To see the full stack trace of the errors, re-run Maven with the -e switch.
[ERROR] Re-run Maven using the -X switch to enable full debug logging.
[ERROR] 
[ERROR] For more information about the errors and possible solutions, please read the following articles:
[ERROR] [Help 1] http://cwiki.apache.org/confluence/display/MAVEN/MojoFailureException
