[INFO] Scanning for projects...
[INFO]                                                                         
[INFO] ------------------------------------------------------------------------
[INFO] Building Joda-Time 2.8.1
[INFO] ------------------------------------------------------------------------
[INFO] 
[INFO] --- maven-resources-plugin:2.7:resources (default-resources) @ joda-time ---
[INFO] Using 'UTF-8' encoding to copy filtered resources.
[INFO] Copying 2 resources to META-INF
[INFO] Copying 10 resources
[INFO] 
[INFO] --- maven-compiler-plugin:3.3:compile (default-compile) @ joda-time ---
[INFO] Changes detected - recompiling the module!
[INFO] Compiling 166 source files to /home/perham/Study/LittleDarwin/Cases/joda-time-2.8.1/target/classes
[INFO] 
[INFO] --- exec-maven-plugin:1.4.0:java (compile-tzdb) @ joda-time ---
Writing zoneinfo files
*d* Error in Africa/Windhoek 1996-03-03T00:00:00.000Z
*d* Error in Asia/Amman 2016-09-29T22:00:00.000Z
*d* Error in Asia/Gaza 2020-09-24T21:00:00.000Z
*d* Error in Asia/Hebron 2020-09-24T21:00:00.000Z
*d* Error in Australia/Adelaide 2012-03-03T16:30:00.000Z
*d* Error in Australia/Hobart 2008-05-03T16:00:00.000Z
*d* Error in Australia/Currie 2008-05-03T16:00:00.000Z
*d* Error in Australia/Melbourne 2012-03-03T16:00:00.000Z
*d* Error in Australia/Sydney 2012-03-03T16:00:00.000Z
*d* Error in Australia/Broken_Hill 2012-03-03T16:30:00.000Z
*d* Error in Australia/Lord_Howe 2012-03-03T15:00:00.000Z
*d* Error in Pacific/Auckland 2008-05-03T14:00:00.000Z
*d* Error in Pacific/Chatham 2008-05-03T14:00:00.000Z
*d* Error in Pacific/Apia 2016-03-05T14:00:00.000Z
*d* Error in America/Merida 2004-03-07T08:00:00.000Z
*d* Error in America/Monterrey 2004-03-07T08:00:00.000Z
*d* Error in America/Mexico_City 2004-03-07T08:00:00.000Z
*d* Error in America/Chihuahua 2004-03-07T09:00:00.000Z
*d* Error in America/Mazatlan 2004-03-07T09:00:00.000Z
*d* Error in America/Bahia_Banderas 2012-03-04T08:00:00.000Z
*d* Error in America/Santa_Isabel 2004-03-07T10:00:00.000Z
Cannot find source zone 'Pacific/Auckland' to link alias 'Antarctica/McMurdo' to
Cannot find time zone 'Pacific/Auckland' to link alias 'Antarctica/South_Pole' to
Cannot find time zone 'Australia/Sydney' to link alias 'Australia/ACT' to
Cannot find time zone 'Australia/Sydney' to link alias 'Australia/Canberra' to
Cannot find time zone 'Australia/Lord_Howe' to link alias 'Australia/LHI' to
Cannot find time zone 'Australia/Sydney' to link alias 'Australia/NSW' to
Cannot find time zone 'Australia/Adelaide' to link alias 'Australia/South' to
Cannot find time zone 'Australia/Hobart' to link alias 'Australia/Tasmania' to
Cannot find time zone 'Australia/Melbourne' to link alias 'Australia/Victoria' to
Cannot find time zone 'Australia/Broken_Hill' to link alias 'Australia/Yancowinna' to
Cannot find time zone 'America/Mazatlan' to link alias 'Mexico/BajaSur' to
Cannot find time zone 'America/Mexico_City' to link alias 'Mexico/General' to
Cannot find time zone 'Pacific/Auckland' to link alias 'NZ' to
Cannot find time zone 'Pacific/Chatham' to link alias 'NZ-CHAT' to
Writing ZoneInfoMap
[INFO] 
[INFO] --- maven-resources-plugin:2.7:testResources (default-testResources) @ joda-time ---
[INFO] Using 'UTF-8' encoding to copy filtered resources.
[INFO] Copying 34 resources
[INFO] 
[INFO] --- maven-compiler-plugin:3.3:testCompile (default-testCompile) @ joda-time ---
[INFO] Nothing to compile - all classes are up to date
[INFO] 
[INFO] --- maven-surefire-plugin:2.18.1:test (default-test) @ joda-time ---
[INFO] Surefire report directory: /home/perham/Study/LittleDarwin/Cases/joda-time-2.8.1/target/surefire-reports

-------------------------------------------------------
 T E S T S
-------------------------------------------------------
Running org.joda.time.TestAllPackages

TestBuddhistChronology.testCalendar

TestCopticChronology.testCalendar

TestEthiopicChronology.testCalendar

TestIslamicChronology.testCalendar

Testing Gregorian chronology over 1000 iterations
Failure on monthOfYear.get
org.joda.time.chrono.gj.TestGJMonthOfYearField
	vs. org.joda.time.chrono.GJMonthOfYearDateTimeField
Datetime: Wed 3440-05--07T10:51:52.538Z / 3440-W17-3
Millis from 1970: 46398394312538
4 != 5
Failure index: 26
Test millis: 46398394312538
Test value: -57
Test millis2: 43600755073697

Testing Julian chronology over 1000 iterations
Failure on monthOfYear.getDifference
org.joda.time.chrono.gj.TestJulianMonthOfYearField
	vs. org.joda.time.chrono.GJMonthOfYearDateTimeField
Datetime: Thu -0270-02-12T08:14:48.741Z / -270-W7-4
Millis from 1970: -70652706311259
15442 != 15441
Test datetime 2: Wed -1557-05--23T04:14:03.445Z / -1557-W14-3
Failure index: 10
Test millis: -70652706311259
Test value: -57
Test millis2: -111262707956555
Writing zoneinfo files
*d* Error in America/Los_Angeles 1988-03-06T10:00:00.000Z
Writing ZoneInfoMap
Tests run: 4157, Failures: 19, Errors: 14, Skipped: 0, Time elapsed: 4.559 sec <<< FAILURE! - in org.joda.time.TestAllPackages
testPropertyWithMinimumValueMillisOfDayDSTGap(org.joda.time.TestDateTime_Properties)  Time elapsed: 0.004 sec  <<< ERROR!
java.lang.IllegalArgumentException: The datetime zone id 'Asia/Gaza' is not recognised
	at org.joda.time.DateTimeZone.forID(DateTimeZone.java:229)
	at org.joda.time.TestDateTime_Properties.testPropertyWithMinimumValueMillisOfDayDSTGap(TestDateTime_Properties.java:662)

testPropertyAddMonthOfYear(org.joda.time.TestDateTime_Properties)  Time elapsed: 0.002 sec  <<< FAILURE!
junit.framework.ComparisonFailure: expected:<2004-0[4-3]0T00:00:00.000+01:00> but was:<2004-0[5-0]0T00:00:00.000+01:00>
	at junit.framework.Assert.assertEquals(Assert.java:81)
	at junit.framework.Assert.assertEquals(Assert.java:87)
	at org.joda.time.TestDateTime_Properties.testPropertyAddMonthOfYear(TestDateTime_Properties.java:421)

testPropertyAddWrapFieldMonthOfYear(org.joda.time.TestDateTime_Properties)  Time elapsed: 0.003 sec  <<< FAILURE!
junit.framework.ComparisonFailure: expected:<2004-0[4-3]0T00:00:00.000+01:00> but was:<2004-0[5-0]0T00:00:00.000+01:00>
	at junit.framework.Assert.assertEquals(Assert.java:81)
	at junit.framework.Assert.assertEquals(Assert.java:87)
	at org.joda.time.TestDateTime_Properties.testPropertyAddWrapFieldMonthOfYear(TestDateTime_Properties.java:449)

testConstructor_ObjectString3(org.joda.time.TestLocalDateTime_Constructors)  Time elapsed: 0 sec  <<< FAILURE!
junit.framework.AssertionFailedError: expected:<4> but was:<5>
	at junit.framework.Assert.fail(Assert.java:47)
	at junit.framework.Assert.failNotEquals(Assert.java:280)
	at junit.framework.Assert.assertEquals(Assert.java:64)
	at junit.framework.Assert.assertEquals(Assert.java:198)
	at junit.framework.Assert.assertEquals(Assert.java:204)
	at org.joda.time.TestLocalDateTime_Constructors.testConstructor_ObjectString3(TestLocalDateTime_Constructors.java:407)

testConstructor_ObjectString4(org.joda.time.TestLocalDateTime_Constructors)  Time elapsed: 0.001 sec  <<< FAILURE!
junit.framework.AssertionFailedError: expected:<4> but was:<5>
	at junit.framework.Assert.fail(Assert.java:47)
	at junit.framework.Assert.failNotEquals(Assert.java:280)
	at junit.framework.Assert.assertEquals(Assert.java:64)
	at junit.framework.Assert.assertEquals(Assert.java:198)
	at junit.framework.Assert.assertEquals(Assert.java:204)
	at org.joda.time.TestLocalDateTime_Constructors.testConstructor_ObjectString4(TestLocalDateTime_Constructors.java:419)

testConstructor_ObjectString1(org.joda.time.TestLocalDateTime_Constructors)  Time elapsed: 0.001 sec  <<< FAILURE!
junit.framework.AssertionFailedError: expected:<4> but was:<5>
	at junit.framework.Assert.fail(Assert.java:47)
	at junit.framework.Assert.failNotEquals(Assert.java:280)
	at junit.framework.Assert.assertEquals(Assert.java:64)
	at junit.framework.Assert.assertEquals(Assert.java:198)
	at junit.framework.Assert.assertEquals(Assert.java:204)
	at org.joda.time.TestLocalDateTime_Constructors.testConstructor_ObjectString1(TestLocalDateTime_Constructors.java:383)

testPropertyAddToCopyMonth(org.joda.time.TestLocalDateTime_Properties)  Time elapsed: 0.001 sec  <<< FAILURE!
junit.framework.AssertionFailedError: expected:<4> but was:<5>
	at junit.framework.Assert.fail(Assert.java:47)
	at junit.framework.Assert.failNotEquals(Assert.java:280)
	at junit.framework.Assert.assertEquals(Assert.java:64)
	at junit.framework.Assert.assertEquals(Assert.java:198)
	at junit.framework.Assert.assertEquals(Assert.java:204)
	at org.joda.time.TestLocalDateTime_Properties.check(TestLocalDateTime_Properties.java:1077)
	at org.joda.time.TestLocalDateTime_Properties.testPropertyAddToCopyMonth(TestLocalDateTime_Properties.java:250)

testPropertyAddWrapFieldToCopyMonth(org.joda.time.TestLocalDateTime_Properties)  Time elapsed: 0.001 sec  <<< FAILURE!
junit.framework.AssertionFailedError: expected:<4> but was:<5>
	at junit.framework.Assert.fail(Assert.java:47)
	at junit.framework.Assert.failNotEquals(Assert.java:280)
	at junit.framework.Assert.assertEquals(Assert.java:64)
	at junit.framework.Assert.assertEquals(Assert.java:198)
	at junit.framework.Assert.assertEquals(Assert.java:204)
	at org.joda.time.TestLocalDateTime_Properties.check(TestLocalDateTime_Properties.java:1077)
	at org.joda.time.TestLocalDateTime_Properties.testPropertyAddWrapFieldToCopyMonth(TestLocalDateTime_Properties.java:277)

testConstructor_ObjectString1(org.joda.time.TestLocalDate_Constructors)  Time elapsed: 0 sec  <<< FAILURE!
junit.framework.AssertionFailedError: expected:<4> but was:<5>
	at junit.framework.Assert.fail(Assert.java:47)
	at junit.framework.Assert.failNotEquals(Assert.java:280)
	at junit.framework.Assert.assertEquals(Assert.java:64)
	at junit.framework.Assert.assertEquals(Assert.java:198)
	at junit.framework.Assert.assertEquals(Assert.java:204)
	at org.joda.time.TestLocalDate_Constructors.testConstructor_ObjectString1(TestLocalDate_Constructors.java:336)

testToInterval_Zone_noMidnight(org.joda.time.TestLocalDate_Basics)  Time elapsed: 0 sec  <<< ERROR!
java.lang.IllegalArgumentException: The datetime zone id 'Asia/Gaza' is not recognised
	at org.joda.time.DateTimeZone.forID(DateTimeZone.java:229)
	at org.joda.time.TestLocalDate_Basics.testToInterval_Zone_noMidnight(TestLocalDate_Basics.java:982)

testPropertyAddToCopyMonth(org.joda.time.TestLocalDate_Properties)  Time elapsed: 0.001 sec  <<< FAILURE!
junit.framework.AssertionFailedError: expected:<4> but was:<5>
	at junit.framework.Assert.fail(Assert.java:47)
	at junit.framework.Assert.failNotEquals(Assert.java:280)
	at junit.framework.Assert.assertEquals(Assert.java:64)
	at junit.framework.Assert.assertEquals(Assert.java:198)
	at junit.framework.Assert.assertEquals(Assert.java:204)
	at org.joda.time.TestLocalDate_Properties.check(TestLocalDate_Properties.java:552)
	at org.joda.time.TestLocalDate_Properties.testPropertyAddToCopyMonth(TestLocalDate_Properties.java:245)

testPropertyAddWrapFieldToCopyMonth(org.joda.time.TestLocalDate_Properties)  Time elapsed: 0 sec  <<< FAILURE!
junit.framework.AssertionFailedError: expected:<4> but was:<5>
	at junit.framework.Assert.fail(Assert.java:47)
	at junit.framework.Assert.failNotEquals(Assert.java:280)
	at junit.framework.Assert.assertEquals(Assert.java:64)
	at junit.framework.Assert.assertEquals(Assert.java:198)
	at junit.framework.Assert.assertEquals(Assert.java:204)
	at org.joda.time.TestLocalDate_Properties.check(TestLocalDate_Properties.java:552)
	at org.joda.time.TestLocalDate_Properties.testPropertyAddWrapFieldToCopyMonth(TestLocalDate_Properties.java:272)

testPropertyAddMonth(org.joda.time.TestYearMonthDay_Properties)  Time elapsed: 0.001 sec  <<< FAILURE!
junit.framework.AssertionFailedError: expected:<4> but was:<5>
	at junit.framework.Assert.fail(Assert.java:47)
	at junit.framework.Assert.failNotEquals(Assert.java:280)
	at junit.framework.Assert.assertEquals(Assert.java:64)
	at junit.framework.Assert.assertEquals(Assert.java:198)
	at junit.framework.Assert.assertEquals(Assert.java:204)
	at org.joda.time.TestYearMonthDay_Properties.check(TestYearMonthDay_Properties.java:556)
	at org.joda.time.TestYearMonthDay_Properties.testPropertyAddMonth(TestYearMonthDay_Properties.java:248)

testPropertyAddDay(org.joda.time.TestYearMonthDay_Properties)  Time elapsed: 0.001 sec  <<< FAILURE!
junit.framework.AssertionFailedError: expected:<1> but was:<5>
	at junit.framework.Assert.fail(Assert.java:47)
	at junit.framework.Assert.failNotEquals(Assert.java:280)
	at junit.framework.Assert.assertEquals(Assert.java:64)
	at junit.framework.Assert.assertEquals(Assert.java:198)
	at junit.framework.Assert.assertEquals(Assert.java:204)
	at org.joda.time.TestYearMonthDay_Properties.check(TestYearMonthDay_Properties.java:556)
	at org.joda.time.TestYearMonthDay_Properties.testPropertyAddDay(TestYearMonthDay_Properties.java:404)

testPatchedNameKeysSydney(org.joda.time.TestDateTimeZone)  Time elapsed: 0.001 sec  <<< ERROR!
java.lang.IllegalArgumentException: The datetime zone id 'Australia/Sydney' is not recognised
	at org.joda.time.DateTimeZone.forID(DateTimeZone.java:229)
	at org.joda.time.TestDateTimeZone.testPatchedNameKeysSydney(TestDateTimeZone.java:1078)

testPatchedNameKeysSydneyHistoric(org.joda.time.TestDateTimeZone)  Time elapsed: 0 sec  <<< ERROR!
java.lang.IllegalArgumentException: The datetime zone id 'Australia/Sydney' is not recognised
	at org.joda.time.DateTimeZone.forID(DateTimeZone.java:229)
	at org.joda.time.TestDateTimeZone.testPatchedNameKeysSydneyHistoric(TestDateTimeZone.java:1088)

testForID_String_old(org.joda.time.TestDateTimeZone)  Time elapsed: 0.005 sec  <<< ERROR!
java.lang.IllegalArgumentException: The datetime zone id 'MIT' is not recognised
	at org.joda.time.DateTimeZone.forTimeZone(DateTimeZone.java:374)
	at org.joda.time.TestDateTimeZone.testForID_String_old(TestDateTimeZone.java:282)

testBug2182444_ausNSW(org.joda.time.TestDateTimeZoneCutover)  Time elapsed: 0.001 sec  <<< ERROR!
java.lang.IllegalArgumentException: The datetime zone id 'Australia/NSW' is not recognised
	at org.joda.time.DateTimeZone.forID(DateTimeZone.java:229)
	at org.joda.time.TestDateTimeZoneCutover.testBug2182444_ausNSW(TestDateTimeZoneCutover.java:1228)

testMaximumValue(org.joda.time.chrono.TestGJChronology)  Time elapsed: 0.059 sec  <<< ERROR!
org.joda.time.IllegalFieldValueException: Value -29 for dayOfMonth must be in the range [1,31]
	at org.joda.time.field.FieldUtils.verifyValueBounds(FieldUtils.java:234)
	at org.joda.time.field.PreciseDurationDateTimeField.set(PreciseDurationDateTimeField.java:79)
	at org.joda.time.chrono.GJChronology$CutoverField.set(GJChronology.java:740)
	at org.joda.time.chrono.BaseChronology.set(BaseChronology.java:240)
	at org.joda.time.chrono.GJChronology$CutoverField.getMaximumValue(GJChronology.java:863)
	at org.joda.time.field.AbstractPartialFieldProperty.getMaximumValue(AbstractPartialFieldProperty.java:230)
	at org.joda.time.chrono.TestGJChronology.testMaximumValue(TestGJChronology.java:515)

testChronology(org.joda.time.chrono.gj.MainTest)  Time elapsed: 0.023 sec  <<< FAILURE!
junit.framework.AssertionFailedError
	at junit.framework.Assert.fail(Assert.java:47)
	at org.joda.time.chrono.gj.MainTest.testChronology(MainTest.java:158)

testChronology(org.joda.time.chrono.gj.MainTest)  Time elapsed: 0.009 sec  <<< FAILURE!
junit.framework.AssertionFailedError
	at junit.framework.Assert.fail(Assert.java:47)
	at org.joda.time.chrono.gj.MainTest.testChronology(MainTest.java:158)

test_printParseZoneBahiaBanderas(org.joda.time.format.TestDateTimeFormatterBuilder)  Time elapsed: 0.001 sec  <<< ERROR!
java.lang.IllegalArgumentException: The datetime zone id 'America/Bahia_Banderas' is not recognised
	at org.joda.time.DateTimeZone.forID(DateTimeZone.java:229)
	at org.joda.time.format.TestDateTimeFormatterBuilder.test_printParseZoneBahiaBanderas(TestDateTimeFormatterBuilder.java:443)

testMonthNames_monthStart(org.joda.time.format.TestTextFields)  Time elapsed: 0 sec  <<< FAILURE!
junit.framework.ComparisonFailure: expected:<[April]> but was:<[May]>
	at junit.framework.Assert.assertEquals(Assert.java:81)
	at junit.framework.Assert.assertEquals(Assert.java:87)
	at org.joda.time.format.TestTextFields.testMonthNames_monthStart(TestTextFields.java:95)

testMonthNames_monthMiddle(org.joda.time.format.TestTextFields)  Time elapsed: 0.001 sec  <<< FAILURE!
junit.framework.ComparisonFailure: expected:<[April]> but was:<[May]>
	at junit.framework.Assert.assertEquals(Assert.java:81)
	at junit.framework.Assert.assertEquals(Assert.java:87)
	at org.joda.time.format.TestTextFields.testMonthNames_monthMiddle(TestTextFields.java:106)

testMonthNames_monthEnd(org.joda.time.format.TestTextFields)  Time elapsed: 0.001 sec  <<< ERROR!
org.joda.time.IllegalFieldValueException: Value 31 for dayOfMonth must be in the range [1,30]
	at org.joda.time.field.FieldUtils.verifyValueBounds(FieldUtils.java:252)
	at org.joda.time.chrono.BasicChronology.getDateMidnightMillis(BasicChronology.java:613)
	at org.joda.time.chrono.BasicChronology.getDateTimeMillis(BasicChronology.java:177)
	at org.joda.time.chrono.GregorianChronology.getDateTimeMillis(GregorianChronology.java:44)
	at org.joda.time.chrono.AssembledChronology.getDateTimeMillis(AssembledChronology.java:133)
	at org.joda.time.base.BaseDateTime.<init>(BaseDateTime.java:258)
	at org.joda.time.DateTime.<init>(DateTime.java:532)
	at org.joda.time.format.TestTextFields.testMonthNames_monthEnd(TestTextFields.java:118)

testSerialization(org.joda.time.tz.TestBuilder)  Time elapsed: 0.006 sec  <<< FAILURE!
junit.framework.ComparisonFailure: expected:<P[S]T> but was:<P[D]T>
	at junit.framework.Assert.assertEquals(Assert.java:81)
	at junit.framework.Assert.assertEquals(Assert.java:87)
	at org.joda.time.tz.TestBuilder.testForwardTransitions(TestBuilder.java:245)
	at org.joda.time.tz.TestBuilder.testSerialization(TestBuilder.java:282)

testForwardTransitions(org.joda.time.tz.TestBuilder)  Time elapsed: 0.011 sec  <<< FAILURE!
junit.framework.ComparisonFailure: expected:<P[S]T> but was:<P[D]T>
	at junit.framework.Assert.assertEquals(Assert.java:81)
	at junit.framework.Assert.assertEquals(Assert.java:87)
	at org.joda.time.tz.TestBuilder.testForwardTransitions(TestBuilder.java:245)
	at org.joda.time.tz.TestBuilder.testForwardTransitions(TestBuilder.java:217)

testReverseTransitions(org.joda.time.tz.TestBuilder)  Time elapsed: 0.011 sec  <<< FAILURE!
junit.framework.AssertionFailedError: expected:<957175199999> but was:<957088799999>
	at junit.framework.Assert.fail(Assert.java:47)
	at junit.framework.Assert.failNotEquals(Assert.java:280)
	at junit.framework.Assert.assertEquals(Assert.java:64)
	at junit.framework.Assert.assertEquals(Assert.java:133)
	at junit.framework.Assert.assertEquals(Assert.java:139)
	at org.joda.time.tz.TestBuilder.testReverseTransitions(TestBuilder.java:270)
	at org.joda.time.tz.TestBuilder.testReverseTransitions(TestBuilder.java:255)

test_Amman_2003(org.joda.time.tz.TestCompiler)  Time elapsed: 0.001 sec  <<< ERROR!
java.lang.IllegalArgumentException: The datetime zone id 'Asia/Amman' is not recognised
	at org.joda.time.DateTimeZone.forID(DateTimeZone.java:229)
	at org.joda.time.tz.TestCompiler.test_Amman_2003(TestCompiler.java:207)

test_Amman_2004(org.joda.time.tz.TestCompiler)  Time elapsed: 0.001 sec  <<< ERROR!
java.lang.IllegalArgumentException: The datetime zone id 'Asia/Amman' is not recognised
	at org.joda.time.DateTimeZone.forID(DateTimeZone.java:229)
	at org.joda.time.tz.TestCompiler.test_Amman_2004(TestCompiler.java:214)

test_Amman_2005(org.joda.time.tz.TestCompiler)  Time elapsed: 0 sec  <<< ERROR!
java.lang.IllegalArgumentException: The datetime zone id 'Asia/Amman' is not recognised
	at org.joda.time.DateTimeZone.forID(DateTimeZone.java:229)
	at org.joda.time.tz.TestCompiler.test_Amman_2005(TestCompiler.java:221)

test_Amman_2006(org.joda.time.tz.TestCompiler)  Time elapsed: 0 sec  <<< ERROR!
java.lang.IllegalArgumentException: The datetime zone id 'Asia/Amman' is not recognised
	at org.joda.time.DateTimeZone.forID(DateTimeZone.java:229)
	at org.joda.time.tz.TestCompiler.test_Amman_2006(TestCompiler.java:228)

testCompile(org.joda.time.tz.TestCompiler)  Time elapsed: 0.016 sec  <<< ERROR!
java.lang.NullPointerException
	at org.joda.time.tz.TestCompiler.testCompile(TestCompiler.java:115)


Results :

Failed tests: 
  org.joda.time.TestDateTime_Properties#testPropertyAddMonthOfYear ComparisonFailure
  org.joda.time.TestDateTime_Properties#testPropertyAddWrapFieldMonthOfYear ComparisonFailure
  org.joda.time.TestLocalDateTime_Constructors#testConstructor_ObjectString1 AssertionFailedError
  org.joda.time.TestLocalDateTime_Constructors#testConstructor_ObjectString3 AssertionFailedError
  org.joda.time.TestLocalDateTime_Constructors#testConstructor_ObjectString4 AssertionFailedError
  org.joda.time.TestLocalDateTime_Properties#testPropertyAddToCopyMonth AssertionFailedError
  org.joda.time.TestLocalDateTime_Properties#testPropertyAddWrapFieldToCopyMonth AssertionFailedError
  org.joda.time.TestLocalDate_Constructors#testConstructor_ObjectString1 AssertionFailedError
  org.joda.time.TestLocalDate_Properties#testPropertyAddToCopyMonth AssertionFailedError
  org.joda.time.TestLocalDate_Properties#testPropertyAddWrapFieldToCopyMonth AssertionFailedError
  org.joda.time.TestYearMonthDay_Properties#testPropertyAddDay AssertionFailedError
  org.joda.time.TestYearMonthDay_Properties#testPropertyAddMonth AssertionFailedError
org.joda.time.chrono.gj.MainTest.testChronology(org.joda.time.chrono.gj.MainTest)
  Run 1: org.joda.time.chrono.gj.MainTest#testChronology AssertionFailedError
  Run 2: org.joda.time.chrono.gj.MainTest#testChronology AssertionFailedError

  org.joda.time.format.TestTextFields#testMonthNames_monthMiddle ComparisonFailure
  org.joda.time.format.TestTextFields#testMonthNames_monthStart ComparisonFailure
  org.joda.time.tz.TestBuilder#testForwardTransitions ComparisonFailure expected...
  org.joda.time.tz.TestBuilder#testReverseTransitions AssertionFailedError expec...
  org.joda.time.tz.TestBuilder#testSerialization ComparisonFailure expected:<P[S...
Tests in error: 
  org.joda.time.TestDateTimeZone#testForID_String_old IllegalArgumentException T...
  org.joda.time.TestDateTimeZone#testPatchedNameKeysSydney IllegalArgumentException
  org.joda.time.TestDateTimeZone#testPatchedNameKeysSydneyHistoric IllegalArgumentException
  org.joda.time.TestDateTimeZoneCutover#testBug2182444_ausNSW IllegalArgumentException
  org.joda.time.TestDateTime_Properties#testPropertyWithMinimumValueMillisOfDayDSTGap IllegalArgumentException
  org.joda.time.TestLocalDate_Basics#testToInterval_Zone_noMidnight IllegalArgumentException
  org.joda.time.chrono.TestGJChronology#testMaximumValue IllegalFieldValueException
  org.joda.time.format.TestDateTimeFormatterBuilder#test_printParseZoneBahiaBanderas IllegalArgumentException
  org.joda.time.format.TestTextFields#testMonthNames_monthEnd IllegalFieldValueException
  org.joda.time.tz.TestCompiler#testCompile NullPointerException
  org.joda.time.tz.TestCompiler#test_Amman_2003 IllegalArgumentException The dat...
  org.joda.time.tz.TestCompiler#test_Amman_2004 IllegalArgumentException The dat...
  org.joda.time.tz.TestCompiler#test_Amman_2005 IllegalArgumentException The dat...
  org.joda.time.tz.TestCompiler#test_Amman_2006 IllegalArgumentException The dat...

Tests run: 4156, Failures: 18, Errors: 14, Skipped: 0

[INFO] ------------------------------------------------------------------------
[INFO] BUILD FAILURE
[INFO] ------------------------------------------------------------------------
[INFO] Total time: 14.868s
[INFO] Finished at: Wed Aug 05 22:47:30 BST 2015
[INFO] Final Memory: 9M/213M
[INFO] ------------------------------------------------------------------------
[ERROR] Failed to execute goal org.apache.maven.plugins:maven-surefire-plugin:2.18.1:test (default-test) on project joda-time: There are test failures.
[ERROR] 
[ERROR] Please refer to /home/perham/Study/LittleDarwin/Cases/joda-time-2.8.1/target/surefire-reports for the individual test results.
[ERROR] -> [Help 1]
[ERROR] 
[ERROR] To see the full stack trace of the errors, re-run Maven with the -e switch.
[ERROR] Re-run Maven using the -X switch to enable full debug logging.
[ERROR] 
[ERROR] For more information about the errors and possible solutions, please read the following articles:
[ERROR] [Help 1] http://cwiki.apache.org/confluence/display/MAVEN/MojoFailureException
