[INFO] Scanning for projects...
[INFO]                                                                         
[INFO] ------------------------------------------------------------------------
[INFO] Building Joda-Time 2.8.1
[INFO] ------------------------------------------------------------------------
[INFO] 
[INFO] --- maven-resources-plugin:2.7:resources (default-resources) @ joda-time ---
[INFO] Using 'UTF-8' encoding to copy filtered resources.
[INFO] Copying 2 resources to META-INF
[INFO] Copying 10 resources
[INFO] 
[INFO] --- maven-compiler-plugin:3.3:compile (default-compile) @ joda-time ---
[INFO] Changes detected - recompiling the module!
[INFO] Compiling 166 source files to /home/perham/Study/LittleDarwin/Cases/joda-time-2.8.1/target/classes
[INFO] 
[INFO] --- exec-maven-plugin:1.4.0:java (compile-tzdb) @ joda-time ---
Writing zoneinfo files
*d* Error in Asia/Amman 2017-09-28T22:00:00.000Z
*d* Error in Asia/Gaza 2017-09-21T21:00:00.000Z
*d* Error in Asia/Hebron 2017-09-21T21:00:00.000Z
Writing ZoneInfoMap
[INFO] 
[INFO] --- maven-resources-plugin:2.7:testResources (default-testResources) @ joda-time ---
[INFO] Using 'UTF-8' encoding to copy filtered resources.
[INFO] Copying 34 resources
[INFO] 
[INFO] --- maven-compiler-plugin:3.3:testCompile (default-testCompile) @ joda-time ---
[INFO] Nothing to compile - all classes are up to date
[INFO] 
[INFO] --- maven-surefire-plugin:2.18.1:test (default-test) @ joda-time ---
[INFO] Surefire report directory: /home/perham/Study/LittleDarwin/Cases/joda-time-2.8.1/target/surefire-reports

-------------------------------------------------------
 T E S T S
-------------------------------------------------------
Running org.joda.time.TestAllPackages

TestBuddhistChronology.testCalendar

TestCopticChronology.testCalendar

TestEthiopicChronology.testCalendar

TestIslamicChronology.testCalendar

Testing Gregorian chronology over 1000 iterations
Failure on monthOfYear.get
org.joda.time.chrono.gj.TestGJMonthOfYearField
	vs. org.joda.time.chrono.GJMonthOfYearDateTimeField
Datetime: Sat 4859-05--03T12:56:33.400Z / 4859-W17-6
Millis from 1970: 91178052993400
4 != 5
Failure index: 3
Test millis: 91178052993400
Test value: -48
Test millis2: 66465483937712

Testing Julian chronology over 1000 iterations
Failure on monthOfYear.getDifference
org.joda.time.chrono.gj.TestJulianMonthOfYearField
	vs. org.joda.time.chrono.GJMonthOfYearDateTimeField
Datetime: Sun 9725-12-15T15:18:24.715Z / 9725-W50-7
Millis from 1970: 244760455104715
6632 != 6631
Test datetime 2: Sat 9173-05--26T08:04:01.437Z / 9173-W13-6
Failure index: 15
Test millis: 244760455104715
Test value: -38
Test millis2: 227318515441437
Writing zoneinfo files
Writing ZoneInfoMap
Tests run: 4157, Failures: 126, Errors: 36, Skipped: 0, Time elapsed: 4.432 sec <<< FAILURE! - in org.joda.time.TestAllPackages
testTest(org.joda.time.TestChronology)  Time elapsed: 0.017 sec  <<< FAILURE!
junit.framework.ComparisonFailure: expected:<2002-0[4-05]T12:24:00.000Z> but was:<2002-0[5--24]T12:24:00.000Z>
	at junit.framework.Assert.assertEquals(Assert.java:81)
	at junit.framework.Assert.assertEquals(Assert.java:87)
	at org.joda.time.TestChronology.testTest(TestChronology.java:113)

testTest(org.joda.time.TestInstant_Basics)  Time elapsed: 0.001 sec  <<< FAILURE!
junit.framework.ComparisonFailure: expected:<2002-0[4-05]T12:24:00.000Z> but was:<2002-0[5--24]T12:24:00.000Z>
	at junit.framework.Assert.assertEquals(Assert.java:81)
	at junit.framework.Assert.assertEquals(Assert.java:87)
	at org.joda.time.TestInstant_Basics.testTest(TestInstant_Basics.java:110)

testTest(org.joda.time.TestDateTime_Constructors)  Time elapsed: 0.001 sec  <<< FAILURE!
junit.framework.ComparisonFailure: expected:<2002-0[4-05]T12:24:00.000Z> but was:<2002-0[5--24]T12:24:00.000Z>
	at junit.framework.Assert.assertEquals(Assert.java:81)
	at junit.framework.Assert.assertEquals(Assert.java:87)
	at org.joda.time.TestDateTime_Constructors.testTest(TestDateTime_Constructors.java:103)

testTest(org.joda.time.TestDateTime_Basics)  Time elapsed: 0.001 sec  <<< FAILURE!
junit.framework.ComparisonFailure: expected:<2002-0[4-05]T12:24:00.000Z> but was:<2002-0[5--24]T12:24:00.000Z>
	at junit.framework.Assert.assertEquals(Assert.java:81)
	at junit.framework.Assert.assertEquals(Assert.java:87)
	at org.joda.time.TestDateTime_Basics.testTest(TestDateTime_Basics.java:132)

testWithTime_int_int_int_int(org.joda.time.TestDateTime_Basics)  Time elapsed: 0 sec  <<< ERROR!
org.joda.time.IllegalFieldValueException: Value -24 for dayOfMonth must be in the range [1,31]
	at org.joda.time.field.FieldUtils.verifyValueBounds(FieldUtils.java:234)
	at org.joda.time.field.PreciseDurationDateTimeField.set(PreciseDurationDateTimeField.java:79)
	at org.joda.time.chrono.GJChronology$CutoverField.set(GJChronology.java:727)
	at org.joda.time.chrono.BaseChronology.getDateTimeMillis(BaseChronology.java:134)
	at org.joda.time.chrono.AssembledChronology.getDateTimeMillis(AssembledChronology.java:136)
	at org.joda.time.chrono.LimitChronology.getDateTimeMillis(LimitChronology.java:187)
	at org.joda.time.chrono.AssembledChronology.getDateTimeMillis(AssembledChronology.java:133)
	at org.joda.time.DateTime.withTime(DateTime.java:772)
	at org.joda.time.TestDateTime_Basics.testWithTime_int_int_int_int(TestDateTime_Basics.java:882)

testWithTime_LocalTime(org.joda.time.TestDateTime_Basics)  Time elapsed: 0.001 sec  <<< ERROR!
org.joda.time.IllegalFieldValueException: Value -24 for dayOfMonth must be in the range [1,31]
	at org.joda.time.field.FieldUtils.verifyValueBounds(FieldUtils.java:234)
	at org.joda.time.field.PreciseDurationDateTimeField.set(PreciseDurationDateTimeField.java:79)
	at org.joda.time.chrono.GJChronology$CutoverField.set(GJChronology.java:727)
	at org.joda.time.chrono.BaseChronology.getDateTimeMillis(BaseChronology.java:134)
	at org.joda.time.chrono.AssembledChronology.getDateTimeMillis(AssembledChronology.java:136)
	at org.joda.time.chrono.LimitChronology.getDateTimeMillis(LimitChronology.java:187)
	at org.joda.time.chrono.AssembledChronology.getDateTimeMillis(AssembledChronology.java:133)
	at org.joda.time.DateTime.withTime(DateTime.java:772)
	at org.joda.time.DateTime.withTime(DateTime.java:790)
	at org.joda.time.TestDateTime_Basics.testWithTime_LocalTime(TestDateTime_Basics.java:903)

testWithFields_RPartial(org.joda.time.TestDateTime_Basics)  Time elapsed: 0.001 sec  <<< ERROR!
org.joda.time.IllegalFieldValueException: Value 4 for monthOfYear is not supported: Illegal instant due to time zone offset transition (daylight savings time 'gap'): 2003-05--23T07:08:09.000 (Europe/London)
	at org.joda.time.chrono.ZonedChronology$ZonedDateTimeField.set(ZonedChronology.java:486)
	at org.joda.time.chrono.BaseChronology.set(BaseChronology.java:240)
	at org.joda.time.DateTime.withFields(DateTime.java:827)
	at org.joda.time.TestDateTime_Basics.testWithFields_RPartial(TestDateTime_Basics.java:917)
Caused by: org.joda.time.IllegalInstantException: Illegal instant due to time zone offset transition (daylight savings time 'gap'): 2003-05--23T07:08:09.000 (Europe/London)
	at org.joda.time.chrono.ZonedChronology$ZonedDateTimeField.set(ZonedChronology.java:485)
	... 29 more

testMinusMonths_int(org.joda.time.TestDateTime_Basics)  Time elapsed: 0 sec  <<< ERROR!
org.joda.time.IllegalFieldValueException: Value 4 for monthOfYear is not supported: Illegal instant due to time zone offset transition (daylight savings time 'gap'): 1459-05--19T01:00:00.000 (Europe/London)
	at org.joda.time.chrono.ZonedChronology$ZonedDateTimeField.set(ZonedChronology.java:486)
	at org.joda.time.chrono.BaseChronology.getDateTimeMillis(BaseChronology.java:133)
	at org.joda.time.chrono.AssembledChronology.getDateTimeMillis(AssembledChronology.java:136)
	at org.joda.time.chrono.LimitChronology.getDateTimeMillis(LimitChronology.java:187)
	at org.joda.time.chrono.AssembledChronology.getDateTimeMillis(AssembledChronology.java:133)
	at org.joda.time.base.BaseDateTime.<init>(BaseDateTime.java:258)
	at org.joda.time.DateTime.<init>(DateTime.java:532)
	at org.joda.time.TestDateTime_Basics.testMinusMonths_int(TestDateTime_Basics.java:1186)
Caused by: org.joda.time.IllegalInstantException: Illegal instant due to time zone offset transition (daylight savings time 'gap'): 1459-05--19T01:00:00.000 (Europe/London)
	at org.joda.time.chrono.ZonedChronology$ZonedDateTimeField.set(ZonedChronology.java:485)
	... 33 more

testMinusWeeks_int(org.joda.time.TestDateTime_Basics)  Time elapsed: 0.001 sec  <<< ERROR!
org.joda.time.IllegalFieldValueException: Value 4 for monthOfYear is not supported: Illegal instant due to time zone offset transition (daylight savings time 'gap'): 1459-05--19T01:00:00.000 (Europe/London)
	at org.joda.time.chrono.ZonedChronology$ZonedDateTimeField.set(ZonedChronology.java:486)
	at org.joda.time.chrono.BaseChronology.getDateTimeMillis(BaseChronology.java:133)
	at org.joda.time.chrono.AssembledChronology.getDateTimeMillis(AssembledChronology.java:136)
	at org.joda.time.chrono.LimitChronology.getDateTimeMillis(LimitChronology.java:187)
	at org.joda.time.chrono.AssembledChronology.getDateTimeMillis(AssembledChronology.java:133)
	at org.joda.time.base.BaseDateTime.<init>(BaseDateTime.java:258)
	at org.joda.time.DateTime.<init>(DateTime.java:532)
	at org.joda.time.TestDateTime_Basics.testMinusWeeks_int(TestDateTime_Basics.java:1196)
Caused by: org.joda.time.IllegalInstantException: Illegal instant due to time zone offset transition (daylight savings time 'gap'): 1459-05--19T01:00:00.000 (Europe/London)
	at org.joda.time.chrono.ZonedChronology$ZonedDateTimeField.set(ZonedChronology.java:485)
	... 33 more

testTest(org.joda.time.TestDateTime_Properties)  Time elapsed: 0 sec  <<< FAILURE!
junit.framework.ComparisonFailure: expected:<2002-0[4-05]T12:24:00.000Z> but was:<2002-0[5--24]T12:24:00.000Z>
	at junit.framework.Assert.assertEquals(Assert.java:81)
	at junit.framework.Assert.assertEquals(Assert.java:87)
	at org.joda.time.TestDateTime_Properties.testTest(TestDateTime_Properties.java:101)

testPropertyCompareToMonthOfYear(org.joda.time.TestDateTime_Properties)  Time elapsed: 0.001 sec  <<< FAILURE!
junit.framework.AssertionFailedError: expected:<true> but was:<false>
	at junit.framework.Assert.fail(Assert.java:47)
	at junit.framework.Assert.failNotEquals(Assert.java:280)
	at junit.framework.Assert.assertEquals(Assert.java:64)
	at junit.framework.Assert.assertEquals(Assert.java:146)
	at junit.framework.Assert.assertEquals(Assert.java:152)
	at org.joda.time.TestDateTime_Properties.testPropertyCompareToMonthOfYear(TestDateTime_Properties.java:495)

testPropertyWithMaximumValueMillisOfDayDSTGap(org.joda.time.TestDateTime_Properties)  Time elapsed: 0.001 sec  <<< FAILURE!
junit.framework.ComparisonFailure: expected:<1926-0[4-17T22]:59:59.999Z> but was:<1926-0[5--12T23]:59:59.999Z>
	at junit.framework.Assert.assertEquals(Assert.java:81)
	at junit.framework.Assert.assertEquals(Assert.java:87)
	at org.joda.time.TestDateTime_Properties.testPropertyWithMaximumValueMillisOfDayDSTGap(TestDateTime_Properties.java:651)

testPropertyWithMinimumValueMillisOfDayDSTGap(org.joda.time.TestDateTime_Properties)  Time elapsed: 0.001 sec  <<< ERROR!
java.lang.IllegalArgumentException: The datetime zone id 'Asia/Gaza' is not recognised
	at org.joda.time.DateTimeZone.forID(DateTimeZone.java:229)
	at org.joda.time.TestDateTime_Properties.testPropertyWithMinimumValueMillisOfDayDSTGap(TestDateTime_Properties.java:662)

testTest(org.joda.time.TestMutableDateTime_Constructors)  Time elapsed: 0.001 sec  <<< FAILURE!
junit.framework.ComparisonFailure: expected:<2002-0[4-05]T12:24:00.000Z> but was:<2002-0[5--24]T12:24:00.000Z>
	at junit.framework.Assert.assertEquals(Assert.java:81)
	at junit.framework.Assert.assertEquals(Assert.java:87)
	at org.joda.time.TestMutableDateTime_Constructors.testTest(TestMutableDateTime_Constructors.java:103)

testTest(org.joda.time.TestMutableDateTime_Basics)  Time elapsed: 0.001 sec  <<< FAILURE!
junit.framework.ComparisonFailure: expected:<2002-0[4-05]T12:24:00.000Z> but was:<2002-0[5--24]T12:24:00.000Z>
	at junit.framework.Assert.assertEquals(Assert.java:81)
	at junit.framework.Assert.assertEquals(Assert.java:87)
	at org.joda.time.TestMutableDateTime_Basics.testTest(TestMutableDateTime_Basics.java:116)

testTest(org.joda.time.TestMutableDateTime_Sets)  Time elapsed: 0.001 sec  <<< FAILURE!
junit.framework.ComparisonFailure: expected:<2002-0[4-05]T12:24:00.000Z> but was:<2002-0[5--24]T12:24:00.000Z>
	at junit.framework.Assert.assertEquals(Assert.java:81)
	at junit.framework.Assert.assertEquals(Assert.java:87)
	at org.joda.time.TestMutableDateTime_Sets.testTest(TestMutableDateTime_Sets.java:104)

testTest(org.joda.time.TestMutableDateTime_Adds)  Time elapsed: 0.001 sec  <<< FAILURE!
junit.framework.ComparisonFailure: expected:<2002-0[4-05]T12:24:00.000Z> but was:<2002-0[5--24]T12:24:00.000Z>
	at junit.framework.Assert.assertEquals(Assert.java:81)
	at junit.framework.Assert.assertEquals(Assert.java:87)
	at org.joda.time.TestMutableDateTime_Adds.testTest(TestMutableDateTime_Adds.java:101)

testTest(org.joda.time.TestMutableDateTime_Properties)  Time elapsed: 0.001 sec  <<< FAILURE!
junit.framework.ComparisonFailure: expected:<2002-0[4-05]T12:24:00.000Z> but was:<2002-0[5--24]T12:24:00.000Z>
	at junit.framework.Assert.assertEquals(Assert.java:81)
	at junit.framework.Assert.assertEquals(Assert.java:87)
	at org.joda.time.TestMutableDateTime_Properties.testTest(TestMutableDateTime_Properties.java:94)

testTest(org.joda.time.TestDateMidnight_Constructors)  Time elapsed: 0 sec  <<< FAILURE!
junit.framework.ComparisonFailure: expected:<2002-0[4-05]T12:24:00.000Z> but was:<2002-0[5--24]T12:24:00.000Z>
	at junit.framework.Assert.assertEquals(Assert.java:81)
	at junit.framework.Assert.assertEquals(Assert.java:87)
	at org.joda.time.TestDateMidnight_Constructors.testTest(TestDateMidnight_Constructors.java:117)

testTest(org.joda.time.TestDateMidnight_Basics)  Time elapsed: 0.001 sec  <<< FAILURE!
junit.framework.ComparisonFailure: expected:<2002-0[4-05]T12:24:00.000Z> but was:<2002-0[5--24]T12:24:00.000Z>
	at junit.framework.Assert.assertEquals(Assert.java:81)
	at junit.framework.Assert.assertEquals(Assert.java:87)
	at org.joda.time.TestDateMidnight_Basics.testTest(TestDateMidnight_Basics.java:147)

testWithFields_RPartial(org.joda.time.TestDateMidnight_Basics)  Time elapsed: 0 sec  <<< ERROR!
org.joda.time.IllegalFieldValueException: Value 4 for monthOfYear is not supported: Illegal instant due to time zone offset transition (daylight savings time 'gap'): 2003-05--24T00:00:00.000 (Europe/London)
	at org.joda.time.chrono.ZonedChronology$ZonedDateTimeField.set(ZonedChronology.java:486)
	at org.joda.time.chrono.BaseChronology.set(BaseChronology.java:240)
	at org.joda.time.DateMidnight.withFields(DateMidnight.java:442)
	at org.joda.time.TestDateMidnight_Basics.testWithFields_RPartial(TestDateMidnight_Basics.java:730)
Caused by: org.joda.time.IllegalInstantException: Illegal instant due to time zone offset transition (daylight savings time 'gap'): 2003-05--24T00:00:00.000 (Europe/London)
	at org.joda.time.chrono.ZonedChronology$ZonedDateTimeField.set(ZonedChronology.java:485)
	... 29 more

testMinusMonths_int(org.joda.time.TestDateMidnight_Basics)  Time elapsed: 0 sec  <<< ERROR!
org.joda.time.IllegalFieldValueException: Value 4 for monthOfYear is not supported: Illegal instant due to time zone offset transition (daylight savings time 'gap'): 1459-05--19T01:00:00.000 (Europe/London)
	at org.joda.time.chrono.ZonedChronology$ZonedDateTimeField.set(ZonedChronology.java:486)
	at org.joda.time.chrono.BaseChronology.getDateTimeMillis(BaseChronology.java:133)
	at org.joda.time.chrono.AssembledChronology.getDateTimeMillis(AssembledChronology.java:136)
	at org.joda.time.chrono.LimitChronology.getDateTimeMillis(LimitChronology.java:187)
	at org.joda.time.chrono.AssembledChronology.getDateTimeMillis(AssembledChronology.java:133)
	at org.joda.time.base.BaseDateTime.<init>(BaseDateTime.java:258)
	at org.joda.time.DateMidnight.<init>(DateMidnight.java:350)
	at org.joda.time.TestDateMidnight_Basics.testMinusMonths_int(TestDateMidnight_Basics.java:959)
Caused by: org.joda.time.IllegalInstantException: Illegal instant due to time zone offset transition (daylight savings time 'gap'): 1459-05--19T01:00:00.000 (Europe/London)
	at org.joda.time.chrono.ZonedChronology$ZonedDateTimeField.set(ZonedChronology.java:485)
	... 33 more

testMinusWeeks_int(org.joda.time.TestDateMidnight_Basics)  Time elapsed: 0 sec  <<< ERROR!
org.joda.time.IllegalFieldValueException: Value 4 for monthOfYear is not supported: Illegal instant due to time zone offset transition (daylight savings time 'gap'): 1459-05--19T01:00:00.000 (Europe/London)
	at org.joda.time.chrono.ZonedChronology$ZonedDateTimeField.set(ZonedChronology.java:486)
	at org.joda.time.chrono.BaseChronology.getDateTimeMillis(BaseChronology.java:133)
	at org.joda.time.chrono.AssembledChronology.getDateTimeMillis(AssembledChronology.java:136)
	at org.joda.time.chrono.LimitChronology.getDateTimeMillis(LimitChronology.java:187)
	at org.joda.time.chrono.AssembledChronology.getDateTimeMillis(AssembledChronology.java:133)
	at org.joda.time.base.BaseDateTime.<init>(BaseDateTime.java:258)
	at org.joda.time.DateMidnight.<init>(DateMidnight.java:350)
	at org.joda.time.TestDateMidnight_Basics.testMinusWeeks_int(TestDateMidnight_Basics.java:969)
Caused by: org.joda.time.IllegalInstantException: Illegal instant due to time zone offset transition (daylight savings time 'gap'): 1459-05--19T01:00:00.000 (Europe/London)
	at org.joda.time.chrono.ZonedChronology$ZonedDateTimeField.set(ZonedChronology.java:485)
	... 33 more

testTest(org.joda.time.TestDateMidnight_Properties)  Time elapsed: 0.005 sec  <<< FAILURE!
junit.framework.ComparisonFailure: expected:<2002-0[4-05]T12:24:00.000Z> but was:<2002-0[5--24]T12:24:00.000Z>
	at junit.framework.Assert.assertEquals(Assert.java:81)
	at junit.framework.Assert.assertEquals(Assert.java:87)
	at org.joda.time.TestDateMidnight_Properties.testTest(TestDateMidnight_Properties.java:102)

testTest(org.joda.time.TestDuration_Basics)  Time elapsed: 0.001 sec  <<< FAILURE!
junit.framework.ComparisonFailure: expected:<2002-0[4-05]T12:24:00.000Z> but was:<2002-0[5--24]T12:24:00.000Z>
	at junit.framework.Assert.assertEquals(Assert.java:81)
	at junit.framework.Assert.assertEquals(Assert.java:87)
	at org.joda.time.TestDuration_Basics.testTest(TestDuration_Basics.java:107)

testTest(org.joda.time.TestInterval_Basics)  Time elapsed: 0 sec  <<< FAILURE!
junit.framework.ComparisonFailure: expected:<2002-0[4-05]T12:24:00.000Z> but was:<2002-0[5--24]T12:24:00.000Z>
	at junit.framework.Assert.assertEquals(Assert.java:81)
	at junit.framework.Assert.assertEquals(Assert.java:87)
	at org.joda.time.TestInterval_Basics.testTest(TestInterval_Basics.java:117)

testConstructor_long1(org.joda.time.TestLocalDateTime_Constructors)  Time elapsed: 0 sec  <<< FAILURE!
junit.framework.AssertionFailedError: expected:<4> but was:<5>
	at junit.framework.Assert.fail(Assert.java:47)
	at junit.framework.Assert.failNotEquals(Assert.java:280)
	at junit.framework.Assert.assertEquals(Assert.java:64)
	at junit.framework.Assert.assertEquals(Assert.java:198)
	at junit.framework.Assert.assertEquals(Assert.java:204)
	at org.joda.time.TestLocalDateTime_Constructors.testConstructor_long1(TestLocalDateTime_Constructors.java:259)

testConstructor_long1_DateTimeZone(org.joda.time.TestLocalDateTime_Constructors)  Time elapsed: 0 sec  <<< FAILURE!
junit.framework.AssertionFailedError: expected:<4> but was:<5>
	at junit.framework.Assert.fail(Assert.java:47)
	at junit.framework.Assert.failNotEquals(Assert.java:280)
	at junit.framework.Assert.assertEquals(Assert.java:64)
	at junit.framework.Assert.assertEquals(Assert.java:198)
	at junit.framework.Assert.assertEquals(Assert.java:204)
	at org.joda.time.TestLocalDateTime_Constructors.testConstructor_long1_DateTimeZone(TestLocalDateTime_Constructors.java:284)

testConstructor_long_nullDateTimeZone(org.joda.time.TestLocalDateTime_Constructors)  Time elapsed: 0 sec  <<< FAILURE!
junit.framework.AssertionFailedError: expected:<4> but was:<5>
	at junit.framework.Assert.fail(Assert.java:47)
	at junit.framework.Assert.failNotEquals(Assert.java:280)
	at junit.framework.Assert.assertEquals(Assert.java:64)
	at junit.framework.Assert.assertEquals(Assert.java:198)
	at junit.framework.Assert.assertEquals(Assert.java:204)
	at org.joda.time.TestLocalDateTime_Constructors.testConstructor_long_nullDateTimeZone(TestLocalDateTime_Constructors.java:308)

testConstructor_long1_Chronology(org.joda.time.TestLocalDateTime_Constructors)  Time elapsed: 0 sec  <<< FAILURE!
junit.framework.AssertionFailedError: expected:<4> but was:<5>
	at junit.framework.Assert.fail(Assert.java:47)
	at junit.framework.Assert.failNotEquals(Assert.java:280)
	at junit.framework.Assert.assertEquals(Assert.java:64)
	at junit.framework.Assert.assertEquals(Assert.java:198)
	at junit.framework.Assert.assertEquals(Assert.java:204)
	at org.joda.time.TestLocalDateTime_Constructors.testConstructor_long1_Chronology(TestLocalDateTime_Constructors.java:321)

testConstructor_long_nullChronology(org.joda.time.TestLocalDateTime_Constructors)  Time elapsed: 0 sec  <<< FAILURE!
junit.framework.AssertionFailedError: expected:<4> but was:<5>
	at junit.framework.Assert.fail(Assert.java:47)
	at junit.framework.Assert.failNotEquals(Assert.java:280)
	at junit.framework.Assert.assertEquals(Assert.java:64)
	at junit.framework.Assert.assertEquals(Assert.java:198)
	at junit.framework.Assert.assertEquals(Assert.java:204)
	at org.joda.time.TestLocalDateTime_Constructors.testConstructor_long_nullChronology(TestLocalDateTime_Constructors.java:345)

testConstructor_Object_DateTimeZone(org.joda.time.TestLocalDateTime_Constructors)  Time elapsed: 0.001 sec  <<< ERROR!
org.joda.time.IllegalFieldValueException: Value -23 for dayOfMonth must be in the range [1,31]
	at org.joda.time.field.FieldUtils.verifyValueBounds(FieldUtils.java:252)
	at org.joda.time.chrono.BasicChronology.getDateMidnightMillis(BasicChronology.java:613)
	at org.joda.time.chrono.BasicChronology.getDateTimeMillis(BasicChronology.java:159)
	at org.joda.time.chrono.GregorianChronology.getDateTimeMillis(GregorianChronology.java:44)
	at org.joda.time.chrono.AssembledChronology.getDateTimeMillis(AssembledChronology.java:120)
	at org.joda.time.LocalDateTime.<init>(LocalDateTime.java:385)
	at org.joda.time.TestLocalDateTime_Constructors.testConstructor_Object_DateTimeZone(TestLocalDateTime_Constructors.java:501)

testConstructor_Object_nullDateTimeZone(org.joda.time.TestLocalDateTime_Constructors)  Time elapsed: 0 sec  <<< ERROR!
org.joda.time.IllegalFieldValueException: Value -23 for dayOfMonth must be in the range [1,31]
	at org.joda.time.field.FieldUtils.verifyValueBounds(FieldUtils.java:252)
	at org.joda.time.chrono.BasicChronology.getDateMidnightMillis(BasicChronology.java:613)
	at org.joda.time.chrono.BasicChronology.getDateTimeMillis(BasicChronology.java:159)
	at org.joda.time.chrono.GregorianChronology.getDateTimeMillis(GregorianChronology.java:44)
	at org.joda.time.chrono.AssembledChronology.getDateTimeMillis(AssembledChronology.java:120)
	at org.joda.time.LocalDateTime.<init>(LocalDateTime.java:385)
	at org.joda.time.TestLocalDateTime_Constructors.testConstructor_Object_nullDateTimeZone(TestLocalDateTime_Constructors.java:554)

testConstructor_Object_Chronology(org.joda.time.TestLocalDateTime_Constructors)  Time elapsed: 0.001 sec  <<< ERROR!
org.joda.time.IllegalFieldValueException: Value -23 for dayOfMonth must be in the range [1,31]
	at org.joda.time.field.FieldUtils.verifyValueBounds(FieldUtils.java:252)
	at org.joda.time.chrono.BasicChronology.getDateMidnightMillis(BasicChronology.java:613)
	at org.joda.time.chrono.BasicChronology.getDateTimeMillis(BasicChronology.java:159)
	at org.joda.time.chrono.GregorianChronology.getDateTimeMillis(GregorianChronology.java:44)
	at org.joda.time.LocalDateTime.<init>(LocalDateTime.java:415)
	at org.joda.time.TestLocalDateTime_Constructors.testConstructor_Object_Chronology(TestLocalDateTime_Constructors.java:580)

testConstructor_Object_nullChronology(org.joda.time.TestLocalDateTime_Constructors)  Time elapsed: 0.001 sec  <<< ERROR!
org.joda.time.IllegalFieldValueException: Value -23 for dayOfMonth must be in the range [1,31]
	at org.joda.time.field.FieldUtils.verifyValueBounds(FieldUtils.java:252)
	at org.joda.time.chrono.BasicChronology.getDateMidnightMillis(BasicChronology.java:613)
	at org.joda.time.chrono.BasicChronology.getDateTimeMillis(BasicChronology.java:159)
	at org.joda.time.chrono.GregorianChronology.getDateTimeMillis(GregorianChronology.java:44)
	at org.joda.time.chrono.AssembledChronology.getDateTimeMillis(AssembledChronology.java:120)
	at org.joda.time.LocalDateTime.<init>(LocalDateTime.java:415)
	at org.joda.time.TestLocalDateTime_Constructors.testConstructor_Object_nullChronology(TestLocalDateTime_Constructors.java:646)

testConstructor_Object_DateTimeZoneMoscow(org.joda.time.TestLocalDateTime_Constructors)  Time elapsed: 0.001 sec  <<< FAILURE!
junit.framework.AssertionFailedError: expected:<4> but was:<5>
	at junit.framework.Assert.fail(Assert.java:47)
	at junit.framework.Assert.failNotEquals(Assert.java:280)
	at junit.framework.Assert.assertEquals(Assert.java:64)
	at junit.framework.Assert.assertEquals(Assert.java:198)
	at junit.framework.Assert.assertEquals(Assert.java:204)
	at org.joda.time.TestLocalDateTime_Constructors.testConstructor_Object_DateTimeZoneMoscow(TestLocalDateTime_Constructors.java:516)

testConstructor_Object_DateTimeZoneMoscowBadDateTime(org.joda.time.TestLocalDateTime_Constructors)  Time elapsed: 0 sec  <<< FAILURE!
junit.framework.AssertionFailedError: expected:<4> but was:<5>
	at junit.framework.Assert.fail(Assert.java:47)
	at junit.framework.Assert.failNotEquals(Assert.java:280)
	at junit.framework.Assert.assertEquals(Assert.java:64)
	at junit.framework.Assert.assertEquals(Assert.java:198)
	at junit.framework.Assert.assertEquals(Assert.java:204)
	at org.joda.time.TestLocalDateTime_Constructors.testConstructor_Object_DateTimeZoneMoscowBadDateTime(TestLocalDateTime_Constructors.java:532)

testConstructor_Object_Chronology_crossChronology(org.joda.time.TestLocalDateTime_Constructors)  Time elapsed: 0.001 sec  <<< ERROR!
org.joda.time.IllegalFieldValueException: Value -23 for dayOfMonth must not be smaller than 1
	at org.joda.time.chrono.BaseChronology.validate(BaseChronology.java:188)
	at org.joda.time.convert.ReadablePartialConverter.getPartialValues(ReadablePartialConverter.java:93)
	at org.joda.time.convert.AbstractConverter.getPartialValues(AbstractConverter.java:123)
	at org.joda.time.LocalDateTime.<init>(LocalDateTime.java:414)
	at org.joda.time.TestLocalDateTime_Constructors.testConstructor_Object_Chronology_crossChronology(TestLocalDateTime_Constructors.java:593)

testConstructor_Object_ChronologyMoscow(org.joda.time.TestLocalDateTime_Constructors)  Time elapsed: 0.001 sec  <<< FAILURE!
junit.framework.AssertionFailedError: expected:<4> but was:<5>
	at junit.framework.Assert.fail(Assert.java:47)
	at junit.framework.Assert.failNotEquals(Assert.java:280)
	at junit.framework.Assert.assertEquals(Assert.java:64)
	at junit.framework.Assert.assertEquals(Assert.java:198)
	at junit.framework.Assert.assertEquals(Assert.java:204)
	at org.joda.time.TestLocalDateTime_Constructors.testConstructor_Object_ChronologyMoscow(TestLocalDateTime_Constructors.java:608)

testConstructor_Object_ChronologyMoscowBadDateTime(org.joda.time.TestLocalDateTime_Constructors)  Time elapsed: 0 sec  <<< FAILURE!
junit.framework.AssertionFailedError: expected:<4> but was:<5>
	at junit.framework.Assert.fail(Assert.java:47)
	at junit.framework.Assert.failNotEquals(Assert.java:280)
	at junit.framework.Assert.assertEquals(Assert.java:64)
	at junit.framework.Assert.assertEquals(Assert.java:198)
	at junit.framework.Assert.assertEquals(Assert.java:204)
	at org.joda.time.TestLocalDateTime_Constructors.testConstructor_Object_ChronologyMoscowBadDateTime(TestLocalDateTime_Constructors.java:624)

testConstructor_Object1(org.joda.time.TestLocalDateTime_Constructors)  Time elapsed: 0.001 sec  <<< ERROR!
org.joda.time.IllegalFieldValueException: Value -23 for dayOfMonth must be in the range [1,31]
	at org.joda.time.field.FieldUtils.verifyValueBounds(FieldUtils.java:252)
	at org.joda.time.chrono.BasicChronology.getDateMidnightMillis(BasicChronology.java:613)
	at org.joda.time.chrono.BasicChronology.getDateTimeMillis(BasicChronology.java:159)
	at org.joda.time.chrono.GregorianChronology.getDateTimeMillis(GregorianChronology.java:44)
	at org.joda.time.chrono.AssembledChronology.getDateTimeMillis(AssembledChronology.java:120)
	at org.joda.time.LocalDateTime.<init>(LocalDateTime.java:415)
	at org.joda.time.LocalDateTime.<init>(LocalDateTime.java:358)
	at org.joda.time.TestLocalDateTime_Constructors.testConstructor_Object1(TestLocalDateTime_Constructors.java:356)

testMinusMonths_int(org.joda.time.TestLocalDateTime_Basics)  Time elapsed: 0.002 sec  <<< ERROR!
org.joda.time.IllegalFieldValueException: Value -26 for dayOfMonth must be in the range [1,31]
	at org.joda.time.field.FieldUtils.verifyValueBounds(FieldUtils.java:234)
	at org.joda.time.field.PreciseDurationDateTimeField.set(PreciseDurationDateTimeField.java:79)
	at org.joda.time.chrono.GJChronology$CutoverField.set(GJChronology.java:740)
	at org.joda.time.chrono.LimitChronology$LimitDateTimeField.set(LimitChronology.java:511)
	at org.joda.time.chrono.BaseChronology.set(BaseChronology.java:240)
	at org.joda.time.format.DateTimeFormatterBuilder$Fraction.printTo(DateTimeFormatterBuilder.java:1805)
	at org.joda.time.format.DateTimeFormatterBuilder$Composite.printTo(DateTimeFormatterBuilder.java:2446)
	at org.joda.time.format.DateTimeFormatter.printTo(DateTimeFormatter.java:609)
	at org.joda.time.format.DateTimeFormatter.print(DateTimeFormatter.java:663)
	at org.joda.time.LocalDateTime.toString(LocalDateTime.java:2087)
	at java.lang.String.valueOf(String.java:2847)
	at java.lang.StringBuffer.append(StringBuffer.java:232)
	at junit.framework.Assert.format(Assert.java:287)
	at junit.framework.Assert.failNotEquals(Assert.java:280)
	at junit.framework.Assert.assertEquals(Assert.java:64)
	at junit.framework.Assert.assertEquals(Assert.java:71)
	at org.joda.time.TestLocalDateTime_Basics.testMinusMonths_int(TestLocalDateTime_Basics.java:649)

testMinusWeeks_int(org.joda.time.TestLocalDateTime_Basics)  Time elapsed: 0.001 sec  <<< ERROR!
org.joda.time.IllegalFieldValueException: Value -3 for dayOfMonth must be in the range [1,31]
	at org.joda.time.field.FieldUtils.verifyValueBounds(FieldUtils.java:234)
	at org.joda.time.field.PreciseDurationDateTimeField.set(PreciseDurationDateTimeField.java:79)
	at org.joda.time.chrono.GJChronology$CutoverField.set(GJChronology.java:740)
	at org.joda.time.chrono.LimitChronology$LimitDateTimeField.set(LimitChronology.java:511)
	at org.joda.time.chrono.BaseChronology.set(BaseChronology.java:240)
	at org.joda.time.format.DateTimeFormatterBuilder$Fraction.printTo(DateTimeFormatterBuilder.java:1805)
	at org.joda.time.format.DateTimeFormatterBuilder$Composite.printTo(DateTimeFormatterBuilder.java:2446)
	at org.joda.time.format.DateTimeFormatter.printTo(DateTimeFormatter.java:609)
	at org.joda.time.format.DateTimeFormatter.print(DateTimeFormatter.java:663)
	at org.joda.time.LocalDateTime.toString(LocalDateTime.java:2087)
	at java.lang.String.valueOf(String.java:2847)
	at java.lang.StringBuffer.append(StringBuffer.java:232)
	at junit.framework.Assert.format(Assert.java:287)
	at junit.framework.Assert.failNotEquals(Assert.java:280)
	at junit.framework.Assert.assertEquals(Assert.java:64)
	at junit.framework.Assert.assertEquals(Assert.java:71)
	at org.joda.time.TestLocalDateTime_Basics.testMinusWeeks_int(TestLocalDateTime_Basics.java:659)

testToDate_springDST(org.joda.time.TestLocalDateTime_Basics)  Time elapsed: 0.001 sec  <<< FAILURE!
junit.framework.AssertionFailedError: expected:<4> but was:<5>
	at junit.framework.Assert.fail(Assert.java:47)
	at junit.framework.Assert.failNotEquals(Assert.java:280)
	at junit.framework.Assert.assertEquals(Assert.java:64)
	at junit.framework.Assert.assertEquals(Assert.java:198)
	at junit.framework.Assert.assertEquals(Assert.java:204)
	at org.joda.time.TestLocalDateTime_Basics.check(TestLocalDateTime_Basics.java:1102)
	at org.joda.time.TestLocalDateTime_Basics.testToDate_springDST(TestLocalDateTime_Basics.java:895)

testToDate_springDST_2Hour40Savings(org.joda.time.TestLocalDateTime_Basics)  Time elapsed: 0 sec  <<< FAILURE!
junit.framework.AssertionFailedError: expected:<4> but was:<5>
	at junit.framework.Assert.fail(Assert.java:47)
	at junit.framework.Assert.failNotEquals(Assert.java:280)
	at junit.framework.Assert.assertEquals(Assert.java:64)
	at junit.framework.Assert.assertEquals(Assert.java:198)
	at junit.framework.Assert.assertEquals(Assert.java:204)
	at org.joda.time.TestLocalDateTime_Basics.check(TestLocalDateTime_Basics.java:1102)
	at org.joda.time.TestLocalDateTime_Basics.testToDate_springDST_2Hour40Savings(TestLocalDateTime_Basics.java:911)

testToDate_springDST_Zone(org.joda.time.TestLocalDateTime_Basics)  Time elapsed: 0 sec  <<< FAILURE!
junit.framework.AssertionFailedError: expected:<4> but was:<5>
	at junit.framework.Assert.fail(Assert.java:47)
	at junit.framework.Assert.failNotEquals(Assert.java:280)
	at junit.framework.Assert.assertEquals(Assert.java:64)
	at junit.framework.Assert.assertEquals(Assert.java:198)
	at junit.framework.Assert.assertEquals(Assert.java:204)
	at org.joda.time.TestLocalDateTime_Basics.check(TestLocalDateTime_Basics.java:1102)
	at org.joda.time.TestLocalDateTime_Basics.testToDate_springDST_Zone(TestLocalDateTime_Basics.java:980)

testToDate_springDST_2Hour40Savings_Zone(org.joda.time.TestLocalDateTime_Basics)  Time elapsed: 0.001 sec  <<< FAILURE!
junit.framework.AssertionFailedError: expected:<4> but was:<5>
	at junit.framework.Assert.fail(Assert.java:47)
	at junit.framework.Assert.failNotEquals(Assert.java:280)
	at junit.framework.Assert.assertEquals(Assert.java:64)
	at junit.framework.Assert.assertEquals(Assert.java:198)
	at junit.framework.Assert.assertEquals(Assert.java:204)
	at org.joda.time.TestLocalDateTime_Basics.check(TestLocalDateTime_Basics.java:1102)
	at org.joda.time.TestLocalDateTime_Basics.testToDate_springDST_2Hour40Savings_Zone(TestLocalDateTime_Basics.java:996)

testPropertyCompareToMonth(org.joda.time.TestLocalDateTime_Properties)  Time elapsed: 0 sec  <<< FAILURE!
junit.framework.AssertionFailedError: expected:<true> but was:<false>
	at junit.framework.Assert.fail(Assert.java:47)
	at junit.framework.Assert.failNotEquals(Assert.java:280)
	at junit.framework.Assert.assertEquals(Assert.java:64)
	at junit.framework.Assert.assertEquals(Assert.java:146)
	at junit.framework.Assert.assertEquals(Assert.java:152)
	at org.joda.time.TestLocalDateTime_Properties.testPropertyCompareToMonth(TestLocalDateTime_Properties.java:322)

testConstructor_long1(org.joda.time.TestLocalDate_Constructors)  Time elapsed: 0 sec  <<< FAILURE!
junit.framework.AssertionFailedError: expected:<4> but was:<5>
	at junit.framework.Assert.fail(Assert.java:47)
	at junit.framework.Assert.failNotEquals(Assert.java:280)
	at junit.framework.Assert.assertEquals(Assert.java:64)
	at junit.framework.Assert.assertEquals(Assert.java:198)
	at junit.framework.Assert.assertEquals(Assert.java:204)
	at org.joda.time.TestLocalDate_Constructors.testConstructor_long1(TestLocalDate_Constructors.java:229)

testConstructor_long1_DateTimeZone(org.joda.time.TestLocalDate_Constructors)  Time elapsed: 0 sec  <<< FAILURE!
junit.framework.AssertionFailedError: expected:<4> but was:<5>
	at junit.framework.Assert.fail(Assert.java:47)
	at junit.framework.Assert.failNotEquals(Assert.java:280)
	at junit.framework.Assert.assertEquals(Assert.java:64)
	at junit.framework.Assert.assertEquals(Assert.java:198)
	at junit.framework.Assert.assertEquals(Assert.java:204)
	at org.joda.time.TestLocalDate_Constructors.testConstructor_long1_DateTimeZone(TestLocalDate_Constructors.java:245)

testConstructor_long_nullDateTimeZone(org.joda.time.TestLocalDate_Constructors)  Time elapsed: 0.001 sec  <<< FAILURE!
junit.framework.AssertionFailedError: expected:<4> but was:<5>
	at junit.framework.Assert.fail(Assert.java:47)
	at junit.framework.Assert.failNotEquals(Assert.java:280)
	at junit.framework.Assert.assertEquals(Assert.java:64)
	at junit.framework.Assert.assertEquals(Assert.java:198)
	at junit.framework.Assert.assertEquals(Assert.java:204)
	at org.joda.time.TestLocalDate_Constructors.testConstructor_long_nullDateTimeZone(TestLocalDate_Constructors.java:286)

testConstructor_long1_Chronology(org.joda.time.TestLocalDate_Constructors)  Time elapsed: 0.001 sec  <<< FAILURE!
junit.framework.AssertionFailedError: expected:<4> but was:<5>
	at junit.framework.Assert.fail(Assert.java:47)
	at junit.framework.Assert.failNotEquals(Assert.java:280)
	at junit.framework.Assert.assertEquals(Assert.java:64)
	at junit.framework.Assert.assertEquals(Assert.java:198)
	at junit.framework.Assert.assertEquals(Assert.java:204)
	at org.joda.time.TestLocalDate_Constructors.testConstructor_long1_Chronology(TestLocalDate_Constructors.java:294)

testConstructor_long_nullChronology(org.joda.time.TestLocalDate_Constructors)  Time elapsed: 0.001 sec  <<< FAILURE!
junit.framework.AssertionFailedError: expected:<4> but was:<5>
	at junit.framework.Assert.fail(Assert.java:47)
	at junit.framework.Assert.failNotEquals(Assert.java:280)
	at junit.framework.Assert.assertEquals(Assert.java:64)
	at junit.framework.Assert.assertEquals(Assert.java:198)
	at junit.framework.Assert.assertEquals(Assert.java:204)
	at org.joda.time.TestLocalDate_Constructors.testConstructor_long_nullChronology(TestLocalDate_Constructors.java:310)

testConstructor_Object_DateTimeZone(org.joda.time.TestLocalDate_Constructors)  Time elapsed: 0 sec  <<< ERROR!
org.joda.time.IllegalFieldValueException: Value -23 for dayOfMonth must be in the range [1,31]
	at org.joda.time.field.FieldUtils.verifyValueBounds(FieldUtils.java:252)
	at org.joda.time.chrono.BasicChronology.getDateMidnightMillis(BasicChronology.java:613)
	at org.joda.time.chrono.BasicChronology.getDateTimeMillis(BasicChronology.java:159)
	at org.joda.time.chrono.GregorianChronology.getDateTimeMillis(GregorianChronology.java:44)
	at org.joda.time.chrono.AssembledChronology.getDateTimeMillis(AssembledChronology.java:120)
	at org.joda.time.LocalDate.<init>(LocalDate.java:390)
	at org.joda.time.TestLocalDate_Constructors.testConstructor_Object_DateTimeZone(TestLocalDate_Constructors.java:444)

testConstructor_Object_nullDateTimeZone(org.joda.time.TestLocalDate_Constructors)  Time elapsed: 0 sec  <<< ERROR!
org.joda.time.IllegalFieldValueException: Value -23 for dayOfMonth must be in the range [1,31]
	at org.joda.time.field.FieldUtils.verifyValueBounds(FieldUtils.java:252)
	at org.joda.time.chrono.BasicChronology.getDateMidnightMillis(BasicChronology.java:613)
	at org.joda.time.chrono.BasicChronology.getDateTimeMillis(BasicChronology.java:159)
	at org.joda.time.chrono.GregorianChronology.getDateTimeMillis(GregorianChronology.java:44)
	at org.joda.time.chrono.AssembledChronology.getDateTimeMillis(AssembledChronology.java:120)
	at org.joda.time.LocalDate.<init>(LocalDate.java:390)
	at org.joda.time.TestLocalDate_Constructors.testConstructor_Object_nullDateTimeZone(TestLocalDate_Constructors.java:461)

testConstructor_Object_Chronology(org.joda.time.TestLocalDate_Constructors)  Time elapsed: 0.001 sec  <<< ERROR!
org.joda.time.IllegalFieldValueException: Value -23 for dayOfMonth must be in the range [1,31]
	at org.joda.time.field.FieldUtils.verifyValueBounds(FieldUtils.java:252)
	at org.joda.time.chrono.BasicChronology.getDateMidnightMillis(BasicChronology.java:613)
	at org.joda.time.chrono.BasicChronology.getDateTimeMillis(BasicChronology.java:159)
	at org.joda.time.chrono.GregorianChronology.getDateTimeMillis(GregorianChronology.java:44)
	at org.joda.time.LocalDate.<init>(LocalDate.java:420)
	at org.joda.time.TestLocalDate_Constructors.testConstructor_Object_Chronology(TestLocalDate_Constructors.java:478)

testConstructor_Object_nullChronology(org.joda.time.TestLocalDate_Constructors)  Time elapsed: 0 sec  <<< ERROR!
org.joda.time.IllegalFieldValueException: Value -23 for dayOfMonth must be in the range [1,31]
	at org.joda.time.field.FieldUtils.verifyValueBounds(FieldUtils.java:252)
	at org.joda.time.chrono.BasicChronology.getDateMidnightMillis(BasicChronology.java:613)
	at org.joda.time.chrono.BasicChronology.getDateTimeMillis(BasicChronology.java:159)
	at org.joda.time.chrono.GregorianChronology.getDateTimeMillis(GregorianChronology.java:44)
	at org.joda.time.chrono.AssembledChronology.getDateTimeMillis(AssembledChronology.java:120)
	at org.joda.time.LocalDate.<init>(LocalDate.java:420)
	at org.joda.time.TestLocalDate_Constructors.testConstructor_Object_nullChronology(TestLocalDate_Constructors.java:504)

testConstructor_ObjectLocalDate(org.joda.time.TestLocalDate_Constructors)  Time elapsed: 0 sec  <<< FAILURE!
junit.framework.AssertionFailedError: expected:<4> but was:<5>
	at junit.framework.Assert.fail(Assert.java:47)
	at junit.framework.Assert.failNotEquals(Assert.java:280)
	at junit.framework.Assert.assertEquals(Assert.java:64)
	at junit.framework.Assert.assertEquals(Assert.java:198)
	at junit.framework.Assert.assertEquals(Assert.java:204)
	at org.joda.time.TestLocalDate_Constructors.testConstructor_ObjectLocalDate(TestLocalDate_Constructors.java:410)

testConstructor_Object_Chronology_crossChronology(org.joda.time.TestLocalDate_Constructors)  Time elapsed: 0.001 sec  <<< ERROR!
org.joda.time.IllegalFieldValueException: Value -24 for dayOfMonth must not be smaller than 1
	at org.joda.time.chrono.BaseChronology.validate(BaseChronology.java:188)
	at org.joda.time.convert.ReadablePartialConverter.getPartialValues(ReadablePartialConverter.java:93)
	at org.joda.time.convert.AbstractConverter.getPartialValues(AbstractConverter.java:123)
	at org.joda.time.LocalDate.<init>(LocalDate.java:419)
	at org.joda.time.TestLocalDate_Constructors.testConstructor_Object_Chronology_crossChronology(TestLocalDate_Constructors.java:487)

testConstructor_Object1(org.joda.time.TestLocalDate_Constructors)  Time elapsed: 0.001 sec  <<< ERROR!
org.joda.time.IllegalFieldValueException: Value -23 for dayOfMonth must be in the range [1,31]
	at org.joda.time.field.FieldUtils.verifyValueBounds(FieldUtils.java:252)
	at org.joda.time.chrono.BasicChronology.getDateMidnightMillis(BasicChronology.java:613)
	at org.joda.time.chrono.BasicChronology.getDateTimeMillis(BasicChronology.java:159)
	at org.joda.time.chrono.GregorianChronology.getDateTimeMillis(GregorianChronology.java:44)
	at org.joda.time.chrono.AssembledChronology.getDateTimeMillis(AssembledChronology.java:120)
	at org.joda.time.LocalDate.<init>(LocalDate.java:420)
	at org.joda.time.LocalDate.<init>(LocalDate.java:363)
	at org.joda.time.TestLocalDate_Constructors.testConstructor_Object1(TestLocalDate_Constructors.java:317)

testConstructor_ObjectYearMonthDay(org.joda.time.TestLocalDate_Constructors)  Time elapsed: 0.001 sec  <<< FAILURE!
junit.framework.AssertionFailedError: expected:<4> but was:<5>
	at junit.framework.Assert.fail(Assert.java:47)
	at junit.framework.Assert.failNotEquals(Assert.java:280)
	at junit.framework.Assert.assertEquals(Assert.java:64)
	at junit.framework.Assert.assertEquals(Assert.java:198)
	at junit.framework.Assert.assertEquals(Assert.java:204)
	at org.joda.time.TestLocalDate_Constructors.testConstructor_ObjectYearMonthDay(TestLocalDate_Constructors.java:437)

testMinusMonths_int(org.joda.time.TestLocalDate_Basics)  Time elapsed: 0 sec  <<< FAILURE!
junit.framework.AssertionFailedError: expected:<2002-05-03> but was:<2002-05--27>
	at junit.framework.Assert.fail(Assert.java:47)
	at junit.framework.Assert.failNotEquals(Assert.java:280)
	at junit.framework.Assert.assertEquals(Assert.java:64)
	at junit.framework.Assert.assertEquals(Assert.java:71)
	at org.joda.time.TestLocalDate_Basics.testMinusMonths_int(TestLocalDate_Basics.java:596)

testMinusWeeks_int(org.joda.time.TestLocalDate_Basics)  Time elapsed: 0.001 sec  <<< FAILURE!
junit.framework.AssertionFailedError: expected:<2002-05-26> but was:<2002-05--04>
	at junit.framework.Assert.fail(Assert.java:47)
	at junit.framework.Assert.failNotEquals(Assert.java:280)
	at junit.framework.Assert.assertEquals(Assert.java:64)
	at junit.framework.Assert.assertEquals(Assert.java:71)
	at org.joda.time.TestLocalDate_Basics.testMinusWeeks_int(TestLocalDate_Basics.java:606)

testToDateTimeAtStartOfDay_avoidDST(org.joda.time.TestLocalDate_Basics)  Time elapsed: 0.001 sec  <<< FAILURE!
junit.framework.AssertionFailedError: expected:<4> but was:<5>
	at junit.framework.Assert.fail(Assert.java:47)
	at junit.framework.Assert.failNotEquals(Assert.java:280)
	at junit.framework.Assert.assertEquals(Assert.java:64)
	at junit.framework.Assert.assertEquals(Assert.java:198)
	at junit.framework.Assert.assertEquals(Assert.java:204)
	at org.joda.time.TestLocalDate_Basics.check(TestLocalDate_Basics.java:1156)
	at org.joda.time.TestLocalDate_Basics.testToDateTimeAtStartOfDay_avoidDST(TestLocalDate_Basics.java:676)

testToDateTimeAtStartOfDay_Zone_avoidDST(org.joda.time.TestLocalDate_Basics)  Time elapsed: 0 sec  <<< FAILURE!
junit.framework.AssertionFailedError: expected:<4> but was:<5>
	at junit.framework.Assert.fail(Assert.java:47)
	at junit.framework.Assert.failNotEquals(Assert.java:280)
	at junit.framework.Assert.assertEquals(Assert.java:64)
	at junit.framework.Assert.assertEquals(Assert.java:198)
	at junit.framework.Assert.assertEquals(Assert.java:204)
	at org.joda.time.TestLocalDate_Basics.check(TestLocalDate_Basics.java:1156)
	at org.joda.time.TestLocalDate_Basics.testToDateTimeAtStartOfDay_Zone_avoidDST(TestLocalDate_Basics.java:693)

testToInterval_Zone_noMidnight(org.joda.time.TestLocalDate_Basics)  Time elapsed: 0 sec  <<< ERROR!
java.lang.IllegalArgumentException: The datetime zone id 'Asia/Gaza' is not recognised
	at org.joda.time.DateTimeZone.forID(DateTimeZone.java:229)
	at org.joda.time.TestLocalDate_Basics.testToInterval_Zone_noMidnight(TestLocalDate_Basics.java:982)

testToDate_springDST(org.joda.time.TestLocalDate_Basics)  Time elapsed: 0.005 sec  <<< FAILURE!
junit.framework.AssertionFailedError: expected:<4> but was:<5>
	at junit.framework.Assert.fail(Assert.java:47)
	at junit.framework.Assert.failNotEquals(Assert.java:280)
	at junit.framework.Assert.assertEquals(Assert.java:64)
	at junit.framework.Assert.assertEquals(Assert.java:198)
	at junit.framework.Assert.assertEquals(Assert.java:204)
	at org.joda.time.TestLocalDate_Basics.check(TestLocalDate_Basics.java:1156)
	at org.joda.time.TestLocalDate_Basics.testToDate_springDST(TestLocalDate_Basics.java:1039)

testToDate_springDST_2Hour40Savings(org.joda.time.TestLocalDate_Basics)  Time elapsed: 0 sec  <<< FAILURE!
junit.framework.AssertionFailedError: expected:<4> but was:<5>
	at junit.framework.Assert.fail(Assert.java:47)
	at junit.framework.Assert.failNotEquals(Assert.java:280)
	at junit.framework.Assert.assertEquals(Assert.java:64)
	at junit.framework.Assert.assertEquals(Assert.java:198)
	at junit.framework.Assert.assertEquals(Assert.java:204)
	at org.joda.time.TestLocalDate_Basics.check(TestLocalDate_Basics.java:1156)
	at org.joda.time.TestLocalDate_Basics.testToDate_springDST_2Hour40Savings(TestLocalDate_Basics.java:1055)

testPropertyCompareToMonth(org.joda.time.TestLocalDate_Properties)  Time elapsed: 0 sec  <<< FAILURE!
junit.framework.AssertionFailedError: expected:<true> but was:<false>
	at junit.framework.Assert.fail(Assert.java:47)
	at junit.framework.Assert.failNotEquals(Assert.java:280)
	at junit.framework.Assert.assertEquals(Assert.java:64)
	at junit.framework.Assert.assertEquals(Assert.java:146)
	at junit.framework.Assert.assertEquals(Assert.java:152)
	at org.joda.time.TestLocalDate_Properties.testPropertyCompareToMonth(TestLocalDate_Properties.java:317)

testPropertyCompareToDay(org.joda.time.TestLocalDate_Properties)  Time elapsed: 0.001 sec  <<< FAILURE!
junit.framework.AssertionFailedError: expected:<true> but was:<false>
	at junit.framework.Assert.fail(Assert.java:47)
	at junit.framework.Assert.failNotEquals(Assert.java:280)
	at junit.framework.Assert.assertEquals(Assert.java:64)
	at junit.framework.Assert.assertEquals(Assert.java:146)
	at junit.framework.Assert.assertEquals(Assert.java:152)
	at org.joda.time.TestLocalDate_Properties.testPropertyCompareToDay(TestLocalDate_Properties.java:484)

testTest(org.joda.time.TestMutableInterval_Constructors)  Time elapsed: 0.001 sec  <<< FAILURE!
junit.framework.ComparisonFailure: expected:<2002-0[4-05]T12:24:00.000Z> but was:<2002-0[5--24]T12:24:00.000Z>
	at junit.framework.Assert.assertEquals(Assert.java:81)
	at junit.framework.Assert.assertEquals(Assert.java:87)
	at org.joda.time.TestMutableInterval_Constructors.testTest(TestMutableInterval_Constructors.java:106)

testTest(org.joda.time.TestMutableInterval_Basics)  Time elapsed: 0 sec  <<< FAILURE!
junit.framework.ComparisonFailure: expected:<2002-0[4-05]T12:24:00.000Z> but was:<2002-0[5--24]T12:24:00.000Z>
	at junit.framework.Assert.assertEquals(Assert.java:81)
	at junit.framework.Assert.assertEquals(Assert.java:87)
	at org.joda.time.TestMutableInterval_Basics.testTest(TestMutableInterval_Basics.java:110)

testTest(org.joda.time.TestMutableInterval_Updates)  Time elapsed: 0 sec  <<< FAILURE!
junit.framework.ComparisonFailure: expected:<2002-0[4-05]T12:24:00.000Z> but was:<2002-0[5--24]T12:24:00.000Z>
	at junit.framework.Assert.assertEquals(Assert.java:81)
	at junit.framework.Assert.assertEquals(Assert.java:87)
	at org.joda.time.TestMutableInterval_Updates.testTest(TestMutableInterval_Updates.java:103)

testTest(org.joda.time.TestPeriod_Basics)  Time elapsed: 0.001 sec  <<< FAILURE!
junit.framework.ComparisonFailure: expected:<2002-0[4-05]T12:24:00.000Z> but was:<2002-0[5--24]T12:24:00.000Z>
	at junit.framework.Assert.assertEquals(Assert.java:81)
	at junit.framework.Assert.assertEquals(Assert.java:87)
	at org.joda.time.TestPeriod_Basics.testTest(TestPeriod_Basics.java:110)

testTest(org.joda.time.TestMutablePeriod_Basics)  Time elapsed: 0 sec  <<< FAILURE!
junit.framework.ComparisonFailure: expected:<2002-0[4-05]T12:24:00.000Z> but was:<2002-0[5--24]T12:24:00.000Z>
	at junit.framework.Assert.assertEquals(Assert.java:81)
	at junit.framework.Assert.assertEquals(Assert.java:87)
	at org.joda.time.TestMutablePeriod_Basics.testTest(TestMutablePeriod_Basics.java:106)

testTest(org.joda.time.TestMutablePeriod_Updates)  Time elapsed: 0.001 sec  <<< FAILURE!
junit.framework.ComparisonFailure: expected:<2002-0[4-05]T12:24:00.000Z> but was:<2002-0[5--24]T12:24:00.000Z>
	at junit.framework.Assert.assertEquals(Assert.java:81)
	at junit.framework.Assert.assertEquals(Assert.java:87)
	at org.joda.time.TestMutablePeriod_Updates.testTest(TestMutablePeriod_Updates.java:102)

testConstructor_long1(org.joda.time.TestYearMonthDay_Constructors)  Time elapsed: 0 sec  <<< FAILURE!
junit.framework.AssertionFailedError: expected:<4> but was:<5>
	at junit.framework.Assert.fail(Assert.java:47)
	at junit.framework.Assert.failNotEquals(Assert.java:280)
	at junit.framework.Assert.assertEquals(Assert.java:64)
	at junit.framework.Assert.assertEquals(Assert.java:198)
	at junit.framework.Assert.assertEquals(Assert.java:204)
	at org.joda.time.TestYearMonthDay_Constructors.testConstructor_long1(TestYearMonthDay_Constructors.java:183)

testConstructor_Object(org.joda.time.TestYearMonthDay_Constructors)  Time elapsed: 0.001 sec  <<< FAILURE!
junit.framework.AssertionFailedError: expected:<4> but was:<5>
	at junit.framework.Assert.fail(Assert.java:47)
	at junit.framework.Assert.failNotEquals(Assert.java:280)
	at junit.framework.Assert.assertEquals(Assert.java:64)
	at junit.framework.Assert.assertEquals(Assert.java:198)
	at junit.framework.Assert.assertEquals(Assert.java:204)
	at org.joda.time.TestYearMonthDay_Constructors.testConstructor_Object(TestYearMonthDay_Constructors.java:237)

testConstructor_long1_Chronology(org.joda.time.TestYearMonthDay_Constructors)  Time elapsed: 0.001 sec  <<< FAILURE!
junit.framework.AssertionFailedError: expected:<4> but was:<5>
	at junit.framework.Assert.fail(Assert.java:47)
	at junit.framework.Assert.failNotEquals(Assert.java:280)
	at junit.framework.Assert.assertEquals(Assert.java:64)
	at junit.framework.Assert.assertEquals(Assert.java:198)
	at junit.framework.Assert.assertEquals(Assert.java:204)
	at org.joda.time.TestYearMonthDay_Constructors.testConstructor_long1_Chronology(TestYearMonthDay_Constructors.java:205)

testConstructor_long_nullChronology(org.joda.time.TestYearMonthDay_Constructors)  Time elapsed: 0 sec  <<< FAILURE!
junit.framework.AssertionFailedError: expected:<4> but was:<5>
	at junit.framework.Assert.fail(Assert.java:47)
	at junit.framework.Assert.failNotEquals(Assert.java:280)
	at junit.framework.Assert.assertEquals(Assert.java:64)
	at junit.framework.Assert.assertEquals(Assert.java:198)
	at junit.framework.Assert.assertEquals(Assert.java:204)
	at org.joda.time.TestYearMonthDay_Constructors.testConstructor_long_nullChronology(TestYearMonthDay_Constructors.java:227)

testConstructor_Object_Chronology(org.joda.time.TestYearMonthDay_Constructors)  Time elapsed: 0.001 sec  <<< FAILURE!
junit.framework.AssertionFailedError: expected:<4> but was:<5>
	at junit.framework.Assert.fail(Assert.java:47)
	at junit.framework.Assert.failNotEquals(Assert.java:280)
	at junit.framework.Assert.assertEquals(Assert.java:64)
	at junit.framework.Assert.assertEquals(Assert.java:198)
	at junit.framework.Assert.assertEquals(Assert.java:204)
	at org.joda.time.TestYearMonthDay_Constructors.testConstructor_Object_Chronology(TestYearMonthDay_Constructors.java:334)

testConstructor_Object_nullChronology(org.joda.time.TestYearMonthDay_Constructors)  Time elapsed: 0 sec  <<< FAILURE!
junit.framework.AssertionFailedError: expected:<4> but was:<5>
	at junit.framework.Assert.fail(Assert.java:47)
	at junit.framework.Assert.failNotEquals(Assert.java:280)
	at junit.framework.Assert.assertEquals(Assert.java:64)
	at junit.framework.Assert.assertEquals(Assert.java:198)
	at junit.framework.Assert.assertEquals(Assert.java:204)
	at org.joda.time.TestYearMonthDay_Constructors.testConstructor_Object_nullChronology(TestYearMonthDay_Constructors.java:357)

testPropertyCompareToMonth(org.joda.time.TestYearMonthDay_Properties)  Time elapsed: 0 sec  <<< FAILURE!
junit.framework.AssertionFailedError: expected:<true> but was:<false>
	at junit.framework.Assert.fail(Assert.java:47)
	at junit.framework.Assert.failNotEquals(Assert.java:280)
	at junit.framework.Assert.assertEquals(Assert.java:64)
	at junit.framework.Assert.assertEquals(Assert.java:146)
	at junit.framework.Assert.assertEquals(Assert.java:152)
	at org.joda.time.TestYearMonthDay_Properties.testPropertyCompareToMonth(TestYearMonthDay_Properties.java:320)

testConstructor_long1(org.joda.time.TestYearMonth_Constructors)  Time elapsed: 0 sec  <<< FAILURE!
junit.framework.AssertionFailedError: expected:<4> but was:<5>
	at junit.framework.Assert.fail(Assert.java:47)
	at junit.framework.Assert.failNotEquals(Assert.java:280)
	at junit.framework.Assert.assertEquals(Assert.java:64)
	at junit.framework.Assert.assertEquals(Assert.java:198)
	at junit.framework.Assert.assertEquals(Assert.java:204)
	at org.joda.time.TestYearMonth_Constructors.testConstructor_long1(TestYearMonth_Constructors.java:193)

testConstructor_Object(org.joda.time.TestYearMonth_Constructors)  Time elapsed: 0 sec  <<< FAILURE!
junit.framework.AssertionFailedError: expected:<4> but was:<5>
	at junit.framework.Assert.fail(Assert.java:47)
	at junit.framework.Assert.failNotEquals(Assert.java:280)
	at junit.framework.Assert.assertEquals(Assert.java:64)
	at junit.framework.Assert.assertEquals(Assert.java:198)
	at junit.framework.Assert.assertEquals(Assert.java:204)
	at org.joda.time.TestYearMonth_Constructors.testConstructor_Object(TestYearMonth_Constructors.java:242)

testConstructor_long1_Chronology(org.joda.time.TestYearMonth_Constructors)  Time elapsed: 0.001 sec  <<< FAILURE!
junit.framework.AssertionFailedError: expected:<4> but was:<5>
	at junit.framework.Assert.fail(Assert.java:47)
	at junit.framework.Assert.failNotEquals(Assert.java:280)
	at junit.framework.Assert.assertEquals(Assert.java:64)
	at junit.framework.Assert.assertEquals(Assert.java:198)
	at junit.framework.Assert.assertEquals(Assert.java:204)
	at org.joda.time.TestYearMonth_Constructors.testConstructor_long1_Chronology(TestYearMonth_Constructors.java:213)

testConstructor_long_nullChronology(org.joda.time.TestYearMonth_Constructors)  Time elapsed: 0.001 sec  <<< FAILURE!
junit.framework.AssertionFailedError: expected:<4> but was:<5>
	at junit.framework.Assert.fail(Assert.java:47)
	at junit.framework.Assert.failNotEquals(Assert.java:280)
	at junit.framework.Assert.assertEquals(Assert.java:64)
	at junit.framework.Assert.assertEquals(Assert.java:198)
	at junit.framework.Assert.assertEquals(Assert.java:204)
	at org.joda.time.TestYearMonth_Constructors.testConstructor_long_nullChronology(TestYearMonth_Constructors.java:233)

testConstructor_Object_Chronology(org.joda.time.TestYearMonth_Constructors)  Time elapsed: 0 sec  <<< FAILURE!
junit.framework.AssertionFailedError: expected:<4> but was:<5>
	at junit.framework.Assert.fail(Assert.java:47)
	at junit.framework.Assert.failNotEquals(Assert.java:280)
	at junit.framework.Assert.assertEquals(Assert.java:64)
	at junit.framework.Assert.assertEquals(Assert.java:198)
	at junit.framework.Assert.assertEquals(Assert.java:204)
	at org.joda.time.TestYearMonth_Constructors.testConstructor_Object_Chronology(TestYearMonth_Constructors.java:311)

testConstructor_Object_nullChronology(org.joda.time.TestYearMonth_Constructors)  Time elapsed: 0 sec  <<< FAILURE!
junit.framework.AssertionFailedError: expected:<4> but was:<5>
	at junit.framework.Assert.fail(Assert.java:47)
	at junit.framework.Assert.failNotEquals(Assert.java:280)
	at junit.framework.Assert.assertEquals(Assert.java:64)
	at junit.framework.Assert.assertEquals(Assert.java:198)
	at junit.framework.Assert.assertEquals(Assert.java:204)
	at org.joda.time.TestYearMonth_Constructors.testConstructor_Object_nullChronology(TestYearMonth_Constructors.java:332)

testPropertyCompareToMonth(org.joda.time.TestYearMonth_Properties)  Time elapsed: 0.001 sec  <<< FAILURE!
junit.framework.AssertionFailedError: expected:<true> but was:<false>
	at junit.framework.Assert.fail(Assert.java:47)
	at junit.framework.Assert.failNotEquals(Assert.java:280)
	at junit.framework.Assert.assertEquals(Assert.java:64)
	at junit.framework.Assert.assertEquals(Assert.java:146)
	at junit.framework.Assert.assertEquals(Assert.java:152)
	at org.joda.time.TestYearMonth_Properties.testPropertyCompareToMonth(TestYearMonth_Properties.java:287)

testConstructor_long1(org.joda.time.TestMonthDay_Constructors)  Time elapsed: 0 sec  <<< FAILURE!
junit.framework.AssertionFailedError: expected:<4> but was:<5>
	at junit.framework.Assert.fail(Assert.java:47)
	at junit.framework.Assert.failNotEquals(Assert.java:280)
	at junit.framework.Assert.assertEquals(Assert.java:64)
	at junit.framework.Assert.assertEquals(Assert.java:198)
	at junit.framework.Assert.assertEquals(Assert.java:204)
	at org.joda.time.TestMonthDay_Constructors.testConstructor_long1(TestMonthDay_Constructors.java:192)

testConstructor_Object(org.joda.time.TestMonthDay_Constructors)  Time elapsed: 0 sec  <<< FAILURE!
junit.framework.AssertionFailedError: expected:<4> but was:<5>
	at junit.framework.Assert.fail(Assert.java:47)
	at junit.framework.Assert.failNotEquals(Assert.java:280)
	at junit.framework.Assert.assertEquals(Assert.java:64)
	at junit.framework.Assert.assertEquals(Assert.java:198)
	at junit.framework.Assert.assertEquals(Assert.java:204)
	at org.joda.time.TestMonthDay_Constructors.testConstructor_Object(TestMonthDay_Constructors.java:241)

testConstructor_long1_Chronology(org.joda.time.TestMonthDay_Constructors)  Time elapsed: 0 sec  <<< FAILURE!
junit.framework.AssertionFailedError: expected:<4> but was:<5>
	at junit.framework.Assert.fail(Assert.java:47)
	at junit.framework.Assert.failNotEquals(Assert.java:280)
	at junit.framework.Assert.assertEquals(Assert.java:64)
	at junit.framework.Assert.assertEquals(Assert.java:198)
	at junit.framework.Assert.assertEquals(Assert.java:204)
	at org.joda.time.TestMonthDay_Constructors.testConstructor_long1_Chronology(TestMonthDay_Constructors.java:212)

testConstructor_long_nullChronology(org.joda.time.TestMonthDay_Constructors)  Time elapsed: 0 sec  <<< FAILURE!
junit.framework.AssertionFailedError: expected:<4> but was:<5>
	at junit.framework.Assert.fail(Assert.java:47)
	at junit.framework.Assert.failNotEquals(Assert.java:280)
	at junit.framework.Assert.assertEquals(Assert.java:64)
	at junit.framework.Assert.assertEquals(Assert.java:198)
	at junit.framework.Assert.assertEquals(Assert.java:204)
	at org.joda.time.TestMonthDay_Constructors.testConstructor_long_nullChronology(TestMonthDay_Constructors.java:232)

testConstructor_Object_Chronology(org.joda.time.TestMonthDay_Constructors)  Time elapsed: 0.001 sec  <<< FAILURE!
junit.framework.AssertionFailedError: expected:<4> but was:<5>
	at junit.framework.Assert.fail(Assert.java:47)
	at junit.framework.Assert.failNotEquals(Assert.java:280)
	at junit.framework.Assert.assertEquals(Assert.java:64)
	at junit.framework.Assert.assertEquals(Assert.java:198)
	at junit.framework.Assert.assertEquals(Assert.java:204)
	at org.joda.time.TestMonthDay_Constructors.testConstructor_Object_Chronology(TestMonthDay_Constructors.java:310)

testConstructor_Object_nullChronology(org.joda.time.TestMonthDay_Constructors)  Time elapsed: 0 sec  <<< FAILURE!
junit.framework.AssertionFailedError: expected:<4> but was:<5>
	at junit.framework.Assert.fail(Assert.java:47)
	at junit.framework.Assert.failNotEquals(Assert.java:280)
	at junit.framework.Assert.assertEquals(Assert.java:64)
	at junit.framework.Assert.assertEquals(Assert.java:198)
	at junit.framework.Assert.assertEquals(Assert.java:204)
	at org.joda.time.TestMonthDay_Constructors.testConstructor_Object_nullChronology(TestMonthDay_Constructors.java:331)

testPropertyCompareToMonthOfYear(org.joda.time.TestMonthDay_Properties)  Time elapsed: 0.001 sec  <<< FAILURE!
junit.framework.AssertionFailedError: expected:<true> but was:<false>
	at junit.framework.Assert.fail(Assert.java:47)
	at junit.framework.Assert.failNotEquals(Assert.java:280)
	at junit.framework.Assert.assertEquals(Assert.java:64)
	at junit.framework.Assert.assertEquals(Assert.java:146)
	at junit.framework.Assert.assertEquals(Assert.java:152)
	at org.joda.time.TestMonthDay_Properties.testPropertyCompareToMonthOfYear(TestMonthDay_Properties.java:156)

testListDOW(org.joda.time.TestDateTimeComparator)  Time elapsed: 0.001 sec  <<< FAILURE!
junit.framework.AssertionFailedError: ListDOW expected:<true> but was:<false>
	at junit.framework.Assert.fail(Assert.java:47)
	at junit.framework.Assert.failNotEquals(Assert.java:280)
	at junit.framework.Assert.assertEquals(Assert.java:64)
	at junit.framework.Assert.assertEquals(Assert.java:146)
	at org.joda.time.TestDateTimeComparator.testListDOW(TestDateTimeComparator.java:707)

testDOW(org.joda.time.TestDateTimeComparator)  Time elapsed: 0.001 sec  <<< FAILURE!
junit.framework.AssertionFailedError: DOWM1a expected:<-1> but was:<1>
	at junit.framework.Assert.fail(Assert.java:47)
	at junit.framework.Assert.failNotEquals(Assert.java:280)
	at junit.framework.Assert.assertEquals(Assert.java:64)
	at junit.framework.Assert.assertEquals(Assert.java:198)
	at org.joda.time.TestDateTimeComparator.testDOW(TestDateTimeComparator.java:486)

testMonth(org.joda.time.TestDateTimeComparator)  Time elapsed: 0.001 sec  <<< FAILURE!
junit.framework.AssertionFailedError: MONTHM1a expected:<-1> but was:<0>
	at junit.framework.Assert.fail(Assert.java:47)
	at junit.framework.Assert.failNotEquals(Assert.java:280)
	at junit.framework.Assert.assertEquals(Assert.java:64)
	at junit.framework.Assert.assertEquals(Assert.java:198)
	at org.joda.time.TestDateTimeComparator.testMonth(TestDateTimeComparator.java:557)

testTest(org.joda.time.TestDateTimeUtils)  Time elapsed: 0.001 sec  <<< FAILURE!
junit.framework.ComparisonFailure: expected:<2002-0[4-05]T12:24:00.000Z> but was:<2002-0[5--24]T12:24:00.000Z>
	at junit.framework.Assert.assertEquals(Assert.java:81)
	at junit.framework.Assert.assertEquals(Assert.java:87)
	at org.joda.time.TestDateTimeUtils.testTest(TestDateTimeUtils.java:141)

test_MutableDateTime_setZoneRetainFields_Turk(org.joda.time.TestDateTimeZoneCutover)  Time elapsed: 0.001 sec  <<< FAILURE!
junit.framework.ComparisonFailure: expected:<2007-0[4-01]T00:00:00.000Z> but was:<2007-0[5--29]T00:00:00.000Z>
	at junit.framework.Assert.assertEquals(Assert.java:81)
	at junit.framework.Assert.assertEquals(Assert.java:87)
	at org.joda.time.TestDateTimeZoneCutover.test_MutableDateTime_setZoneRetainFields_Turk(TestDateTimeZoneCutover.java:425)

test_LocalDate_new_Turk(org.joda.time.TestDateTimeZoneCutover)  Time elapsed: 0 sec  <<< FAILURE!
junit.framework.ComparisonFailure: expected:<2007-0[4-01]> but was:<2007-0[5--29]>
	at junit.framework.Assert.assertEquals(Assert.java:81)
	at junit.framework.Assert.assertEquals(Assert.java:87)
	at org.joda.time.TestDateTimeZoneCutover.test_LocalDate_new_Turk(TestDateTimeZoneCutover.java:433)

test_LocalDate_toDateMidnight_Turk(org.joda.time.TestDateTimeZoneCutover)  Time elapsed: 0.001 sec  <<< ERROR!
org.joda.time.IllegalFieldValueException: Value -29 for dayOfMonth must be in the range [1,31]
	at org.joda.time.field.FieldUtils.verifyValueBounds(FieldUtils.java:252)
	at org.joda.time.chrono.BasicChronology.getDateMidnightMillis(BasicChronology.java:613)
	at org.joda.time.chrono.BasicChronology.getDateTimeMillis(BasicChronology.java:177)
	at org.joda.time.chrono.GregorianChronology.getDateTimeMillis(GregorianChronology.java:44)
	at org.joda.time.chrono.AssembledChronology.getDateTimeMillis(AssembledChronology.java:133)
	at org.joda.time.chrono.ZonedChronology.getDateTimeMillis(ZonedChronology.java:118)
	at org.joda.time.chrono.AssembledChronology.getDateTimeMillis(AssembledChronology.java:133)
	at org.joda.time.base.BaseDateTime.<init>(BaseDateTime.java:258)
	at org.joda.time.DateMidnight.<init>(DateMidnight.java:350)
	at org.joda.time.LocalDate.toDateMidnight(LocalDate.java:867)
	at org.joda.time.TestDateTimeZoneCutover.test_LocalDate_toDateMidnight_Turk(TestDateTimeZoneCutover.java:442)

test_DateTime_parse_Turk(org.joda.time.TestDateTimeZoneCutover)  Time elapsed: 0.001 sec  <<< FAILURE!
junit.framework.AssertionFailedError
	at junit.framework.Assert.fail(Assert.java:47)
	at junit.framework.Assert.fail(Assert.java:53)
	at org.joda.time.TestDateTimeZoneCutover.test_DateTime_parse_Turk(TestDateTimeZoneCutover.java:471)

testBug2182444_ausNSW(org.joda.time.TestDateTimeZoneCutover)  Time elapsed: 0.001 sec  <<< FAILURE!
junit.framework.AssertionFailedError: Should be standard time
	at junit.framework.Assert.fail(Assert.java:47)
	at junit.framework.Assert.assertTrue(Assert.java:20)
	at org.joda.time.TestDateTimeZoneCutover.testBug2182444_ausNSW(TestDateTimeZoneCutover.java:1232)

test_DateTime_withZoneRetainFields_Gaza(org.joda.time.TestDateTimeZoneCutover)  Time elapsed: 0.001 sec  <<< FAILURE!
junit.framework.ComparisonFailure: expected:<2007-0[4-01]T00:00:00.000Z> but was:<2007-0[5--29]T00:00:00.000Z>
	at junit.framework.Assert.assertEquals(Assert.java:81)
	at junit.framework.Assert.assertEquals(Assert.java:87)
	at org.joda.time.TestDateTimeZoneCutover.test_DateTime_withZoneRetainFields_Gaza(TestDateTimeZoneCutover.java:200)

test_MutableDateTime_withZoneRetainFields_Gaza(org.joda.time.TestDateTimeZoneCutover)  Time elapsed: 0.001 sec  <<< FAILURE!
junit.framework.ComparisonFailure: expected:<2007-0[4-01]T00:00:00.000Z> but was:<2007-0[5--29]T00:00:00.000Z>
	at junit.framework.Assert.assertEquals(Assert.java:81)
	at junit.framework.Assert.assertEquals(Assert.java:87)
	at org.joda.time.TestDateTimeZoneCutover.test_MutableDateTime_withZoneRetainFields_Gaza(TestDateTimeZoneCutover.java:208)

test_LocalDate_new_Gaza(org.joda.time.TestDateTimeZoneCutover)  Time elapsed: 0 sec  <<< FAILURE!
junit.framework.ComparisonFailure: expected:<2007-0[4-01]> but was:<2007-0[5--29]>
	at junit.framework.Assert.assertEquals(Assert.java:81)
	at junit.framework.Assert.assertEquals(Assert.java:87)
	at org.joda.time.TestDateTimeZoneCutover.test_LocalDate_new_Gaza(TestDateTimeZoneCutover.java:216)

test_LocalDate_toDateMidnight_Gaza(org.joda.time.TestDateTimeZoneCutover)  Time elapsed: 0.001 sec  <<< ERROR!
org.joda.time.IllegalFieldValueException: Value -29 for dayOfMonth must be in the range [1,31]
	at org.joda.time.field.FieldUtils.verifyValueBounds(FieldUtils.java:252)
	at org.joda.time.chrono.BasicChronology.getDateMidnightMillis(BasicChronology.java:613)
	at org.joda.time.chrono.BasicChronology.getDateTimeMillis(BasicChronology.java:177)
	at org.joda.time.chrono.GregorianChronology.getDateTimeMillis(GregorianChronology.java:44)
	at org.joda.time.chrono.AssembledChronology.getDateTimeMillis(AssembledChronology.java:133)
	at org.joda.time.chrono.ZonedChronology.getDateTimeMillis(ZonedChronology.java:118)
	at org.joda.time.chrono.AssembledChronology.getDateTimeMillis(AssembledChronology.java:133)
	at org.joda.time.base.BaseDateTime.<init>(BaseDateTime.java:258)
	at org.joda.time.DateMidnight.<init>(DateMidnight.java:350)
	at org.joda.time.LocalDate.toDateMidnight(LocalDate.java:867)
	at org.joda.time.TestDateTimeZoneCutover.test_LocalDate_toDateMidnight_Gaza(TestDateTimeZoneCutover.java:225)

test_DateTime_parse_Gaza(org.joda.time.TestDateTimeZoneCutover)  Time elapsed: 0.001 sec  <<< FAILURE!
junit.framework.AssertionFailedError
	at junit.framework.Assert.fail(Assert.java:47)
	at junit.framework.Assert.fail(Assert.java:53)
	at org.joda.time.TestDateTimeZoneCutover.test_DateTime_parse_Gaza(TestDateTimeZoneCutover.java:255)

test_MockTurkIsCorrect(org.joda.time.TestDateTimeZoneCutover)  Time elapsed: 0 sec  <<< FAILURE!
junit.framework.ComparisonFailure: expected:<2007-0[4-01]T01:00:00.000-04:00> but was:<2007-0[5--28]T01:00:00.000-04:00>
	at junit.framework.Assert.assertEquals(Assert.java:81)
	at junit.framework.Assert.assertEquals(Assert.java:87)
	at org.joda.time.TestDateTimeZoneCutover.test_MockTurkIsCorrect(TestDateTimeZoneCutover.java:274)

test_getOffsetFromLocal_Turk(org.joda.time.TestDateTimeZoneCutover)  Time elapsed: 0.001 sec  <<< FAILURE!
junit.framework.ComparisonFailure: 2007-05--28T01:00:00.000-04:00 expected:<2007-0[4-01]T01:00:00.000-04:00> but was:<2007-0[5--28]T01:00:00.000-04:00>
	at junit.framework.Assert.assertEquals(Assert.java:81)
	at org.joda.time.TestDateTimeZoneCutover.doTest_getOffsetFromLocal_Turk(TestDateTimeZoneCutover.java:298)
	at org.joda.time.TestDateTimeZoneCutover.test_getOffsetFromLocal_Turk(TestDateTimeZoneCutover.java:282)

test_DateTime_roundFloor_Turk(org.joda.time.TestDateTimeZoneCutover)  Time elapsed: 0 sec  <<< FAILURE!
junit.framework.ComparisonFailure: expected:<2007-0[4-01]T08:00:00.000-04:00> but was:<2007-0[5--28]T08:00:00.000-04:00>
	at junit.framework.Assert.assertEquals(Assert.java:81)
	at junit.framework.Assert.assertEquals(Assert.java:87)
	at org.joda.time.TestDateTimeZoneCutover.test_DateTime_roundFloor_Turk(TestDateTimeZoneCutover.java:303)

test_DateTime_roundFloorNotDST_Turk(org.joda.time.TestDateTimeZoneCutover)  Time elapsed: 0.001 sec  <<< FAILURE!
junit.framework.ComparisonFailure: expected:<2007-0[4-02]T08:00:00.000-04:00> but was:<2007-0[5--27]T08:00:00.000-04:00>
	at junit.framework.Assert.assertEquals(Assert.java:81)
	at junit.framework.Assert.assertEquals(Assert.java:87)
	at org.joda.time.TestDateTimeZoneCutover.test_DateTime_roundFloorNotDST_Turk(TestDateTimeZoneCutover.java:310)

test_DateTime_roundCeiling_Turk(org.joda.time.TestDateTimeZoneCutover)  Time elapsed: 0 sec  <<< FAILURE!
junit.framework.ComparisonFailure: expected:<2007-0[4-01]T01:00:00.000-04:00> but was:<2007-0[5--28]T01:00:00.000-04:00>
	at junit.framework.Assert.assertEquals(Assert.java:81)
	at junit.framework.Assert.assertEquals(Assert.java:87)
	at org.joda.time.TestDateTimeZoneCutover.test_DateTime_roundCeiling_Turk(TestDateTimeZoneCutover.java:319)

test_DateTime_setHourZero_Turk(org.joda.time.TestDateTimeZoneCutover)  Time elapsed: 0.001 sec  <<< FAILURE!
junit.framework.ComparisonFailure: expected:<2007-0[4-01]T08:00:00.000-04:00> but was:<2007-0[5--28]T08:00:00.000-04:00>
	at junit.framework.Assert.assertEquals(Assert.java:81)
	at junit.framework.Assert.assertEquals(Assert.java:87)
	at org.joda.time.TestDateTimeZoneCutover.test_DateTime_setHourZero_Turk(TestDateTimeZoneCutover.java:324)

test_DateTime_withHourZero_Turk(org.joda.time.TestDateTimeZoneCutover)  Time elapsed: 0 sec  <<< FAILURE!
junit.framework.ComparisonFailure: expected:<2007-0[4-01]T08:00:00.000-04:00> but was:<2007-0[5--28]T08:00:00.000-04:00>
	at junit.framework.Assert.assertEquals(Assert.java:81)
	at junit.framework.Assert.assertEquals(Assert.java:87)
	at org.joda.time.TestDateTimeZoneCutover.test_DateTime_withHourZero_Turk(TestDateTimeZoneCutover.java:335)

test_DateTime_withDay_Turk(org.joda.time.TestDateTimeZoneCutover)  Time elapsed: 0.001 sec  <<< FAILURE!
junit.framework.ComparisonFailure: expected:<2007-0[4-02]T00:00:00.000-04:00> but was:<2007-0[5--28]T00:00:00.000-04:00>
	at junit.framework.Assert.assertEquals(Assert.java:81)
	at junit.framework.Assert.assertEquals(Assert.java:87)
	at org.joda.time.TestDateTimeZoneCutover.test_DateTime_withDay_Turk(TestDateTimeZoneCutover.java:346)

test_DateTime_minusHour_Turk(org.joda.time.TestDateTimeZoneCutover)  Time elapsed: 0 sec  <<< FAILURE!
junit.framework.ComparisonFailure: expected:<2007-0[4-01]T08:00:00.000-04:00> but was:<2007-0[5--28]T08:00:00.000-04:00>
	at junit.framework.Assert.assertEquals(Assert.java:81)
	at junit.framework.Assert.assertEquals(Assert.java:87)
	at org.joda.time.TestDateTimeZoneCutover.test_DateTime_minusHour_Turk(TestDateTimeZoneCutover.java:353)

test_DateTime_plusHour_Turk(org.joda.time.TestDateTimeZoneCutover)  Time elapsed: 0.001 sec  <<< FAILURE!
junit.framework.ComparisonFailure: expected:<2007-0[4-01]T01:00:00.000-04:00> but was:<2007-0[5--28]T01:00:00.000-04:00>
	at junit.framework.Assert.assertEquals(Assert.java:81)
	at junit.framework.Assert.assertEquals(Assert.java:87)
	at org.joda.time.TestDateTimeZoneCutover.test_DateTime_plusHour_Turk(TestDateTimeZoneCutover.java:370)

test_DateTime_minusDay_Turk(org.joda.time.TestDateTimeZoneCutover)  Time elapsed: 0 sec  <<< FAILURE!
junit.framework.ComparisonFailure: expected:<2007-0[4-02]T00:00:00.000-04:00> but was:<2007-0[5--28]T00:00:00.000-04:00>
	at junit.framework.Assert.assertEquals(Assert.java:81)
	at junit.framework.Assert.assertEquals(Assert.java:87)
	at org.joda.time.TestDateTimeZoneCutover.test_DateTime_minusDay_Turk(TestDateTimeZoneCutover.java:377)

test_DateTime_plusDay_Turk(org.joda.time.TestDateTimeZoneCutover)  Time elapsed: 0.001 sec  <<< FAILURE!
junit.framework.ComparisonFailure: expected:<2007-0[4-01]T01:00:00.000-04:00> but was:<2007-0[5--28]T01:00:00.000-04:00>
	at junit.framework.Assert.assertEquals(Assert.java:81)
	at junit.framework.Assert.assertEquals(Assert.java:87)
	at org.joda.time.TestDateTimeZoneCutover.test_DateTime_plusDay_Turk(TestDateTimeZoneCutover.java:390)

test_DateTime_plusDayMidGap_Turk(org.joda.time.TestDateTimeZoneCutover)  Time elapsed: 0 sec  <<< FAILURE!
junit.framework.ComparisonFailure: expected:<2007-0[4-01]T01:30:00.000-04:00> but was:<2007-0[5--28]T01:30:00.000-04:00>
	at junit.framework.Assert.assertEquals(Assert.java:81)
	at junit.framework.Assert.assertEquals(Assert.java:87)
	at org.joda.time.TestDateTimeZoneCutover.test_DateTime_plusDayMidGap_Turk(TestDateTimeZoneCutover.java:400)

test_DateTime_addWrapFieldDay_Turk(org.joda.time.TestDateTimeZoneCutover)  Time elapsed: 0.001 sec  <<< FAILURE!
junit.framework.ComparisonFailure: expected:<2007-0[4-3]0T00:00:00.000-04:00> but was:<2007-0[5-0]0T00:00:00.000-04:00>
	at junit.framework.Assert.assertEquals(Assert.java:81)
	at junit.framework.Assert.assertEquals(Assert.java:87)
	at org.joda.time.TestDateTimeZoneCutover.test_DateTime_addWrapFieldDay_Turk(TestDateTimeZoneCutover.java:407)

test_DateTime_withZoneRetainFields_Turk(org.joda.time.TestDateTimeZoneCutover)  Time elapsed: 0 sec  <<< FAILURE!
junit.framework.ComparisonFailure: expected:<2007-0[4-01]T00:00:00.000Z> but was:<2007-0[5--29]T00:00:00.000Z>
	at junit.framework.Assert.assertEquals(Assert.java:81)
	at junit.framework.Assert.assertEquals(Assert.java:87)
	at org.joda.time.TestDateTimeZoneCutover.test_DateTime_withZoneRetainFields_Turk(TestDateTimeZoneCutover.java:417)

test_MockGazaIsCorrect(org.joda.time.TestDateTimeZoneCutover)  Time elapsed: 0.001 sec  <<< FAILURE!
junit.framework.ComparisonFailure: expected:<2007-0[4-01]T01:00:00.000+03:00> but was:<2007-0[5--28]T01:00:00.000+03:00>
	at junit.framework.Assert.assertEquals(Assert.java:81)
	at junit.framework.Assert.assertEquals(Assert.java:87)
	at org.joda.time.TestDateTimeZoneCutover.test_MockGazaIsCorrect(TestDateTimeZoneCutover.java:65)

test_getOffsetFromLocal_Gaza(org.joda.time.TestDateTimeZoneCutover)  Time elapsed: 0 sec  <<< FAILURE!
junit.framework.ComparisonFailure: 2007-05--28T01:00:00.000+03:00 expected:<2007-0[4-01]T01:00:00.000+03:00> but was:<2007-0[5--28]T01:00:00.000+03:00>
	at junit.framework.Assert.assertEquals(Assert.java:81)
	at org.joda.time.TestDateTimeZoneCutover.doTest_getOffsetFromLocal_Gaza(TestDateTimeZoneCutover.java:88)
	at org.joda.time.TestDateTimeZoneCutover.test_getOffsetFromLocal_Gaza(TestDateTimeZoneCutover.java:73)

test_DateTime_roundFloor_Gaza(org.joda.time.TestDateTimeZoneCutover)  Time elapsed: 0.001 sec  <<< FAILURE!
junit.framework.ComparisonFailure: expected:<2007-0[4-01]T08:00:00.000+03:00> but was:<2007-0[5--28]T08:00:00.000+03:00>
	at junit.framework.Assert.assertEquals(Assert.java:81)
	at junit.framework.Assert.assertEquals(Assert.java:87)
	at org.joda.time.TestDateTimeZoneCutover.test_DateTime_roundFloor_Gaza(TestDateTimeZoneCutover.java:93)

test_DateTime_withDay_Gaza(org.joda.time.TestDateTimeZoneCutover)  Time elapsed: 0 sec  <<< FAILURE!
junit.framework.ComparisonFailure: expected:<2007-0[4-02]T00:00:00.000+03:00> but was:<2007-0[5--28]T00:00:00.000+03:00>
	at junit.framework.Assert.assertEquals(Assert.java:81)
	at junit.framework.Assert.assertEquals(Assert.java:87)
	at org.joda.time.TestDateTimeZoneCutover.test_DateTime_withDay_Gaza(TestDateTimeZoneCutover.java:129)

test_DateTime_roundCeiling_Gaza(org.joda.time.TestDateTimeZoneCutover)  Time elapsed: 0 sec  <<< FAILURE!
junit.framework.ComparisonFailure: expected:<2007-0[4-01]T01:00:00.000+03:00> but was:<2007-0[5--28]T01:00:00.000+03:00>
	at junit.framework.Assert.assertEquals(Assert.java:81)
	at junit.framework.Assert.assertEquals(Assert.java:87)
	at org.joda.time.TestDateTimeZoneCutover.test_DateTime_roundCeiling_Gaza(TestDateTimeZoneCutover.java:102)

test_DateTime_setHourZero_Gaza(org.joda.time.TestDateTimeZoneCutover)  Time elapsed: 0.001 sec  <<< FAILURE!
junit.framework.ComparisonFailure: expected:<2007-0[4-01]T08:00:00.000+03:00> but was:<2007-0[5--28]T08:00:00.000+03:00>
	at junit.framework.Assert.assertEquals(Assert.java:81)
	at junit.framework.Assert.assertEquals(Assert.java:87)
	at org.joda.time.TestDateTimeZoneCutover.test_DateTime_setHourZero_Gaza(TestDateTimeZoneCutover.java:107)

test_DateTime_withHourZero_Gaza(org.joda.time.TestDateTimeZoneCutover)  Time elapsed: 0 sec  <<< FAILURE!
junit.framework.ComparisonFailure: expected:<2007-0[4-01]T08:00:00.000+03:00> but was:<2007-0[5--28]T08:00:00.000+03:00>
	at junit.framework.Assert.assertEquals(Assert.java:81)
	at junit.framework.Assert.assertEquals(Assert.java:87)
	at org.joda.time.TestDateTimeZoneCutover.test_DateTime_withHourZero_Gaza(TestDateTimeZoneCutover.java:118)

test_DateTime_minusHour_Gaza(org.joda.time.TestDateTimeZoneCutover)  Time elapsed: 0.001 sec  <<< FAILURE!
junit.framework.ComparisonFailure: expected:<2007-0[4-01]T08:00:00.000+03:00> but was:<2007-0[5--28]T08:00:00.000+03:00>
	at junit.framework.Assert.assertEquals(Assert.java:81)
	at junit.framework.Assert.assertEquals(Assert.java:87)
	at org.joda.time.TestDateTimeZoneCutover.test_DateTime_minusHour_Gaza(TestDateTimeZoneCutover.java:136)

test_DateTime_plusHour_Gaza(org.joda.time.TestDateTimeZoneCutover)  Time elapsed: 0 sec  <<< FAILURE!
junit.framework.ComparisonFailure: expected:<2007-0[4-01]T01:00:00.000+03:00> but was:<2007-0[5--28]T01:00:00.000+03:00>
	at junit.framework.Assert.assertEquals(Assert.java:81)
	at junit.framework.Assert.assertEquals(Assert.java:87)
	at org.joda.time.TestDateTimeZoneCutover.test_DateTime_plusHour_Gaza(TestDateTimeZoneCutover.java:153)

test_DateTime_minusDay_Gaza(org.joda.time.TestDateTimeZoneCutover)  Time elapsed: 0.001 sec  <<< FAILURE!
junit.framework.ComparisonFailure: expected:<2007-0[4-02]T00:00:00.000+03:00> but was:<2007-0[5--28]T00:00:00.000+03:00>
	at junit.framework.Assert.assertEquals(Assert.java:81)
	at junit.framework.Assert.assertEquals(Assert.java:87)
	at org.joda.time.TestDateTimeZoneCutover.test_DateTime_minusDay_Gaza(TestDateTimeZoneCutover.java:160)

test_DateTime_plusDay_Gaza(org.joda.time.TestDateTimeZoneCutover)  Time elapsed: 0 sec  <<< FAILURE!
junit.framework.ComparisonFailure: expected:<2007-0[4-01]T01:00:00.000+03:00> but was:<2007-0[5--28]T01:00:00.000+03:00>
	at junit.framework.Assert.assertEquals(Assert.java:81)
	at junit.framework.Assert.assertEquals(Assert.java:87)
	at org.joda.time.TestDateTimeZoneCutover.test_DateTime_plusDay_Gaza(TestDateTimeZoneCutover.java:173)

test_DateTime_plusDayMidGap_Gaza(org.joda.time.TestDateTimeZoneCutover)  Time elapsed: 0.001 sec  <<< FAILURE!
junit.framework.ComparisonFailure: expected:<2007-0[4-01]T01:30:00.000+03:00> but was:<2007-0[5--28]T01:30:00.000+03:00>
	at junit.framework.Assert.assertEquals(Assert.java:81)
	at junit.framework.Assert.assertEquals(Assert.java:87)
	at org.joda.time.TestDateTimeZoneCutover.test_DateTime_plusDayMidGap_Gaza(TestDateTimeZoneCutover.java:183)

test_DateTime_addWrapFieldDay_Gaza(org.joda.time.TestDateTimeZoneCutover)  Time elapsed: 0 sec  <<< FAILURE!
junit.framework.ComparisonFailure: expected:<2007-0[4-3]0T00:00:00.000+03:00> but was:<2007-0[5-0]0T00:00:00.000+03:00>
	at junit.framework.Assert.assertEquals(Assert.java:81)
	at junit.framework.Assert.assertEquals(Assert.java:87)
	at org.joda.time.TestDateTimeZoneCutover.test_DateTime_addWrapFieldDay_Gaza(TestDateTimeZoneCutover.java:190)

testTest(org.joda.time.TestPeriodType)  Time elapsed: 0.001 sec  <<< FAILURE!
junit.framework.ComparisonFailure: expected:<2002-0[4-05]T12:24:00.000Z> but was:<2002-0[5--24]T12:24:00.000Z>
	at junit.framework.Assert.assertEquals(Assert.java:81)
	at junit.framework.Assert.assertEquals(Assert.java:87)
	at org.joda.time.TestPeriodType.testTest(TestPeriodType.java:104)

testTest(org.joda.time.TestSerialization)  Time elapsed: 0 sec  <<< FAILURE!
junit.framework.ComparisonFailure: expected:<2002-0[4-05]T12:24:00.000Z> but was:<2002-0[5--24]T12:24:00.000Z>
	at junit.framework.Assert.assertEquals(Assert.java:81)
	at junit.framework.Assert.assertEquals(Assert.java:87)
	at org.joda.time.TestSerialization.testTest(TestSerialization.java:123)

testZoneTransition(org.joda.time.TestIllegalFieldValueException)  Time elapsed: 0 sec  <<< FAILURE!
junit.framework.AssertionFailedError
	at junit.framework.Assert.fail(Assert.java:47)
	at junit.framework.Assert.fail(Assert.java:53)
	at org.joda.time.TestIllegalFieldValueException.testZoneTransition(TestIllegalFieldValueException.java:198)

testMaximumValue(org.joda.time.chrono.TestGJChronology)  Time elapsed: 0.007 sec  <<< ERROR!
org.joda.time.IllegalFieldValueException: Value -29 for dayOfMonth must be in the range [1,31]
	at org.joda.time.field.FieldUtils.verifyValueBounds(FieldUtils.java:234)
	at org.joda.time.field.PreciseDurationDateTimeField.set(PreciseDurationDateTimeField.java:79)
	at org.joda.time.chrono.GJChronology$CutoverField.set(GJChronology.java:740)
	at org.joda.time.chrono.BaseChronology.set(BaseChronology.java:240)
	at org.joda.time.chrono.GJChronology$CutoverField.getMaximumValue(GJChronology.java:863)
	at org.joda.time.field.AbstractPartialFieldProperty.getMaximumValue(AbstractPartialFieldProperty.java:230)
	at org.joda.time.chrono.TestGJChronology.testMaximumValue(TestGJChronology.java:515)

testSubtractDays(org.joda.time.chrono.TestGJChronology)  Time elapsed: 0.001 sec  <<< ERROR!
org.joda.time.IllegalFieldValueException: Value -29 for dayOfMonth must be in the range [1,31]
	at org.joda.time.field.FieldUtils.verifyValueBounds(FieldUtils.java:252)
	at org.joda.time.chrono.BasicChronology.getDateMidnightMillis(BasicChronology.java:613)
	at org.joda.time.chrono.BasicChronology.getDateTimeMillis(BasicChronology.java:177)
	at org.joda.time.chrono.GregorianChronology.getDateTimeMillis(GregorianChronology.java:44)
	at org.joda.time.chrono.GJChronology.getDateTimeMillis(GJChronology.java:356)
	at org.joda.time.chrono.ZonedChronology.getDateTimeMillis(ZonedChronology.java:118)
	at org.joda.time.chrono.GJChronology.getDateTimeMillis(GJChronology.java:348)
	at org.joda.time.base.BaseDateTime.<init>(BaseDateTime.java:258)
	at org.joda.time.DateTime.<init>(DateTime.java:532)
	at org.joda.time.YearMonthDay.toDateTimeAtMidnight(YearMonthDay.java:685)
	at org.joda.time.YearMonthDay.toDateTimeAtMidnight(YearMonthDay.java:670)
	at org.joda.time.chrono.TestGJChronology.testSubtractDays(TestGJChronology.java:476)

test_MockTurkIsCorrect(org.joda.time.chrono.TestLenientChronology)  Time elapsed: 0.001 sec  <<< FAILURE!
junit.framework.ComparisonFailure: expected:<2007-0[4-01]T01:00:00.000-04:00> but was:<2007-0[5--28]T01:00:00.000-04:00>
	at junit.framework.Assert.assertEquals(Assert.java:81)
	at junit.framework.Assert.assertEquals(Assert.java:87)
	at org.joda.time.chrono.TestLenientChronology.test_MockTurkIsCorrect(TestLenientChronology.java:130)

test_lenientChrononolgy_Turk(org.joda.time.chrono.TestLenientChronology)  Time elapsed: 0 sec  <<< FAILURE!
junit.framework.ComparisonFailure: expected:<2007-0[4-01T01]:30:00.000-04:00> but was:<2007-0[5-01T00]:30:00.000-04:00>
	at junit.framework.Assert.assertEquals(Assert.java:81)
	at junit.framework.Assert.assertEquals(Assert.java:87)
	at org.joda.time.chrono.TestLenientChronology.test_lenientChrononolgy_Turk(TestLenientChronology.java:145)

testChronology(org.joda.time.chrono.gj.MainTest)  Time elapsed: 0.006 sec  <<< FAILURE!
junit.framework.AssertionFailedError
	at junit.framework.Assert.fail(Assert.java:47)
	at org.joda.time.chrono.gj.MainTest.testChronology(MainTest.java:158)

testChronology(org.joda.time.chrono.gj.MainTest)  Time elapsed: 0.017 sec  <<< FAILURE!
junit.framework.AssertionFailedError
	at junit.framework.Assert.fail(Assert.java:47)
	at org.joda.time.chrono.gj.MainTest.testChronology(MainTest.java:158)

testFormatParse_textMonthAtEnd_France(org.joda.time.format.TestDateTimeFormat)  Time elapsed: 0 sec  <<< ERROR!
java.lang.IllegalArgumentException: Invalid format: "23 juin" is malformed at "juin"
	at org.joda.time.format.DateTimeFormatter.parseDateTime(DateTimeFormatter.java:899)
	at org.joda.time.format.TestDateTimeFormat.testFormatParse_textMonthAtEnd_France(TestDateTimeFormat.java:973)

testFormatParse_textMonthAtEnd_France_withSpecifiedDefault(org.joda.time.format.TestDateTimeFormat)  Time elapsed: 0.001 sec  <<< ERROR!
java.lang.IllegalArgumentException: Invalid format: "23 juin" is malformed at "juin"
	at org.joda.time.format.DateTimeFormatter.parseDateTime(DateTimeFormatter.java:899)
	at org.joda.time.format.TestDateTimeFormat.testFormatParse_textMonthAtEnd_France_withSpecifiedDefault(TestDateTimeFormat.java:983)

testFormatParse_textAdjoiningHelloWorld_UK(org.joda.time.format.TestDateTimeFormat)  Time elapsed: 0 sec  <<< ERROR!
java.lang.IllegalArgumentException: Invalid format: "$23JunHelloWorld" is malformed at "JunHelloWorld"
	at org.joda.time.format.DateTimeFormatter.parseDateTime(DateTimeFormatter.java:899)
	at org.joda.time.format.TestDateTimeFormat.testFormatParse_textAdjoiningHelloWorld_UK(TestDateTimeFormat.java:1121)

testFormatParse_textAdjoiningMonthDOW_UK(org.joda.time.format.TestDateTimeFormat)  Time elapsed: 0.001 sec  <<< ERROR!
java.lang.IllegalArgumentException: Invalid format: "$23JunSat" is malformed at "JunSat"
	at org.joda.time.format.DateTimeFormatter.parseDateTime(DateTimeFormatter.java:899)
	at org.joda.time.format.TestDateTimeFormat.testFormatParse_textAdjoiningMonthDOW_UK(TestDateTimeFormat.java:1135)

testSerialization(org.joda.time.tz.TestBuilder)  Time elapsed: 0.015 sec  <<< FAILURE!
junit.framework.AssertionFailedError: expected:<-618328800000> but was:<-618415200000>
	at junit.framework.Assert.fail(Assert.java:47)
	at junit.framework.Assert.failNotEquals(Assert.java:280)
	at junit.framework.Assert.assertEquals(Assert.java:64)
	at junit.framework.Assert.assertEquals(Assert.java:133)
	at junit.framework.Assert.assertEquals(Assert.java:139)
	at org.joda.time.tz.TestBuilder.testForwardTransitions(TestBuilder.java:234)
	at org.joda.time.tz.TestBuilder.testSerialization(TestBuilder.java:282)

testForwardTransitions(org.joda.time.tz.TestBuilder)  Time elapsed: 0.011 sec  <<< FAILURE!
junit.framework.AssertionFailedError: expected:<-618328800000> but was:<-618415200000>
	at junit.framework.Assert.fail(Assert.java:47)
	at junit.framework.Assert.failNotEquals(Assert.java:280)
	at junit.framework.Assert.assertEquals(Assert.java:64)
	at junit.framework.Assert.assertEquals(Assert.java:133)
	at junit.framework.Assert.assertEquals(Assert.java:139)
	at org.joda.time.tz.TestBuilder.testForwardTransitions(TestBuilder.java:234)
	at org.joda.time.tz.TestBuilder.testForwardTransitions(TestBuilder.java:217)

testReverseTransitions(org.joda.time.tz.TestBuilder)  Time elapsed: 0.011 sec  <<< FAILURE!
junit.framework.AssertionFailedError: expected:<925725599999> but was:<925639199999>
	at junit.framework.Assert.fail(Assert.java:47)
	at junit.framework.Assert.failNotEquals(Assert.java:280)
	at junit.framework.Assert.assertEquals(Assert.java:64)
	at junit.framework.Assert.assertEquals(Assert.java:133)
	at junit.framework.Assert.assertEquals(Assert.java:139)
	at org.joda.time.tz.TestBuilder.testReverseTransitions(TestBuilder.java:270)
	at org.joda.time.tz.TestBuilder.testReverseTransitions(TestBuilder.java:255)

testCompile(org.joda.time.tz.TestCompiler)  Time elapsed: 0.031 sec  <<< FAILURE!
junit.framework.AssertionFailedError: expected:<-618328800000> but was:<-618415200000>
	at junit.framework.Assert.fail(Assert.java:47)
	at junit.framework.Assert.failNotEquals(Assert.java:280)
	at junit.framework.Assert.assertEquals(Assert.java:64)
	at junit.framework.Assert.assertEquals(Assert.java:133)
	at junit.framework.Assert.assertEquals(Assert.java:139)
	at org.joda.time.tz.TestBuilder.testForwardTransitions(TestBuilder.java:234)
	at org.joda.time.tz.TestCompiler.testCompile(TestCompiler.java:117)

test_2400_fromDay(org.joda.time.tz.TestCompiler)  Time elapsed: 0.001 sec  <<< FAILURE!
junit.framework.AssertionFailedError: expected:<4> but was:<5>
	at junit.framework.Assert.fail(Assert.java:47)
	at junit.framework.Assert.failNotEquals(Assert.java:280)
	at junit.framework.Assert.assertEquals(Assert.java:64)
	at junit.framework.Assert.assertEquals(Assert.java:198)
	at junit.framework.Assert.assertEquals(Assert.java:204)
	at org.joda.time.tz.TestCompiler.test_2400_fromDay(TestCompiler.java:179)

test_2400_last(org.joda.time.tz.TestCompiler)  Time elapsed: 0 sec  <<< FAILURE!
junit.framework.AssertionFailedError: expected:<4> but was:<5>
	at junit.framework.Assert.fail(Assert.java:47)
	at junit.framework.Assert.failNotEquals(Assert.java:280)
	at junit.framework.Assert.assertEquals(Assert.java:64)
	at junit.framework.Assert.assertEquals(Assert.java:198)
	at junit.framework.Assert.assertEquals(Assert.java:204)
	at org.joda.time.tz.TestCompiler.test_2400_last(TestCompiler.java:189)

test_Amman_2003(org.joda.time.tz.TestCompiler)  Time elapsed: 0.001 sec  <<< ERROR!
java.lang.IllegalArgumentException: The datetime zone id 'Asia/Amman' is not recognised
	at org.joda.time.DateTimeZone.forID(DateTimeZone.java:229)
	at org.joda.time.tz.TestCompiler.test_Amman_2003(TestCompiler.java:207)

test_Amman_2004(org.joda.time.tz.TestCompiler)  Time elapsed: 0.001 sec  <<< ERROR!
java.lang.IllegalArgumentException: The datetime zone id 'Asia/Amman' is not recognised
	at org.joda.time.DateTimeZone.forID(DateTimeZone.java:229)
	at org.joda.time.tz.TestCompiler.test_Amman_2004(TestCompiler.java:214)

test_Amman_2005(org.joda.time.tz.TestCompiler)  Time elapsed: 0 sec  <<< ERROR!
java.lang.IllegalArgumentException: The datetime zone id 'Asia/Amman' is not recognised
	at org.joda.time.DateTimeZone.forID(DateTimeZone.java:229)
	at org.joda.time.tz.TestCompiler.test_Amman_2005(TestCompiler.java:221)

test_Amman_2006(org.joda.time.tz.TestCompiler)  Time elapsed: 0.001 sec  <<< ERROR!
java.lang.IllegalArgumentException: The datetime zone id 'Asia/Amman' is not recognised
	at org.joda.time.DateTimeZone.forID(DateTimeZone.java:229)
	at org.joda.time.tz.TestCompiler.test_Amman_2006(TestCompiler.java:228)


Results :

Failed tests: 
  org.joda.time.TestChronology#testTest ComparisonFailure expected:<2002-0[4-05]...
  org.joda.time.TestDateMidnight_Basics#testTest ComparisonFailure expected:<200...
  org.joda.time.TestDateMidnight_Constructors#testTest ComparisonFailure expecte...
  org.joda.time.TestDateMidnight_Properties#testTest ComparisonFailure expected:...
  org.joda.time.TestDateTimeComparator#testDOW AssertionFailedError DOWM1a expec...
  org.joda.time.TestDateTimeComparator#testListDOW AssertionFailedError ListDOW ...
  org.joda.time.TestDateTimeComparator#testMonth AssertionFailedError MONTHM1a e...
  org.joda.time.TestDateTimeUtils#testTest ComparisonFailure expected:<2002-0[4-...
  org.joda.time.TestDateTimeZoneCutover#testBug2182444_ausNSW AssertionFailedError
  org.joda.time.TestDateTimeZoneCutover#test_DateTime_addWrapFieldDay_Gaza ComparisonFailure
  org.joda.time.TestDateTimeZoneCutover#test_DateTime_addWrapFieldDay_Turk ComparisonFailure
  org.joda.time.TestDateTimeZoneCutover#test_DateTime_minusDay_Gaza ComparisonFailure
  org.joda.time.TestDateTimeZoneCutover#test_DateTime_minusDay_Turk ComparisonFailure
  org.joda.time.TestDateTimeZoneCutover#test_DateTime_minusHour_Gaza ComparisonFailure
  org.joda.time.TestDateTimeZoneCutover#test_DateTime_minusHour_Turk ComparisonFailure
  org.joda.time.TestDateTimeZoneCutover#test_DateTime_parse_Gaza AssertionFailedError
  org.joda.time.TestDateTimeZoneCutover#test_DateTime_parse_Turk AssertionFailedError
  org.joda.time.TestDateTimeZoneCutover#test_DateTime_plusDayMidGap_Gaza ComparisonFailure
  org.joda.time.TestDateTimeZoneCutover#test_DateTime_plusDayMidGap_Turk ComparisonFailure
  org.joda.time.TestDateTimeZoneCutover#test_DateTime_plusDay_Gaza ComparisonFailure
  org.joda.time.TestDateTimeZoneCutover#test_DateTime_plusDay_Turk ComparisonFailure
  org.joda.time.TestDateTimeZoneCutover#test_DateTime_plusHour_Gaza ComparisonFailure
  org.joda.time.TestDateTimeZoneCutover#test_DateTime_plusHour_Turk ComparisonFailure
  org.joda.time.TestDateTimeZoneCutover#test_DateTime_roundCeiling_Gaza ComparisonFailure
  org.joda.time.TestDateTimeZoneCutover#test_DateTime_roundCeiling_Turk ComparisonFailure
  org.joda.time.TestDateTimeZoneCutover#test_DateTime_roundFloorNotDST_Turk ComparisonFailure
  org.joda.time.TestDateTimeZoneCutover#test_DateTime_roundFloor_Gaza ComparisonFailure
  org.joda.time.TestDateTimeZoneCutover#test_DateTime_roundFloor_Turk ComparisonFailure
  org.joda.time.TestDateTimeZoneCutover#test_DateTime_setHourZero_Gaza ComparisonFailure
  org.joda.time.TestDateTimeZoneCutover#test_DateTime_setHourZero_Turk ComparisonFailure
  org.joda.time.TestDateTimeZoneCutover#test_DateTime_withDay_Gaza ComparisonFailure
  org.joda.time.TestDateTimeZoneCutover#test_DateTime_withDay_Turk ComparisonFailure
  org.joda.time.TestDateTimeZoneCutover#test_DateTime_withHourZero_Gaza ComparisonFailure
  org.joda.time.TestDateTimeZoneCutover#test_DateTime_withHourZero_Turk ComparisonFailure
  org.joda.time.TestDateTimeZoneCutover#test_DateTime_withZoneRetainFields_Gaza ComparisonFailure
  org.joda.time.TestDateTimeZoneCutover#test_DateTime_withZoneRetainFields_Turk ComparisonFailure
  org.joda.time.TestDateTimeZoneCutover#test_LocalDate_new_Gaza ComparisonFailure
  org.joda.time.TestDateTimeZoneCutover#test_LocalDate_new_Turk ComparisonFailure
  org.joda.time.TestDateTimeZoneCutover#test_MockGazaIsCorrect ComparisonFailure
  org.joda.time.TestDateTimeZoneCutover#test_MockTurkIsCorrect ComparisonFailure
  org.joda.time.TestDateTimeZoneCutover#test_MutableDateTime_setZoneRetainFields_Turk ComparisonFailure
  org.joda.time.TestDateTimeZoneCutover#test_MutableDateTime_withZoneRetainFields_Gaza ComparisonFailure
  org.joda.time.TestDateTimeZoneCutover#test_getOffsetFromLocal_Gaza ComparisonFailure
  org.joda.time.TestDateTimeZoneCutover#test_getOffsetFromLocal_Turk ComparisonFailure
  org.joda.time.TestDateTime_Basics#testTest ComparisonFailure expected:<2002-0[...
  org.joda.time.TestDateTime_Constructors#testTest ComparisonFailure expected:<2...
  org.joda.time.TestDateTime_Properties#testPropertyCompareToMonthOfYear AssertionFailedError
  org.joda.time.TestDateTime_Properties#testPropertyWithMaximumValueMillisOfDayDSTGap ComparisonFailure
  org.joda.time.TestDateTime_Properties#testTest ComparisonFailure expected:<200...
  org.joda.time.TestDuration_Basics#testTest ComparisonFailure expected:<2002-0[...
  org.joda.time.TestIllegalFieldValueException#testZoneTransition AssertionFailedError
  org.joda.time.TestInstant_Basics#testTest ComparisonFailure expected:<2002-0[4...
  org.joda.time.TestInterval_Basics#testTest ComparisonFailure expected:<2002-0[...
  org.joda.time.TestLocalDateTime_Basics#testToDate_springDST AssertionFailedError
  org.joda.time.TestLocalDateTime_Basics#testToDate_springDST_2Hour40Savings AssertionFailedError
  org.joda.time.TestLocalDateTime_Basics#testToDate_springDST_2Hour40Savings_Zone AssertionFailedError
  org.joda.time.TestLocalDateTime_Basics#testToDate_springDST_Zone AssertionFailedError
  org.joda.time.TestLocalDateTime_Constructors#testConstructor_Object_ChronologyMoscow AssertionFailedError
  org.joda.time.TestLocalDateTime_Constructors#testConstructor_Object_ChronologyMoscowBadDateTime AssertionFailedError
  org.joda.time.TestLocalDateTime_Constructors#testConstructor_Object_DateTimeZoneMoscow AssertionFailedError
  org.joda.time.TestLocalDateTime_Constructors#testConstructor_Object_DateTimeZoneMoscowBadDateTime AssertionFailedError
  org.joda.time.TestLocalDateTime_Constructors#testConstructor_long1 AssertionFailedError
  org.joda.time.TestLocalDateTime_Constructors#testConstructor_long1_Chronology AssertionFailedError
  org.joda.time.TestLocalDateTime_Constructors#testConstructor_long1_DateTimeZone AssertionFailedError
  org.joda.time.TestLocalDateTime_Constructors#testConstructor_long_nullChronology AssertionFailedError
  org.joda.time.TestLocalDateTime_Constructors#testConstructor_long_nullDateTimeZone AssertionFailedError
  org.joda.time.TestLocalDateTime_Properties#testPropertyCompareToMonth AssertionFailedError
  org.joda.time.TestLocalDate_Basics#testMinusMonths_int AssertionFailedError ex...
  org.joda.time.TestLocalDate_Basics#testMinusWeeks_int AssertionFailedError exp...
  org.joda.time.TestLocalDate_Basics#testToDateTimeAtStartOfDay_Zone_avoidDST AssertionFailedError
  org.joda.time.TestLocalDate_Basics#testToDateTimeAtStartOfDay_avoidDST AssertionFailedError
  org.joda.time.TestLocalDate_Basics#testToDate_springDST AssertionFailedError e...
  org.joda.time.TestLocalDate_Basics#testToDate_springDST_2Hour40Savings AssertionFailedError
  org.joda.time.TestLocalDate_Constructors#testConstructor_ObjectLocalDate AssertionFailedError
  org.joda.time.TestLocalDate_Constructors#testConstructor_ObjectYearMonthDay AssertionFailedError
  org.joda.time.TestLocalDate_Constructors#testConstructor_long1 AssertionFailedError
  org.joda.time.TestLocalDate_Constructors#testConstructor_long1_Chronology AssertionFailedError
  org.joda.time.TestLocalDate_Constructors#testConstructor_long1_DateTimeZone AssertionFailedError
  org.joda.time.TestLocalDate_Constructors#testConstructor_long_nullChronology AssertionFailedError
  org.joda.time.TestLocalDate_Constructors#testConstructor_long_nullDateTimeZone AssertionFailedError
  org.joda.time.TestLocalDate_Properties#testPropertyCompareToDay AssertionFailedError
  org.joda.time.TestLocalDate_Properties#testPropertyCompareToMonth AssertionFailedError
  org.joda.time.TestMonthDay_Constructors#testConstructor_Object AssertionFailedError
  org.joda.time.TestMonthDay_Constructors#testConstructor_Object_Chronology AssertionFailedError
  org.joda.time.TestMonthDay_Constructors#testConstructor_Object_nullChronology AssertionFailedError
  org.joda.time.TestMonthDay_Constructors#testConstructor_long1 AssertionFailedError
  org.joda.time.TestMonthDay_Constructors#testConstructor_long1_Chronology AssertionFailedError
  org.joda.time.TestMonthDay_Constructors#testConstructor_long_nullChronology AssertionFailedError
  org.joda.time.TestMonthDay_Properties#testPropertyCompareToMonthOfYear AssertionFailedError
  org.joda.time.TestMutableDateTime_Adds#testTest ComparisonFailure expected:<20...
  org.joda.time.TestMutableDateTime_Basics#testTest ComparisonFailure expected:<...
  org.joda.time.TestMutableDateTime_Constructors#testTest ComparisonFailure expe...
  org.joda.time.TestMutableDateTime_Properties#testTest ComparisonFailure expect...
  org.joda.time.TestMutableDateTime_Sets#testTest ComparisonFailure expected:<20...
  org.joda.time.TestMutableInterval_Basics#testTest ComparisonFailure expected:<...
  org.joda.time.TestMutableInterval_Constructors#testTest ComparisonFailure expe...
  org.joda.time.TestMutableInterval_Updates#testTest ComparisonFailure expected:...
  org.joda.time.TestMutablePeriod_Basics#testTest ComparisonFailure expected:<20...
  org.joda.time.TestMutablePeriod_Updates#testTest ComparisonFailure expected:<2...
  org.joda.time.TestPeriodType#testTest ComparisonFailure expected:<2002-0[4-05]...
  org.joda.time.TestPeriod_Basics#testTest ComparisonFailure expected:<2002-0[4-...
  org.joda.time.TestSerialization#testTest ComparisonFailure expected:<2002-0[4-...
  org.joda.time.TestYearMonthDay_Constructors#testConstructor_Object AssertionFailedError
  org.joda.time.TestYearMonthDay_Constructors#testConstructor_Object_Chronology AssertionFailedError
  org.joda.time.TestYearMonthDay_Constructors#testConstructor_Object_nullChronology AssertionFailedError
  org.joda.time.TestYearMonthDay_Constructors#testConstructor_long1 AssertionFailedError
  org.joda.time.TestYearMonthDay_Constructors#testConstructor_long1_Chronology AssertionFailedError
  org.joda.time.TestYearMonthDay_Constructors#testConstructor_long_nullChronology AssertionFailedError
  org.joda.time.TestYearMonthDay_Properties#testPropertyCompareToMonth AssertionFailedError
  org.joda.time.TestYearMonth_Constructors#testConstructor_Object AssertionFailedError
  org.joda.time.TestYearMonth_Constructors#testConstructor_Object_Chronology AssertionFailedError
  org.joda.time.TestYearMonth_Constructors#testConstructor_Object_nullChronology AssertionFailedError
  org.joda.time.TestYearMonth_Constructors#testConstructor_long1 AssertionFailedError
  org.joda.time.TestYearMonth_Constructors#testConstructor_long1_Chronology AssertionFailedError
  org.joda.time.TestYearMonth_Constructors#testConstructor_long_nullChronology AssertionFailedError
  org.joda.time.TestYearMonth_Properties#testPropertyCompareToMonth AssertionFailedError
  org.joda.time.chrono.TestLenientChronology#test_MockTurkIsCorrect ComparisonFailure
  org.joda.time.chrono.TestLenientChronology#test_lenientChrononolgy_Turk ComparisonFailure
org.joda.time.chrono.gj.MainTest.testChronology(org.joda.time.chrono.gj.MainTest)
  Run 1: org.joda.time.chrono.gj.MainTest#testChronology AssertionFailedError
  Run 2: org.joda.time.chrono.gj.MainTest#testChronology AssertionFailedError

  org.joda.time.tz.TestBuilder#testForwardTransitions AssertionFailedError expec...
  org.joda.time.tz.TestBuilder#testReverseTransitions AssertionFailedError expec...
  org.joda.time.tz.TestBuilder#testSerialization AssertionFailedError expected:<...
  org.joda.time.tz.TestCompiler#testCompile AssertionFailedError expected:<-6183...
  org.joda.time.tz.TestCompiler#test_2400_fromDay AssertionFailedError expected:...
  org.joda.time.tz.TestCompiler#test_2400_last AssertionFailedError expected:<4>...
Tests in error: 
  org.joda.time.TestDateMidnight_Basics#testMinusMonths_int IllegalFieldValueException
  org.joda.time.TestDateMidnight_Basics#testMinusWeeks_int IllegalFieldValueException
  org.joda.time.TestDateMidnight_Basics#testWithFields_RPartial IllegalFieldValueException
  org.joda.time.TestDateTimeZoneCutover#test_LocalDate_toDateMidnight_Gaza IllegalFieldValueException
  org.joda.time.TestDateTimeZoneCutover#test_LocalDate_toDateMidnight_Turk IllegalFieldValueException
  org.joda.time.TestDateTime_Basics#testMinusMonths_int IllegalFieldValueException
  org.joda.time.TestDateTime_Basics#testMinusWeeks_int IllegalFieldValueException
  org.joda.time.TestDateTime_Basics#testWithFields_RPartial IllegalFieldValueException
  org.joda.time.TestDateTime_Basics#testWithTime_LocalTime IllegalFieldValueException
  org.joda.time.TestDateTime_Basics#testWithTime_int_int_int_int IllegalFieldValueException
  org.joda.time.TestDateTime_Properties#testPropertyWithMinimumValueMillisOfDayDSTGap IllegalArgumentException
  org.joda.time.TestLocalDateTime_Basics#testMinusMonths_int IllegalFieldValueException
  org.joda.time.TestLocalDateTime_Basics#testMinusWeeks_int IllegalFieldValueException
  org.joda.time.TestLocalDateTime_Constructors#testConstructor_Object1 IllegalFieldValueException
  org.joda.time.TestLocalDateTime_Constructors#testConstructor_Object_Chronology IllegalFieldValueException
  org.joda.time.TestLocalDateTime_Constructors#testConstructor_Object_Chronology_crossChronology IllegalFieldValueException
  org.joda.time.TestLocalDateTime_Constructors#testConstructor_Object_DateTimeZone IllegalFieldValueException
  org.joda.time.TestLocalDateTime_Constructors#testConstructor_Object_nullChronology IllegalFieldValueException
  org.joda.time.TestLocalDateTime_Constructors#testConstructor_Object_nullDateTimeZone IllegalFieldValueException
  org.joda.time.TestLocalDate_Basics#testToInterval_Zone_noMidnight IllegalArgumentException
  org.joda.time.TestLocalDate_Constructors#testConstructor_Object1 IllegalFieldValueException
  org.joda.time.TestLocalDate_Constructors#testConstructor_Object_Chronology IllegalFieldValueException
  org.joda.time.TestLocalDate_Constructors#testConstructor_Object_Chronology_crossChronology IllegalFieldValueException
  org.joda.time.TestLocalDate_Constructors#testConstructor_Object_DateTimeZone IllegalFieldValueException
  org.joda.time.TestLocalDate_Constructors#testConstructor_Object_nullChronology IllegalFieldValueException
  org.joda.time.TestLocalDate_Constructors#testConstructor_Object_nullDateTimeZone IllegalFieldValueException
  org.joda.time.chrono.TestGJChronology#testMaximumValue IllegalFieldValueException
  org.joda.time.chrono.TestGJChronology#testSubtractDays IllegalFieldValueException
  org.joda.time.format.TestDateTimeFormat#testFormatParse_textAdjoiningHelloWorld_UK IllegalArgumentException
  org.joda.time.format.TestDateTimeFormat#testFormatParse_textAdjoiningMonthDOW_UK IllegalArgumentException
  org.joda.time.format.TestDateTimeFormat#testFormatParse_textMonthAtEnd_France IllegalArgumentException
  org.joda.time.format.TestDateTimeFormat#testFormatParse_textMonthAtEnd_France_withSpecifiedDefault IllegalArgumentException
  org.joda.time.tz.TestCompiler#test_Amman_2003 IllegalArgumentException The dat...
  org.joda.time.tz.TestCompiler#test_Amman_2004 IllegalArgumentException The dat...
  org.joda.time.tz.TestCompiler#test_Amman_2005 IllegalArgumentException The dat...
  org.joda.time.tz.TestCompiler#test_Amman_2006 IllegalArgumentException The dat...

Tests run: 4156, Failures: 125, Errors: 36, Skipped: 0

[INFO] ------------------------------------------------------------------------
[INFO] BUILD FAILURE
[INFO] ------------------------------------------------------------------------
[INFO] Total time: 14.004s
[INFO] Finished at: Wed Aug 05 22:45:09 BST 2015
[INFO] Final Memory: 8M/213M
[INFO] ------------------------------------------------------------------------
[ERROR] Failed to execute goal org.apache.maven.plugins:maven-surefire-plugin:2.18.1:test (default-test) on project joda-time: There are test failures.
[ERROR] 
[ERROR] Please refer to /home/perham/Study/LittleDarwin/Cases/joda-time-2.8.1/target/surefire-reports for the individual test results.
[ERROR] -> [Help 1]
[ERROR] 
[ERROR] To see the full stack trace of the errors, re-run Maven with the -e switch.
[ERROR] Re-run Maven using the -X switch to enable full debug logging.
[ERROR] 
[ERROR] For more information about the errors and possible solutions, please read the following articles:
[ERROR] [Help 1] http://cwiki.apache.org/confluence/display/MAVEN/MojoFailureException
