[INFO] Scanning for projects...
[INFO]                                                                         
[INFO] ------------------------------------------------------------------------
[INFO] Building Joda-Time 2.8.1
[INFO] ------------------------------------------------------------------------
[INFO] 
[INFO] --- maven-resources-plugin:2.7:resources (default-resources) @ joda-time ---
[INFO] Using 'UTF-8' encoding to copy filtered resources.
[INFO] Copying 2 resources to META-INF
[INFO] Copying 10 resources
[INFO] 
[INFO] --- maven-compiler-plugin:3.3:compile (default-compile) @ joda-time ---
[INFO] Changes detected - recompiling the module!
[INFO] Compiling 166 source files to /home/perham/Study/LittleDarwin/Cases/joda-time-2.8.1/target/classes
[INFO] 
[INFO] --- exec-maven-plugin:1.4.0:java (compile-tzdb) @ joda-time ---
Writing zoneinfo files
Writing ZoneInfoMap
[INFO] 
[INFO] --- maven-resources-plugin:2.7:testResources (default-testResources) @ joda-time ---
[INFO] Using 'UTF-8' encoding to copy filtered resources.
[INFO] Copying 34 resources
[INFO] 
[INFO] --- maven-compiler-plugin:3.3:testCompile (default-testCompile) @ joda-time ---
[INFO] Nothing to compile - all classes are up to date
[INFO] 
[INFO] --- maven-surefire-plugin:2.18.1:test (default-test) @ joda-time ---
[INFO] Surefire report directory: /home/perham/Study/LittleDarwin/Cases/joda-time-2.8.1/target/surefire-reports

-------------------------------------------------------
 T E S T S
-------------------------------------------------------
Running org.joda.time.TestAllPackages

TestBuddhistChronology.testCalendar

TestCopticChronology.testCalendar

TestEthiopicChronology.testCalendar

TestIslamicChronology.testCalendar

Testing Gregorian chronology over 1000 iterations
100% complete (i=1000)

Testing Julian chronology over 1000 iterations
100% complete (i=1000)
Writing zoneinfo files
Writing ZoneInfoMap
Tests run: 4157, Failures: 4, Errors: 79, Skipped: 0, Time elapsed: 4.449 sec <<< FAILURE! - in org.joda.time.TestAllPackages
testPropertyEqualsHashCodeYear(org.joda.time.TestDateTime_Properties)  Time elapsed: 0.005 sec  <<< ERROR!
org.joda.time.IllegalFieldValueException: Value 9 for dayOfMonth must be in the range [1,5]
	at org.joda.time.field.FieldUtils.verifyValueBounds(FieldUtils.java:252)
	at org.joda.time.chrono.BasicChronology.getDateMidnightMillis(BasicChronology.java:613)
	at org.joda.time.chrono.BasicChronology.getDateTimeMillis(BasicChronology.java:177)
	at org.joda.time.chrono.CopticChronology.getDateTimeMillis(CopticChronology.java:50)
	at org.joda.time.chrono.LimitChronology.getDateTimeMillis(LimitChronology.java:187)
	at org.joda.time.chrono.BasicChronology.getDateTimeMillis(BasicChronology.java:168)
	at org.joda.time.chrono.CopticChronology.getDateTimeMillis(CopticChronology.java:50)
	at org.joda.time.chrono.ZonedChronology.getDateTimeMillis(ZonedChronology.java:118)
	at org.joda.time.chrono.BasicChronology.getDateTimeMillis(BasicChronology.java:168)
	at org.joda.time.chrono.CopticChronology.getDateTimeMillis(CopticChronology.java:50)
	at org.joda.time.base.BaseDateTime.<init>(BaseDateTime.java:258)
	at org.joda.time.DateTime.<init>(DateTime.java:532)
	at org.joda.time.TestDateTime_Properties.testPropertyEqualsHashCodeYear(TestDateTime_Properties.java:331)

testPropertyToIntervalHourOfDay(org.joda.time.TestDateTime_Properties)  Time elapsed: 0.001 sec  <<< ERROR!
org.joda.time.IllegalFieldValueException: Value 9 for dayOfMonth must be in the range [1,5]
	at org.joda.time.field.FieldUtils.verifyValueBounds(FieldUtils.java:252)
	at org.joda.time.chrono.BasicChronology.getDateMidnightMillis(BasicChronology.java:613)
	at org.joda.time.chrono.BasicChronology.getDateTimeMillis(BasicChronology.java:177)
	at org.joda.time.chrono.CopticChronology.getDateTimeMillis(CopticChronology.java:50)
	at org.joda.time.chrono.LimitChronology.getDateTimeMillis(LimitChronology.java:187)
	at org.joda.time.chrono.BasicChronology.getDateTimeMillis(BasicChronology.java:168)
	at org.joda.time.chrono.CopticChronology.getDateTimeMillis(CopticChronology.java:50)
	at org.joda.time.chrono.ZonedChronology.getDateTimeMillis(ZonedChronology.java:118)
	at org.joda.time.chrono.BasicChronology.getDateTimeMillis(BasicChronology.java:168)
	at org.joda.time.chrono.CopticChronology.getDateTimeMillis(CopticChronology.java:50)
	at org.joda.time.base.BaseDateTime.<init>(BaseDateTime.java:258)
	at org.joda.time.DateTime.<init>(DateTime.java:532)
	at org.joda.time.TestDateTime_Properties.testPropertyToIntervalHourOfDay(TestDateTime_Properties.java:1346)

testPropertyEqualsHashCodeStrict(org.joda.time.TestDateTime_Properties)  Time elapsed: 0.001 sec  <<< ERROR!
org.joda.time.IllegalFieldValueException: Value 9 for dayOfMonth must be in the range [1,5]
	at org.joda.time.field.FieldUtils.verifyValueBounds(FieldUtils.java:252)
	at org.joda.time.chrono.BasicChronology.getDateMidnightMillis(BasicChronology.java:613)
	at org.joda.time.chrono.BasicChronology.getDateTimeMillis(BasicChronology.java:177)
	at org.joda.time.chrono.CopticChronology.getDateTimeMillis(CopticChronology.java:50)
	at org.joda.time.chrono.LimitChronology.getDateTimeMillis(LimitChronology.java:187)
	at org.joda.time.chrono.BasicChronology.getDateTimeMillis(BasicChronology.java:168)
	at org.joda.time.chrono.CopticChronology.getDateTimeMillis(CopticChronology.java:50)
	at org.joda.time.chrono.ZonedChronology.getDateTimeMillis(ZonedChronology.java:118)
	at org.joda.time.chrono.BasicChronology.getDateTimeMillis(BasicChronology.java:168)
	at org.joda.time.chrono.CopticChronology.getDateTimeMillis(CopticChronology.java:50)
	at org.joda.time.chrono.AssembledChronology.getDateTimeMillis(AssembledChronology.java:133)
	at org.joda.time.base.BaseDateTime.<init>(BaseDateTime.java:258)
	at org.joda.time.DateTime.<init>(DateTime.java:532)
	at org.joda.time.TestDateTime_Properties.testPropertyEqualsHashCodeStrict(TestDateTime_Properties.java:1386)

testPropertyEqualsHashCodeStrict(org.joda.time.TestDateMidnight_Properties)  Time elapsed: 0.001 sec  <<< ERROR!
org.joda.time.IllegalFieldValueException: Value 9 for dayOfMonth must be in the range [1,5]
	at org.joda.time.field.FieldUtils.verifyValueBounds(FieldUtils.java:252)
	at org.joda.time.chrono.BasicChronology.getDateMidnightMillis(BasicChronology.java:613)
	at org.joda.time.chrono.BasicChronology.getDateTimeMillis(BasicChronology.java:177)
	at org.joda.time.chrono.CopticChronology.getDateTimeMillis(CopticChronology.java:50)
	at org.joda.time.chrono.LimitChronology.getDateTimeMillis(LimitChronology.java:187)
	at org.joda.time.chrono.BasicChronology.getDateTimeMillis(BasicChronology.java:168)
	at org.joda.time.chrono.CopticChronology.getDateTimeMillis(CopticChronology.java:50)
	at org.joda.time.chrono.ZonedChronology.getDateTimeMillis(ZonedChronology.java:118)
	at org.joda.time.chrono.BasicChronology.getDateTimeMillis(BasicChronology.java:168)
	at org.joda.time.chrono.CopticChronology.getDateTimeMillis(CopticChronology.java:50)
	at org.joda.time.chrono.AssembledChronology.getDateTimeMillis(AssembledChronology.java:133)
	at org.joda.time.base.BaseDateTime.<init>(BaseDateTime.java:258)
	at org.joda.time.DateMidnight.<init>(DateMidnight.java:350)
	at org.joda.time.TestDateMidnight_Properties.testPropertyEqualsHashCodeStrict(TestDateMidnight_Properties.java:534)

testToPeriod(org.joda.time.TestInterval_Basics)  Time elapsed: 0 sec  <<< ERROR!
org.joda.time.IllegalFieldValueException: Value 9 for dayOfMonth must be in the range [1,5]
	at org.joda.time.field.FieldUtils.verifyValueBounds(FieldUtils.java:252)
	at org.joda.time.chrono.BasicChronology.getDateMidnightMillis(BasicChronology.java:613)
	at org.joda.time.chrono.BasicChronology.getDateTimeMillis(BasicChronology.java:177)
	at org.joda.time.chrono.CopticChronology.getDateTimeMillis(CopticChronology.java:50)
	at org.joda.time.chrono.LimitChronology.getDateTimeMillis(LimitChronology.java:187)
	at org.joda.time.chrono.BasicChronology.getDateTimeMillis(BasicChronology.java:168)
	at org.joda.time.chrono.CopticChronology.getDateTimeMillis(CopticChronology.java:50)
	at org.joda.time.chrono.ZonedChronology.getDateTimeMillis(ZonedChronology.java:118)
	at org.joda.time.chrono.BasicChronology.getDateTimeMillis(BasicChronology.java:168)
	at org.joda.time.chrono.CopticChronology.getDateTimeMillis(CopticChronology.java:50)
	at org.joda.time.base.BaseDateTime.<init>(BaseDateTime.java:258)
	at org.joda.time.DateTime.<init>(DateTime.java:532)
	at org.joda.time.TestInterval_Basics.testToPeriod(TestInterval_Basics.java:993)

testToPeriod_PeriodType1(org.joda.time.TestInterval_Basics)  Time elapsed: 0 sec  <<< ERROR!
org.joda.time.IllegalFieldValueException: Value 9 for dayOfMonth must be in the range [1,5]
	at org.joda.time.field.FieldUtils.verifyValueBounds(FieldUtils.java:252)
	at org.joda.time.chrono.BasicChronology.getDateMidnightMillis(BasicChronology.java:613)
	at org.joda.time.chrono.BasicChronology.getDateTimeMillis(BasicChronology.java:177)
	at org.joda.time.chrono.CopticChronology.getDateTimeMillis(CopticChronology.java:50)
	at org.joda.time.chrono.LimitChronology.getDateTimeMillis(LimitChronology.java:187)
	at org.joda.time.chrono.BasicChronology.getDateTimeMillis(BasicChronology.java:168)
	at org.joda.time.chrono.CopticChronology.getDateTimeMillis(CopticChronology.java:50)
	at org.joda.time.chrono.ZonedChronology.getDateTimeMillis(ZonedChronology.java:118)
	at org.joda.time.chrono.BasicChronology.getDateTimeMillis(BasicChronology.java:168)
	at org.joda.time.chrono.CopticChronology.getDateTimeMillis(CopticChronology.java:50)
	at org.joda.time.base.BaseDateTime.<init>(BaseDateTime.java:258)
	at org.joda.time.DateTime.<init>(DateTime.java:532)
	at org.joda.time.TestInterval_Basics.testToPeriod_PeriodType1(TestInterval_Basics.java:1004)

testEqualsHashCode(org.joda.time.TestLocalDateTime_Basics)  Time elapsed: 0.001 sec  <<< ERROR!
org.joda.time.IllegalFieldValueException: Value 9 for dayOfMonth must be in the range [1,5]
	at org.joda.time.field.FieldUtils.verifyValueBounds(FieldUtils.java:252)
	at org.joda.time.chrono.BasicChronology.getDateMidnightMillis(BasicChronology.java:613)
	at org.joda.time.chrono.BasicChronology.getDateTimeMillis(BasicChronology.java:177)
	at org.joda.time.chrono.CopticChronology.getDateTimeMillis(CopticChronology.java:50)
	at org.joda.time.chrono.LimitChronology.getDateTimeMillis(LimitChronology.java:187)
	at org.joda.time.chrono.BasicChronology.getDateTimeMillis(BasicChronology.java:168)
	at org.joda.time.chrono.CopticChronology.getDateTimeMillis(CopticChronology.java:50)
	at org.joda.time.LocalDateTime.<init>(LocalDateTime.java:511)
	at org.joda.time.TestLocalDateTime_Basics.testEqualsHashCode(TestLocalDateTime_Basics.java:283)

testSerialization(org.joda.time.TestLocalDateTime_Basics)  Time elapsed: 0 sec  <<< ERROR!
org.joda.time.IllegalFieldValueException: Value 9 for dayOfMonth must be in the range [1,5]
	at org.joda.time.field.FieldUtils.verifyValueBounds(FieldUtils.java:252)
	at org.joda.time.chrono.BasicChronology.getDateMidnightMillis(BasicChronology.java:613)
	at org.joda.time.chrono.BasicChronology.getDateTimeMillis(BasicChronology.java:177)
	at org.joda.time.chrono.CopticChronology.getDateTimeMillis(CopticChronology.java:50)
	at org.joda.time.chrono.LimitChronology.getDateTimeMillis(LimitChronology.java:187)
	at org.joda.time.chrono.BasicChronology.getDateTimeMillis(BasicChronology.java:168)
	at org.joda.time.chrono.CopticChronology.getDateTimeMillis(CopticChronology.java:50)
	at org.joda.time.LocalDateTime.<init>(LocalDateTime.java:511)
	at org.joda.time.TestLocalDateTime_Basics.testSerialization(TestLocalDateTime_Basics.java:1049)

testToDateTime(org.joda.time.TestLocalDateTime_Basics)  Time elapsed: 0.001 sec  <<< ERROR!
org.joda.time.IllegalFieldValueException: Value 9 for dayOfMonth must be in the range [1,5]
	at org.joda.time.field.FieldUtils.verifyValueBounds(FieldUtils.java:252)
	at org.joda.time.chrono.BasicChronology.getDateMidnightMillis(BasicChronology.java:613)
	at org.joda.time.chrono.BasicChronology.getDateTimeMillis(BasicChronology.java:177)
	at org.joda.time.chrono.CopticChronology.getDateTimeMillis(CopticChronology.java:50)
	at org.joda.time.chrono.LimitChronology.getDateTimeMillis(LimitChronology.java:187)
	at org.joda.time.chrono.BasicChronology.getDateTimeMillis(BasicChronology.java:168)
	at org.joda.time.chrono.CopticChronology.getDateTimeMillis(CopticChronology.java:50)
	at org.joda.time.LocalDateTime.<init>(LocalDateTime.java:511)
	at org.joda.time.TestLocalDateTime_Basics.testToDateTime(TestLocalDateTime_Basics.java:767)

testToLocalDate(org.joda.time.TestLocalDateTime_Basics)  Time elapsed: 0.001 sec  <<< ERROR!
org.joda.time.IllegalFieldValueException: Value 9 for dayOfMonth must be in the range [1,5]
	at org.joda.time.field.FieldUtils.verifyValueBounds(FieldUtils.java:252)
	at org.joda.time.chrono.BasicChronology.getDateMidnightMillis(BasicChronology.java:613)
	at org.joda.time.chrono.BasicChronology.getDateTimeMillis(BasicChronology.java:177)
	at org.joda.time.chrono.CopticChronology.getDateTimeMillis(CopticChronology.java:50)
	at org.joda.time.chrono.LimitChronology.getDateTimeMillis(LimitChronology.java:187)
	at org.joda.time.chrono.BasicChronology.getDateTimeMillis(BasicChronology.java:168)
	at org.joda.time.chrono.CopticChronology.getDateTimeMillis(CopticChronology.java:50)
	at org.joda.time.LocalDateTime.<init>(LocalDateTime.java:511)
	at org.joda.time.TestLocalDateTime_Basics.testToLocalDate(TestLocalDateTime_Basics.java:818)

testToLocalTime(org.joda.time.TestLocalDateTime_Basics)  Time elapsed: 0 sec  <<< ERROR!
org.joda.time.IllegalFieldValueException: Value 9 for dayOfMonth must be in the range [1,5]
	at org.joda.time.field.FieldUtils.verifyValueBounds(FieldUtils.java:252)
	at org.joda.time.chrono.BasicChronology.getDateMidnightMillis(BasicChronology.java:613)
	at org.joda.time.chrono.BasicChronology.getDateTimeMillis(BasicChronology.java:177)
	at org.joda.time.chrono.CopticChronology.getDateTimeMillis(CopticChronology.java:50)
	at org.joda.time.chrono.LimitChronology.getDateTimeMillis(LimitChronology.java:187)
	at org.joda.time.chrono.BasicChronology.getDateTimeMillis(BasicChronology.java:168)
	at org.joda.time.chrono.CopticChronology.getDateTimeMillis(CopticChronology.java:50)
	at org.joda.time.LocalDateTime.<init>(LocalDateTime.java:511)
	at org.joda.time.TestLocalDateTime_Basics.testToLocalTime(TestLocalDateTime_Basics.java:824)

testToDateTime_nullZone(org.joda.time.TestLocalDateTime_Basics)  Time elapsed: 0 sec  <<< ERROR!
org.joda.time.IllegalFieldValueException: Value 9 for dayOfMonth must be in the range [1,5]
	at org.joda.time.field.FieldUtils.verifyValueBounds(FieldUtils.java:252)
	at org.joda.time.chrono.BasicChronology.getDateMidnightMillis(BasicChronology.java:613)
	at org.joda.time.chrono.BasicChronology.getDateTimeMillis(BasicChronology.java:177)
	at org.joda.time.chrono.CopticChronology.getDateTimeMillis(CopticChronology.java:50)
	at org.joda.time.chrono.LimitChronology.getDateTimeMillis(LimitChronology.java:187)
	at org.joda.time.chrono.BasicChronology.getDateTimeMillis(BasicChronology.java:168)
	at org.joda.time.chrono.CopticChronology.getDateTimeMillis(CopticChronology.java:50)
	at org.joda.time.LocalDateTime.<init>(LocalDateTime.java:511)
	at org.joda.time.TestLocalDateTime_Basics.testToDateTime_nullZone(TestLocalDateTime_Basics.java:786)

testToDateTime_RI(org.joda.time.TestLocalDateTime_Basics)  Time elapsed: 0.001 sec  <<< ERROR!
org.joda.time.IllegalFieldValueException: Value 9 for dayOfMonth must be in the range [1,5]
	at org.joda.time.field.FieldUtils.verifyValueBounds(FieldUtils.java:252)
	at org.joda.time.chrono.BasicChronology.getDateMidnightMillis(BasicChronology.java:613)
	at org.joda.time.chrono.BasicChronology.getDateTimeMillis(BasicChronology.java:177)
	at org.joda.time.chrono.CopticChronology.getDateTimeMillis(CopticChronology.java:50)
	at org.joda.time.chrono.LimitChronology.getDateTimeMillis(LimitChronology.java:187)
	at org.joda.time.chrono.BasicChronology.getDateTimeMillis(BasicChronology.java:168)
	at org.joda.time.chrono.CopticChronology.getDateTimeMillis(CopticChronology.java:50)
	at org.joda.time.LocalDateTime.<init>(LocalDateTime.java:511)
	at org.joda.time.TestLocalDateTime_Basics.testToDateTime_RI(TestLocalDateTime_Basics.java:831)

testToDateTime_nullRI(org.joda.time.TestLocalDateTime_Basics)  Time elapsed: 0 sec  <<< ERROR!
org.joda.time.IllegalFieldValueException: Value 9 for dayOfMonth must be in the range [1,5]
	at org.joda.time.field.FieldUtils.verifyValueBounds(FieldUtils.java:252)
	at org.joda.time.chrono.BasicChronology.getDateMidnightMillis(BasicChronology.java:613)
	at org.joda.time.chrono.BasicChronology.getDateTimeMillis(BasicChronology.java:177)
	at org.joda.time.chrono.CopticChronology.getDateTimeMillis(CopticChronology.java:50)
	at org.joda.time.chrono.LimitChronology.getDateTimeMillis(LimitChronology.java:187)
	at org.joda.time.chrono.BasicChronology.getDateTimeMillis(BasicChronology.java:168)
	at org.joda.time.chrono.CopticChronology.getDateTimeMillis(CopticChronology.java:50)
	at org.joda.time.LocalDateTime.<init>(LocalDateTime.java:511)
	at org.joda.time.TestLocalDateTime_Basics.testToDateTime_nullRI(TestLocalDateTime_Basics.java:841)

testToDate_summer(org.joda.time.TestLocalDateTime_Basics)  Time elapsed: 0.001 sec  <<< ERROR!
org.joda.time.IllegalFieldValueException: Value 9 for dayOfMonth must be in the range [1,5]
	at org.joda.time.field.FieldUtils.verifyValueBounds(FieldUtils.java:252)
	at org.joda.time.chrono.BasicChronology.getDateMidnightMillis(BasicChronology.java:613)
	at org.joda.time.chrono.BasicChronology.getDateTimeMillis(BasicChronology.java:177)
	at org.joda.time.chrono.CopticChronology.getDateTimeMillis(CopticChronology.java:50)
	at org.joda.time.chrono.LimitChronology.getDateTimeMillis(LimitChronology.java:187)
	at org.joda.time.chrono.BasicChronology.getDateTimeMillis(BasicChronology.java:168)
	at org.joda.time.chrono.CopticChronology.getDateTimeMillis(CopticChronology.java:50)
	at org.joda.time.LocalDateTime.<init>(LocalDateTime.java:511)
	at org.joda.time.TestLocalDateTime_Basics.testToDate_summer(TestLocalDateTime_Basics.java:851)

testToDate_winter(org.joda.time.TestLocalDateTime_Basics)  Time elapsed: 0.001 sec  <<< ERROR!
org.joda.time.IllegalFieldValueException: Value 9 for dayOfMonth must be in the range [1,5]
	at org.joda.time.field.FieldUtils.verifyValueBounds(FieldUtils.java:252)
	at org.joda.time.chrono.BasicChronology.getDateMidnightMillis(BasicChronology.java:613)
	at org.joda.time.chrono.BasicChronology.getDateTimeMillis(BasicChronology.java:177)
	at org.joda.time.chrono.CopticChronology.getDateTimeMillis(CopticChronology.java:50)
	at org.joda.time.chrono.LimitChronology.getDateTimeMillis(LimitChronology.java:187)
	at org.joda.time.chrono.BasicChronology.getDateTimeMillis(BasicChronology.java:168)
	at org.joda.time.chrono.CopticChronology.getDateTimeMillis(CopticChronology.java:50)
	at org.joda.time.LocalDateTime.<init>(LocalDateTime.java:511)
	at org.joda.time.TestLocalDateTime_Basics.testToDate_winter(TestLocalDateTime_Basics.java:869)

testToDate_summer_Zone(org.joda.time.TestLocalDateTime_Basics)  Time elapsed: 0.001 sec  <<< ERROR!
org.joda.time.IllegalFieldValueException: Value 9 for dayOfMonth must be in the range [1,5]
	at org.joda.time.field.FieldUtils.verifyValueBounds(FieldUtils.java:252)
	at org.joda.time.chrono.BasicChronology.getDateMidnightMillis(BasicChronology.java:613)
	at org.joda.time.chrono.BasicChronology.getDateTimeMillis(BasicChronology.java:177)
	at org.joda.time.chrono.CopticChronology.getDateTimeMillis(CopticChronology.java:50)
	at org.joda.time.chrono.LimitChronology.getDateTimeMillis(LimitChronology.java:187)
	at org.joda.time.chrono.BasicChronology.getDateTimeMillis(BasicChronology.java:168)
	at org.joda.time.chrono.CopticChronology.getDateTimeMillis(CopticChronology.java:50)
	at org.joda.time.LocalDateTime.<init>(LocalDateTime.java:511)
	at org.joda.time.TestLocalDateTime_Basics.testToDate_summer_Zone(TestLocalDateTime_Basics.java:936)

testToDate_winter_Zone(org.joda.time.TestLocalDateTime_Basics)  Time elapsed: 0.001 sec  <<< ERROR!
org.joda.time.IllegalFieldValueException: Value 9 for dayOfMonth must be in the range [1,5]
	at org.joda.time.field.FieldUtils.verifyValueBounds(FieldUtils.java:252)
	at org.joda.time.chrono.BasicChronology.getDateMidnightMillis(BasicChronology.java:613)
	at org.joda.time.chrono.BasicChronology.getDateTimeMillis(BasicChronology.java:177)
	at org.joda.time.chrono.CopticChronology.getDateTimeMillis(CopticChronology.java:50)
	at org.joda.time.chrono.LimitChronology.getDateTimeMillis(LimitChronology.java:187)
	at org.joda.time.chrono.BasicChronology.getDateTimeMillis(BasicChronology.java:168)
	at org.joda.time.chrono.CopticChronology.getDateTimeMillis(CopticChronology.java:50)
	at org.joda.time.LocalDateTime.<init>(LocalDateTime.java:511)
	at org.joda.time.TestLocalDateTime_Basics.testToDate_winter_Zone(TestLocalDateTime_Basics.java:954)

testToDateTime_Zone(org.joda.time.TestLocalDateTime_Basics)  Time elapsed: 0.001 sec  <<< ERROR!
org.joda.time.IllegalFieldValueException: Value 9 for dayOfMonth must be in the range [1,5]
	at org.joda.time.field.FieldUtils.verifyValueBounds(FieldUtils.java:252)
	at org.joda.time.chrono.BasicChronology.getDateMidnightMillis(BasicChronology.java:613)
	at org.joda.time.chrono.BasicChronology.getDateTimeMillis(BasicChronology.java:177)
	at org.joda.time.chrono.CopticChronology.getDateTimeMillis(CopticChronology.java:50)
	at org.joda.time.chrono.LimitChronology.getDateTimeMillis(LimitChronology.java:187)
	at org.joda.time.chrono.BasicChronology.getDateTimeMillis(BasicChronology.java:168)
	at org.joda.time.chrono.CopticChronology.getDateTimeMillis(CopticChronology.java:50)
	at org.joda.time.LocalDateTime.<init>(LocalDateTime.java:511)
	at org.joda.time.TestLocalDateTime_Basics.testToDateTime_Zone(TestLocalDateTime_Basics.java:777)

testPropertyEquals(org.joda.time.TestLocalDateTime_Properties)  Time elapsed: 0.001 sec  <<< ERROR!
org.joda.time.IllegalFieldValueException: Value 8 for dayOfMonth must be in the range [1,5]
	at org.joda.time.field.FieldUtils.verifyValueBounds(FieldUtils.java:252)
	at org.joda.time.chrono.BasicChronology.getDateMidnightMillis(BasicChronology.java:613)
	at org.joda.time.chrono.BasicChronology.getDateTimeMillis(BasicChronology.java:177)
	at org.joda.time.chrono.CopticChronology.getDateTimeMillis(CopticChronology.java:50)
	at org.joda.time.chrono.LimitChronology.getDateTimeMillis(LimitChronology.java:187)
	at org.joda.time.chrono.BasicChronology.getDateTimeMillis(BasicChronology.java:168)
	at org.joda.time.chrono.CopticChronology.getDateTimeMillis(CopticChronology.java:50)
	at org.joda.time.LocalDateTime.<init>(LocalDateTime.java:511)
	at org.joda.time.TestLocalDateTime_Properties.testPropertyEquals(TestLocalDateTime_Properties.java:499)

testEqualsHashCode(org.joda.time.TestLocalDate_Basics)  Time elapsed: 0.001 sec  <<< ERROR!
org.joda.time.IllegalFieldValueException: Value 9 for dayOfMonth must be in the range [1,5]
	at org.joda.time.field.FieldUtils.verifyValueBounds(FieldUtils.java:252)
	at org.joda.time.chrono.BasicChronology.getDateMidnightMillis(BasicChronology.java:613)
	at org.joda.time.chrono.BasicChronology.getDateTimeMillis(BasicChronology.java:159)
	at org.joda.time.chrono.CopticChronology.getDateTimeMillis(CopticChronology.java:50)
	at org.joda.time.chrono.LimitChronology.getDateTimeMillis(LimitChronology.java:177)
	at org.joda.time.chrono.BasicChronology.getDateTimeMillis(BasicChronology.java:154)
	at org.joda.time.chrono.CopticChronology.getDateTimeMillis(CopticChronology.java:50)
	at org.joda.time.LocalDate.<init>(LocalDate.java:457)
	at org.joda.time.TestLocalDate_Basics.testEqualsHashCode(TestLocalDate_Basics.java:245)

testSerialization(org.joda.time.TestLocalDate_Basics)  Time elapsed: 0.001 sec  <<< ERROR!
org.joda.time.IllegalFieldValueException: Value 9 for dayOfMonth must be in the range [1,5]
	at org.joda.time.field.FieldUtils.verifyValueBounds(FieldUtils.java:252)
	at org.joda.time.chrono.BasicChronology.getDateMidnightMillis(BasicChronology.java:613)
	at org.joda.time.chrono.BasicChronology.getDateTimeMillis(BasicChronology.java:159)
	at org.joda.time.chrono.CopticChronology.getDateTimeMillis(CopticChronology.java:50)
	at org.joda.time.chrono.LimitChronology.getDateTimeMillis(LimitChronology.java:177)
	at org.joda.time.chrono.BasicChronology.getDateTimeMillis(BasicChronology.java:154)
	at org.joda.time.chrono.CopticChronology.getDateTimeMillis(CopticChronology.java:50)
	at org.joda.time.LocalDate.<init>(LocalDate.java:457)
	at org.joda.time.TestLocalDate_Basics.testSerialization(TestLocalDate_Basics.java:1104)

testToDateMidnight(org.joda.time.TestLocalDate_Basics)  Time elapsed: 0 sec  <<< ERROR!
org.joda.time.IllegalFieldValueException: Value 9 for dayOfMonth must be in the range [1,5]
	at org.joda.time.field.FieldUtils.verifyValueBounds(FieldUtils.java:252)
	at org.joda.time.chrono.BasicChronology.getDateMidnightMillis(BasicChronology.java:613)
	at org.joda.time.chrono.BasicChronology.getDateTimeMillis(BasicChronology.java:159)
	at org.joda.time.chrono.CopticChronology.getDateTimeMillis(CopticChronology.java:50)
	at org.joda.time.chrono.LimitChronology.getDateTimeMillis(LimitChronology.java:177)
	at org.joda.time.chrono.BasicChronology.getDateTimeMillis(BasicChronology.java:154)
	at org.joda.time.chrono.CopticChronology.getDateTimeMillis(CopticChronology.java:50)
	at org.joda.time.LocalDate.<init>(LocalDate.java:457)
	at org.joda.time.TestLocalDate_Basics.testToDateMidnight(TestLocalDate_Basics.java:904)

testToInterval(org.joda.time.TestLocalDate_Basics)  Time elapsed: 0.001 sec  <<< ERROR!
org.joda.time.IllegalFieldValueException: Value 9 for dayOfMonth must be in the range [1,5]
	at org.joda.time.field.FieldUtils.verifyValueBounds(FieldUtils.java:252)
	at org.joda.time.chrono.BasicChronology.getDateMidnightMillis(BasicChronology.java:613)
	at org.joda.time.chrono.BasicChronology.getDateTimeMillis(BasicChronology.java:159)
	at org.joda.time.chrono.CopticChronology.getDateTimeMillis(CopticChronology.java:50)
	at org.joda.time.chrono.LimitChronology.getDateTimeMillis(LimitChronology.java:177)
	at org.joda.time.chrono.BasicChronology.getDateTimeMillis(BasicChronology.java:154)
	at org.joda.time.chrono.CopticChronology.getDateTimeMillis(CopticChronology.java:50)
	at org.joda.time.LocalDate.<init>(LocalDate.java:457)
	at org.joda.time.TestLocalDate_Basics.testToInterval(TestLocalDate_Basics.java:960)

testToDateTime_RI(org.joda.time.TestLocalDate_Basics)  Time elapsed: 0.001 sec  <<< ERROR!
org.joda.time.IllegalFieldValueException: Value 9 for dayOfMonth must be in the range [1,5]
	at org.joda.time.field.FieldUtils.verifyValueBounds(FieldUtils.java:252)
	at org.joda.time.chrono.BasicChronology.getDateMidnightMillis(BasicChronology.java:613)
	at org.joda.time.chrono.BasicChronology.getDateTimeMillis(BasicChronology.java:159)
	at org.joda.time.chrono.CopticChronology.getDateTimeMillis(CopticChronology.java:50)
	at org.joda.time.chrono.LimitChronology.getDateTimeMillis(LimitChronology.java:177)
	at org.joda.time.chrono.BasicChronology.getDateTimeMillis(BasicChronology.java:154)
	at org.joda.time.chrono.CopticChronology.getDateTimeMillis(CopticChronology.java:50)
	at org.joda.time.LocalDate.<init>(LocalDate.java:457)
	at org.joda.time.TestLocalDate_Basics.testToDateTime_RI(TestLocalDate_Basics.java:932)

testToDate_summer(org.joda.time.TestLocalDate_Basics)  Time elapsed: 0 sec  <<< ERROR!
org.joda.time.IllegalFieldValueException: Value 9 for dayOfMonth must be in the range [1,5]
	at org.joda.time.field.FieldUtils.verifyValueBounds(FieldUtils.java:252)
	at org.joda.time.chrono.BasicChronology.getDateMidnightMillis(BasicChronology.java:613)
	at org.joda.time.chrono.BasicChronology.getDateTimeMillis(BasicChronology.java:159)
	at org.joda.time.chrono.CopticChronology.getDateTimeMillis(CopticChronology.java:50)
	at org.joda.time.chrono.LimitChronology.getDateTimeMillis(LimitChronology.java:177)
	at org.joda.time.chrono.BasicChronology.getDateTimeMillis(BasicChronology.java:154)
	at org.joda.time.chrono.CopticChronology.getDateTimeMillis(CopticChronology.java:50)
	at org.joda.time.LocalDate.<init>(LocalDate.java:457)
	at org.joda.time.TestLocalDate_Basics.testToDate_summer(TestLocalDate_Basics.java:1003)

testToDate_winter(org.joda.time.TestLocalDate_Basics)  Time elapsed: 0.001 sec  <<< ERROR!
org.joda.time.IllegalFieldValueException: Value 9 for dayOfMonth must be in the range [1,5]
	at org.joda.time.field.FieldUtils.verifyValueBounds(FieldUtils.java:252)
	at org.joda.time.chrono.BasicChronology.getDateMidnightMillis(BasicChronology.java:613)
	at org.joda.time.chrono.BasicChronology.getDateTimeMillis(BasicChronology.java:159)
	at org.joda.time.chrono.CopticChronology.getDateTimeMillis(CopticChronology.java:50)
	at org.joda.time.chrono.LimitChronology.getDateTimeMillis(LimitChronology.java:177)
	at org.joda.time.chrono.BasicChronology.getDateTimeMillis(BasicChronology.java:154)
	at org.joda.time.chrono.CopticChronology.getDateTimeMillis(CopticChronology.java:50)
	at org.joda.time.LocalDate.<init>(LocalDate.java:457)
	at org.joda.time.TestLocalDate_Basics.testToDate_winter(TestLocalDate_Basics.java:1017)

testEqualsHashCodeStrict(org.joda.time.TestLocalDate_Basics)  Time elapsed: 0.001 sec  <<< ERROR!
org.joda.time.IllegalFieldValueException: Value 9 for dayOfMonth must be in the range [1,5]
	at org.joda.time.field.FieldUtils.verifyValueBounds(FieldUtils.java:252)
	at org.joda.time.chrono.BasicChronology.getDateMidnightMillis(BasicChronology.java:613)
	at org.joda.time.chrono.BasicChronology.getDateTimeMillis(BasicChronology.java:159)
	at org.joda.time.chrono.CopticChronology.getDateTimeMillis(CopticChronology.java:50)
	at org.joda.time.chrono.LimitChronology.getDateTimeMillis(LimitChronology.java:177)
	at org.joda.time.chrono.BasicChronology.getDateTimeMillis(BasicChronology.java:154)
	at org.joda.time.chrono.CopticChronology.getDateTimeMillis(CopticChronology.java:50)
	at org.joda.time.chrono.AssembledChronology.getDateTimeMillis(AssembledChronology.java:120)
	at org.joda.time.LocalDate.<init>(LocalDate.java:457)
	at org.joda.time.TestLocalDate_Basics.testEqualsHashCodeStrict(TestLocalDate_Basics.java:299)

testToDateTimeAtStartOfDay(org.joda.time.TestLocalDate_Basics)  Time elapsed: 0 sec  <<< ERROR!
org.joda.time.IllegalFieldValueException: Value 9 for dayOfMonth must be in the range [1,5]
	at org.joda.time.field.FieldUtils.verifyValueBounds(FieldUtils.java:252)
	at org.joda.time.chrono.BasicChronology.getDateMidnightMillis(BasicChronology.java:613)
	at org.joda.time.chrono.BasicChronology.getDateTimeMillis(BasicChronology.java:159)
	at org.joda.time.chrono.CopticChronology.getDateTimeMillis(CopticChronology.java:50)
	at org.joda.time.chrono.LimitChronology.getDateTimeMillis(LimitChronology.java:177)
	at org.joda.time.chrono.BasicChronology.getDateTimeMillis(BasicChronology.java:154)
	at org.joda.time.chrono.CopticChronology.getDateTimeMillis(CopticChronology.java:50)
	at org.joda.time.LocalDate.<init>(LocalDate.java:457)
	at org.joda.time.TestLocalDate_Basics.testToDateTimeAtStartOfDay(TestLocalDate_Basics.java:664)

testToDateTimeAtStartOfDay_Zone(org.joda.time.TestLocalDate_Basics)  Time elapsed: 0 sec  <<< ERROR!
org.joda.time.IllegalFieldValueException: Value 9 for dayOfMonth must be in the range [1,5]
	at org.joda.time.field.FieldUtils.verifyValueBounds(FieldUtils.java:252)
	at org.joda.time.chrono.BasicChronology.getDateMidnightMillis(BasicChronology.java:613)
	at org.joda.time.chrono.BasicChronology.getDateTimeMillis(BasicChronology.java:159)
	at org.joda.time.chrono.CopticChronology.getDateTimeMillis(CopticChronology.java:50)
	at org.joda.time.chrono.LimitChronology.getDateTimeMillis(LimitChronology.java:177)
	at org.joda.time.chrono.BasicChronology.getDateTimeMillis(BasicChronology.java:154)
	at org.joda.time.chrono.CopticChronology.getDateTimeMillis(CopticChronology.java:50)
	at org.joda.time.LocalDate.<init>(LocalDate.java:457)
	at org.joda.time.TestLocalDate_Basics.testToDateTimeAtStartOfDay_Zone(TestLocalDate_Basics.java:682)

testToDateTimeAtStartOfDay_nullZone(org.joda.time.TestLocalDate_Basics)  Time elapsed: 0 sec  <<< ERROR!
org.joda.time.IllegalFieldValueException: Value 9 for dayOfMonth must be in the range [1,5]
	at org.joda.time.field.FieldUtils.verifyValueBounds(FieldUtils.java:252)
	at org.joda.time.chrono.BasicChronology.getDateMidnightMillis(BasicChronology.java:613)
	at org.joda.time.chrono.BasicChronology.getDateTimeMillis(BasicChronology.java:159)
	at org.joda.time.chrono.CopticChronology.getDateTimeMillis(CopticChronology.java:50)
	at org.joda.time.chrono.LimitChronology.getDateTimeMillis(LimitChronology.java:177)
	at org.joda.time.chrono.BasicChronology.getDateTimeMillis(BasicChronology.java:154)
	at org.joda.time.chrono.CopticChronology.getDateTimeMillis(CopticChronology.java:50)
	at org.joda.time.LocalDate.<init>(LocalDate.java:457)
	at org.joda.time.TestLocalDate_Basics.testToDateTimeAtStartOfDay_nullZone(TestLocalDate_Basics.java:698)

testToDateTimeAtMidnight(org.joda.time.TestLocalDate_Basics)  Time elapsed: 0.001 sec  <<< ERROR!
org.joda.time.IllegalFieldValueException: Value 9 for dayOfMonth must be in the range [1,5]
	at org.joda.time.field.FieldUtils.verifyValueBounds(FieldUtils.java:252)
	at org.joda.time.chrono.BasicChronology.getDateMidnightMillis(BasicChronology.java:613)
	at org.joda.time.chrono.BasicChronology.getDateTimeMillis(BasicChronology.java:159)
	at org.joda.time.chrono.CopticChronology.getDateTimeMillis(CopticChronology.java:50)
	at org.joda.time.chrono.LimitChronology.getDateTimeMillis(LimitChronology.java:177)
	at org.joda.time.chrono.BasicChronology.getDateTimeMillis(BasicChronology.java:154)
	at org.joda.time.chrono.CopticChronology.getDateTimeMillis(CopticChronology.java:50)
	at org.joda.time.LocalDate.<init>(LocalDate.java:457)
	at org.joda.time.TestLocalDate_Basics.testToDateTimeAtMidnight(TestLocalDate_Basics.java:708)

testToDateTimeAtMidnight_Zone(org.joda.time.TestLocalDate_Basics)  Time elapsed: 0.001 sec  <<< ERROR!
org.joda.time.IllegalFieldValueException: Value 9 for dayOfMonth must be in the range [1,5]
	at org.joda.time.field.FieldUtils.verifyValueBounds(FieldUtils.java:252)
	at org.joda.time.chrono.BasicChronology.getDateMidnightMillis(BasicChronology.java:613)
	at org.joda.time.chrono.BasicChronology.getDateTimeMillis(BasicChronology.java:159)
	at org.joda.time.chrono.CopticChronology.getDateTimeMillis(CopticChronology.java:50)
	at org.joda.time.chrono.LimitChronology.getDateTimeMillis(LimitChronology.java:177)
	at org.joda.time.chrono.BasicChronology.getDateTimeMillis(BasicChronology.java:154)
	at org.joda.time.chrono.CopticChronology.getDateTimeMillis(CopticChronology.java:50)
	at org.joda.time.LocalDate.<init>(LocalDate.java:457)
	at org.joda.time.TestLocalDate_Basics.testToDateTimeAtMidnight_Zone(TestLocalDate_Basics.java:718)

testToDateTimeAtMidnight_nullZone(org.joda.time.TestLocalDate_Basics)  Time elapsed: 0 sec  <<< ERROR!
org.joda.time.IllegalFieldValueException: Value 9 for dayOfMonth must be in the range [1,5]
	at org.joda.time.field.FieldUtils.verifyValueBounds(FieldUtils.java:252)
	at org.joda.time.chrono.BasicChronology.getDateMidnightMillis(BasicChronology.java:613)
	at org.joda.time.chrono.BasicChronology.getDateTimeMillis(BasicChronology.java:159)
	at org.joda.time.chrono.CopticChronology.getDateTimeMillis(CopticChronology.java:50)
	at org.joda.time.chrono.LimitChronology.getDateTimeMillis(LimitChronology.java:177)
	at org.joda.time.chrono.BasicChronology.getDateTimeMillis(BasicChronology.java:154)
	at org.joda.time.chrono.CopticChronology.getDateTimeMillis(CopticChronology.java:50)
	at org.joda.time.LocalDate.<init>(LocalDate.java:457)
	at org.joda.time.TestLocalDate_Basics.testToDateTimeAtMidnight_nullZone(TestLocalDate_Basics.java:727)

testToDateTimeAtCurrentTime(org.joda.time.TestLocalDate_Basics)  Time elapsed: 0 sec  <<< ERROR!
org.joda.time.IllegalFieldValueException: Value 9 for dayOfMonth must be in the range [1,5]
	at org.joda.time.field.FieldUtils.verifyValueBounds(FieldUtils.java:252)
	at org.joda.time.chrono.BasicChronology.getDateMidnightMillis(BasicChronology.java:613)
	at org.joda.time.chrono.BasicChronology.getDateTimeMillis(BasicChronology.java:159)
	at org.joda.time.chrono.CopticChronology.getDateTimeMillis(CopticChronology.java:50)
	at org.joda.time.chrono.LimitChronology.getDateTimeMillis(LimitChronology.java:177)
	at org.joda.time.chrono.BasicChronology.getDateTimeMillis(BasicChronology.java:154)
	at org.joda.time.chrono.CopticChronology.getDateTimeMillis(CopticChronology.java:50)
	at org.joda.time.LocalDate.<init>(LocalDate.java:457)
	at org.joda.time.TestLocalDate_Basics.testToDateTimeAtCurrentTime(TestLocalDate_Basics.java:736)

testToDateTimeAtCurrentTime_Zone(org.joda.time.TestLocalDate_Basics)  Time elapsed: 0 sec  <<< ERROR!
org.joda.time.IllegalFieldValueException: Value 9 for dayOfMonth must be in the range [1,5]
	at org.joda.time.field.FieldUtils.verifyValueBounds(FieldUtils.java:252)
	at org.joda.time.chrono.BasicChronology.getDateMidnightMillis(BasicChronology.java:613)
	at org.joda.time.chrono.BasicChronology.getDateTimeMillis(BasicChronology.java:159)
	at org.joda.time.chrono.CopticChronology.getDateTimeMillis(CopticChronology.java:50)
	at org.joda.time.chrono.LimitChronology.getDateTimeMillis(LimitChronology.java:177)
	at org.joda.time.chrono.BasicChronology.getDateTimeMillis(BasicChronology.java:154)
	at org.joda.time.chrono.CopticChronology.getDateTimeMillis(CopticChronology.java:50)
	at org.joda.time.LocalDate.<init>(LocalDate.java:457)
	at org.joda.time.TestLocalDate_Basics.testToDateTimeAtCurrentTime_Zone(TestLocalDate_Basics.java:751)

testToDateTimeAtCurrentTime_nullZone(org.joda.time.TestLocalDate_Basics)  Time elapsed: 0.001 sec  <<< ERROR!
org.joda.time.IllegalFieldValueException: Value 9 for dayOfMonth must be in the range [1,5]
	at org.joda.time.field.FieldUtils.verifyValueBounds(FieldUtils.java:252)
	at org.joda.time.chrono.BasicChronology.getDateMidnightMillis(BasicChronology.java:613)
	at org.joda.time.chrono.BasicChronology.getDateTimeMillis(BasicChronology.java:159)
	at org.joda.time.chrono.CopticChronology.getDateTimeMillis(CopticChronology.java:50)
	at org.joda.time.chrono.LimitChronology.getDateTimeMillis(LimitChronology.java:177)
	at org.joda.time.chrono.BasicChronology.getDateTimeMillis(BasicChronology.java:154)
	at org.joda.time.chrono.CopticChronology.getDateTimeMillis(CopticChronology.java:50)
	at org.joda.time.LocalDate.<init>(LocalDate.java:457)
	at org.joda.time.TestLocalDate_Basics.testToDateTimeAtCurrentTime_nullZone(TestLocalDate_Basics.java:765)

testToLocalDateTime_LocalTime(org.joda.time.TestLocalDate_Basics)  Time elapsed: 0 sec  <<< ERROR!
org.joda.time.IllegalFieldValueException: Value 9 for dayOfMonth must be in the range [1,5]
	at org.joda.time.field.FieldUtils.verifyValueBounds(FieldUtils.java:252)
	at org.joda.time.chrono.BasicChronology.getDateMidnightMillis(BasicChronology.java:613)
	at org.joda.time.chrono.BasicChronology.getDateTimeMillis(BasicChronology.java:159)
	at org.joda.time.chrono.CopticChronology.getDateTimeMillis(CopticChronology.java:50)
	at org.joda.time.chrono.LimitChronology.getDateTimeMillis(LimitChronology.java:177)
	at org.joda.time.chrono.BasicChronology.getDateTimeMillis(BasicChronology.java:154)
	at org.joda.time.chrono.CopticChronology.getDateTimeMillis(CopticChronology.java:50)
	at org.joda.time.LocalDate.<init>(LocalDate.java:457)
	at org.joda.time.TestLocalDate_Basics.testToLocalDateTime_LocalTime(TestLocalDate_Basics.java:780)

testToLocalDateTime_nullLocalTime(org.joda.time.TestLocalDate_Basics)  Time elapsed: 0.001 sec  <<< ERROR!
org.joda.time.IllegalFieldValueException: Value 9 for dayOfMonth must be in the range [1,5]
	at org.joda.time.field.FieldUtils.verifyValueBounds(FieldUtils.java:252)
	at org.joda.time.chrono.BasicChronology.getDateMidnightMillis(BasicChronology.java:613)
	at org.joda.time.chrono.BasicChronology.getDateTimeMillis(BasicChronology.java:159)
	at org.joda.time.chrono.CopticChronology.getDateTimeMillis(CopticChronology.java:50)
	at org.joda.time.chrono.LimitChronology.getDateTimeMillis(LimitChronology.java:177)
	at org.joda.time.chrono.BasicChronology.getDateTimeMillis(BasicChronology.java:154)
	at org.joda.time.chrono.CopticChronology.getDateTimeMillis(CopticChronology.java:50)
	at org.joda.time.LocalDate.<init>(LocalDate.java:457)
	at org.joda.time.TestLocalDate_Basics.testToLocalDateTime_nullLocalTime(TestLocalDate_Basics.java:790)

testToLocalDateTime_wrongChronologyLocalTime(org.joda.time.TestLocalDate_Basics)  Time elapsed: 0 sec  <<< ERROR!
org.joda.time.IllegalFieldValueException: Value 9 for dayOfMonth must be in the range [1,5]
	at org.joda.time.field.FieldUtils.verifyValueBounds(FieldUtils.java:252)
	at org.joda.time.chrono.BasicChronology.getDateMidnightMillis(BasicChronology.java:613)
	at org.joda.time.chrono.BasicChronology.getDateTimeMillis(BasicChronology.java:159)
	at org.joda.time.chrono.CopticChronology.getDateTimeMillis(CopticChronology.java:50)
	at org.joda.time.chrono.LimitChronology.getDateTimeMillis(LimitChronology.java:177)
	at org.joda.time.chrono.BasicChronology.getDateTimeMillis(BasicChronology.java:154)
	at org.joda.time.chrono.CopticChronology.getDateTimeMillis(CopticChronology.java:50)
	at org.joda.time.LocalDate.<init>(LocalDate.java:457)
	at org.joda.time.TestLocalDate_Basics.testToLocalDateTime_wrongChronologyLocalTime(TestLocalDate_Basics.java:801)

testToDateTime_LocalTime(org.joda.time.TestLocalDate_Basics)  Time elapsed: 0 sec  <<< ERROR!
org.joda.time.IllegalFieldValueException: Value 9 for dayOfMonth must be in the range [1,5]
	at org.joda.time.field.FieldUtils.verifyValueBounds(FieldUtils.java:252)
	at org.joda.time.chrono.BasicChronology.getDateMidnightMillis(BasicChronology.java:613)
	at org.joda.time.chrono.BasicChronology.getDateTimeMillis(BasicChronology.java:159)
	at org.joda.time.chrono.CopticChronology.getDateTimeMillis(CopticChronology.java:50)
	at org.joda.time.chrono.LimitChronology.getDateTimeMillis(LimitChronology.java:177)
	at org.joda.time.chrono.BasicChronology.getDateTimeMillis(BasicChronology.java:154)
	at org.joda.time.chrono.CopticChronology.getDateTimeMillis(CopticChronology.java:50)
	at org.joda.time.LocalDate.<init>(LocalDate.java:457)
	at org.joda.time.TestLocalDate_Basics.testToDateTime_LocalTime(TestLocalDate_Basics.java:814)

testToDateTime_nullLocalTime(org.joda.time.TestLocalDate_Basics)  Time elapsed: 0 sec  <<< ERROR!
org.joda.time.IllegalFieldValueException: Value 9 for dayOfMonth must be in the range [1,5]
	at org.joda.time.field.FieldUtils.verifyValueBounds(FieldUtils.java:252)
	at org.joda.time.chrono.BasicChronology.getDateMidnightMillis(BasicChronology.java:613)
	at org.joda.time.chrono.BasicChronology.getDateTimeMillis(BasicChronology.java:159)
	at org.joda.time.chrono.CopticChronology.getDateTimeMillis(CopticChronology.java:50)
	at org.joda.time.chrono.LimitChronology.getDateTimeMillis(LimitChronology.java:177)
	at org.joda.time.chrono.BasicChronology.getDateTimeMillis(BasicChronology.java:154)
	at org.joda.time.chrono.CopticChronology.getDateTimeMillis(CopticChronology.java:50)
	at org.joda.time.LocalDate.<init>(LocalDate.java:457)
	at org.joda.time.TestLocalDate_Basics.testToDateTime_nullLocalTime(TestLocalDate_Basics.java:824)

testToDateTime_LocalTime_Zone(org.joda.time.TestLocalDate_Basics)  Time elapsed: 0 sec  <<< ERROR!
org.joda.time.IllegalFieldValueException: Value 9 for dayOfMonth must be in the range [1,5]
	at org.joda.time.field.FieldUtils.verifyValueBounds(FieldUtils.java:252)
	at org.joda.time.chrono.BasicChronology.getDateMidnightMillis(BasicChronology.java:613)
	at org.joda.time.chrono.BasicChronology.getDateTimeMillis(BasicChronology.java:159)
	at org.joda.time.chrono.CopticChronology.getDateTimeMillis(CopticChronology.java:50)
	at org.joda.time.chrono.LimitChronology.getDateTimeMillis(LimitChronology.java:177)
	at org.joda.time.chrono.BasicChronology.getDateTimeMillis(BasicChronology.java:154)
	at org.joda.time.chrono.CopticChronology.getDateTimeMillis(CopticChronology.java:50)
	at org.joda.time.LocalDate.<init>(LocalDate.java:457)
	at org.joda.time.TestLocalDate_Basics.testToDateTime_LocalTime_Zone(TestLocalDate_Basics.java:836)

testToDateTime_LocalTime_nullZone(org.joda.time.TestLocalDate_Basics)  Time elapsed: 0.001 sec  <<< ERROR!
org.joda.time.IllegalFieldValueException: Value 9 for dayOfMonth must be in the range [1,5]
	at org.joda.time.field.FieldUtils.verifyValueBounds(FieldUtils.java:252)
	at org.joda.time.chrono.BasicChronology.getDateMidnightMillis(BasicChronology.java:613)
	at org.joda.time.chrono.BasicChronology.getDateTimeMillis(BasicChronology.java:159)
	at org.joda.time.chrono.CopticChronology.getDateTimeMillis(CopticChronology.java:50)
	at org.joda.time.chrono.LimitChronology.getDateTimeMillis(LimitChronology.java:177)
	at org.joda.time.chrono.BasicChronology.getDateTimeMillis(BasicChronology.java:154)
	at org.joda.time.chrono.CopticChronology.getDateTimeMillis(CopticChronology.java:50)
	at org.joda.time.LocalDate.<init>(LocalDate.java:457)
	at org.joda.time.TestLocalDate_Basics.testToDateTime_LocalTime_nullZone(TestLocalDate_Basics.java:846)

testToDateTime_nullLocalTime_Zone(org.joda.time.TestLocalDate_Basics)  Time elapsed: 0 sec  <<< ERROR!
org.joda.time.IllegalFieldValueException: Value 9 for dayOfMonth must be in the range [1,5]
	at org.joda.time.field.FieldUtils.verifyValueBounds(FieldUtils.java:252)
	at org.joda.time.chrono.BasicChronology.getDateMidnightMillis(BasicChronology.java:613)
	at org.joda.time.chrono.BasicChronology.getDateTimeMillis(BasicChronology.java:159)
	at org.joda.time.chrono.CopticChronology.getDateTimeMillis(CopticChronology.java:50)
	at org.joda.time.chrono.LimitChronology.getDateTimeMillis(LimitChronology.java:177)
	at org.joda.time.chrono.BasicChronology.getDateTimeMillis(BasicChronology.java:154)
	at org.joda.time.chrono.CopticChronology.getDateTimeMillis(CopticChronology.java:50)
	at org.joda.time.LocalDate.<init>(LocalDate.java:457)
	at org.joda.time.TestLocalDate_Basics.testToDateTime_nullLocalTime_Zone(TestLocalDate_Basics.java:856)

testToDateTime_wrongChronoLocalTime_Zone(org.joda.time.TestLocalDate_Basics)  Time elapsed: 0 sec  <<< ERROR!
org.joda.time.IllegalFieldValueException: Value 9 for dayOfMonth must be in the range [1,5]
	at org.joda.time.field.FieldUtils.verifyValueBounds(FieldUtils.java:252)
	at org.joda.time.chrono.BasicChronology.getDateMidnightMillis(BasicChronology.java:613)
	at org.joda.time.chrono.BasicChronology.getDateTimeMillis(BasicChronology.java:159)
	at org.joda.time.chrono.CopticChronology.getDateTimeMillis(CopticChronology.java:50)
	at org.joda.time.chrono.LimitChronology.getDateTimeMillis(LimitChronology.java:177)
	at org.joda.time.chrono.BasicChronology.getDateTimeMillis(BasicChronology.java:154)
	at org.joda.time.chrono.CopticChronology.getDateTimeMillis(CopticChronology.java:50)
	at org.joda.time.LocalDate.<init>(LocalDate.java:457)
	at org.joda.time.TestLocalDate_Basics.testToDateTime_wrongChronoLocalTime_Zone(TestLocalDate_Basics.java:892)

testToDateMidnight_Zone(org.joda.time.TestLocalDate_Basics)  Time elapsed: 0.001 sec  <<< ERROR!
org.joda.time.IllegalFieldValueException: Value 9 for dayOfMonth must be in the range [1,5]
	at org.joda.time.field.FieldUtils.verifyValueBounds(FieldUtils.java:252)
	at org.joda.time.chrono.BasicChronology.getDateMidnightMillis(BasicChronology.java:613)
	at org.joda.time.chrono.BasicChronology.getDateTimeMillis(BasicChronology.java:159)
	at org.joda.time.chrono.CopticChronology.getDateTimeMillis(CopticChronology.java:50)
	at org.joda.time.chrono.LimitChronology.getDateTimeMillis(LimitChronology.java:177)
	at org.joda.time.chrono.BasicChronology.getDateTimeMillis(BasicChronology.java:154)
	at org.joda.time.chrono.CopticChronology.getDateTimeMillis(CopticChronology.java:50)
	at org.joda.time.LocalDate.<init>(LocalDate.java:457)
	at org.joda.time.TestLocalDate_Basics.testToDateMidnight_Zone(TestLocalDate_Basics.java:914)

testToDateMidnight_nullZone(org.joda.time.TestLocalDate_Basics)  Time elapsed: 0 sec  <<< ERROR!
org.joda.time.IllegalFieldValueException: Value 9 for dayOfMonth must be in the range [1,5]
	at org.joda.time.field.FieldUtils.verifyValueBounds(FieldUtils.java:252)
	at org.joda.time.chrono.BasicChronology.getDateMidnightMillis(BasicChronology.java:613)
	at org.joda.time.chrono.BasicChronology.getDateTimeMillis(BasicChronology.java:159)
	at org.joda.time.chrono.CopticChronology.getDateTimeMillis(CopticChronology.java:50)
	at org.joda.time.chrono.LimitChronology.getDateTimeMillis(LimitChronology.java:177)
	at org.joda.time.chrono.BasicChronology.getDateTimeMillis(BasicChronology.java:154)
	at org.joda.time.chrono.CopticChronology.getDateTimeMillis(CopticChronology.java:50)
	at org.joda.time.LocalDate.<init>(LocalDate.java:457)
	at org.joda.time.TestLocalDate_Basics.testToDateMidnight_nullZone(TestLocalDate_Basics.java:923)

testToInterval_Zone(org.joda.time.TestLocalDate_Basics)  Time elapsed: 0.008 sec  <<< ERROR!
org.joda.time.IllegalFieldValueException: Value 9 for dayOfMonth must be in the range [1,5]
	at org.joda.time.field.FieldUtils.verifyValueBounds(FieldUtils.java:252)
	at org.joda.time.chrono.BasicChronology.getDateMidnightMillis(BasicChronology.java:613)
	at org.joda.time.chrono.BasicChronology.getDateTimeMillis(BasicChronology.java:159)
	at org.joda.time.chrono.CopticChronology.getDateTimeMillis(CopticChronology.java:50)
	at org.joda.time.chrono.LimitChronology.getDateTimeMillis(LimitChronology.java:177)
	at org.joda.time.chrono.BasicChronology.getDateTimeMillis(BasicChronology.java:154)
	at org.joda.time.chrono.CopticChronology.getDateTimeMillis(CopticChronology.java:50)
	at org.joda.time.LocalDate.<init>(LocalDate.java:457)
	at org.joda.time.TestLocalDate_Basics.testToInterval_Zone(TestLocalDate_Basics.java:971)

testToInterval_nullZone(org.joda.time.TestLocalDate_Basics)  Time elapsed: 0 sec  <<< ERROR!
org.joda.time.IllegalFieldValueException: Value 9 for dayOfMonth must be in the range [1,5]
	at org.joda.time.field.FieldUtils.verifyValueBounds(FieldUtils.java:252)
	at org.joda.time.chrono.BasicChronology.getDateMidnightMillis(BasicChronology.java:613)
	at org.joda.time.chrono.BasicChronology.getDateTimeMillis(BasicChronology.java:159)
	at org.joda.time.chrono.CopticChronology.getDateTimeMillis(CopticChronology.java:50)
	at org.joda.time.chrono.LimitChronology.getDateTimeMillis(LimitChronology.java:177)
	at org.joda.time.chrono.BasicChronology.getDateTimeMillis(BasicChronology.java:154)
	at org.joda.time.chrono.CopticChronology.getDateTimeMillis(CopticChronology.java:50)
	at org.joda.time.LocalDate.<init>(LocalDate.java:457)
	at org.joda.time.TestLocalDate_Basics.testToInterval_nullZone(TestLocalDate_Basics.java:992)

testEqualsHashCodeAPI(org.joda.time.TestLocalDate_Basics)  Time elapsed: 0 sec  <<< ERROR!
org.joda.time.IllegalFieldValueException: Value 9 for dayOfMonth must be in the range [1,5]
	at org.joda.time.field.FieldUtils.verifyValueBounds(FieldUtils.java:252)
	at org.joda.time.chrono.BasicChronology.getDateMidnightMillis(BasicChronology.java:613)
	at org.joda.time.chrono.BasicChronology.getDateTimeMillis(BasicChronology.java:159)
	at org.joda.time.chrono.CopticChronology.getDateTimeMillis(CopticChronology.java:50)
	at org.joda.time.chrono.LimitChronology.getDateTimeMillis(LimitChronology.java:177)
	at org.joda.time.chrono.BasicChronology.getDateTimeMillis(BasicChronology.java:154)
	at org.joda.time.chrono.CopticChronology.getDateTimeMillis(CopticChronology.java:50)
	at org.joda.time.LocalDate.<init>(LocalDate.java:457)
	at org.joda.time.TestLocalDate_Basics.testEqualsHashCodeAPI(TestLocalDate_Basics.java:311)

testPropertyEqualsHashCodeStrict(org.joda.time.TestLocalDate_Properties)  Time elapsed: 0 sec  <<< ERROR!
org.joda.time.IllegalFieldValueException: Value 9 for dayOfMonth must be in the range [1,5]
	at org.joda.time.field.FieldUtils.verifyValueBounds(FieldUtils.java:252)
	at org.joda.time.chrono.BasicChronology.getDateMidnightMillis(BasicChronology.java:613)
	at org.joda.time.chrono.BasicChronology.getDateTimeMillis(BasicChronology.java:159)
	at org.joda.time.chrono.CopticChronology.getDateTimeMillis(CopticChronology.java:50)
	at org.joda.time.chrono.LimitChronology.getDateTimeMillis(LimitChronology.java:177)
	at org.joda.time.chrono.BasicChronology.getDateTimeMillis(BasicChronology.java:154)
	at org.joda.time.chrono.CopticChronology.getDateTimeMillis(CopticChronology.java:50)
	at org.joda.time.chrono.AssembledChronology.getDateTimeMillis(AssembledChronology.java:120)
	at org.joda.time.LocalDate.<init>(LocalDate.java:457)
	at org.joda.time.TestLocalDate_Properties.testPropertyEqualsHashCodeStrict(TestLocalDate_Properties.java:538)

testPropertyEquals(org.joda.time.TestLocalDate_Properties)  Time elapsed: 0 sec  <<< ERROR!
org.joda.time.IllegalFieldValueException: Value 8 for dayOfMonth must be in the range [1,5]
	at org.joda.time.field.FieldUtils.verifyValueBounds(FieldUtils.java:252)
	at org.joda.time.chrono.BasicChronology.getDateMidnightMillis(BasicChronology.java:613)
	at org.joda.time.chrono.BasicChronology.getDateTimeMillis(BasicChronology.java:159)
	at org.joda.time.chrono.CopticChronology.getDateTimeMillis(CopticChronology.java:50)
	at org.joda.time.chrono.LimitChronology.getDateTimeMillis(LimitChronology.java:177)
	at org.joda.time.chrono.BasicChronology.getDateTimeMillis(BasicChronology.java:154)
	at org.joda.time.chrono.CopticChronology.getDateTimeMillis(CopticChronology.java:50)
	at org.joda.time.LocalDate.<init>(LocalDate.java:457)
	at org.joda.time.TestLocalDate_Properties.testPropertyEquals(TestLocalDate_Properties.java:494)

testToPeriod(org.joda.time.TestMutableInterval_Basics)  Time elapsed: 0 sec  <<< ERROR!
org.joda.time.IllegalFieldValueException: Value 9 for dayOfMonth must be in the range [1,5]
	at org.joda.time.field.FieldUtils.verifyValueBounds(FieldUtils.java:252)
	at org.joda.time.chrono.BasicChronology.getDateMidnightMillis(BasicChronology.java:613)
	at org.joda.time.chrono.BasicChronology.getDateTimeMillis(BasicChronology.java:177)
	at org.joda.time.chrono.CopticChronology.getDateTimeMillis(CopticChronology.java:50)
	at org.joda.time.chrono.LimitChronology.getDateTimeMillis(LimitChronology.java:187)
	at org.joda.time.chrono.BasicChronology.getDateTimeMillis(BasicChronology.java:168)
	at org.joda.time.chrono.CopticChronology.getDateTimeMillis(CopticChronology.java:50)
	at org.joda.time.chrono.ZonedChronology.getDateTimeMillis(ZonedChronology.java:118)
	at org.joda.time.chrono.BasicChronology.getDateTimeMillis(BasicChronology.java:168)
	at org.joda.time.chrono.CopticChronology.getDateTimeMillis(CopticChronology.java:50)
	at org.joda.time.base.BaseDateTime.<init>(BaseDateTime.java:258)
	at org.joda.time.DateTime.<init>(DateTime.java:532)
	at org.joda.time.TestMutableInterval_Basics.testToPeriod(TestMutableInterval_Basics.java:418)

testToPeriod_PeriodType1(org.joda.time.TestMutableInterval_Basics)  Time elapsed: 0.012 sec  <<< ERROR!
org.joda.time.IllegalFieldValueException: Value 9 for dayOfMonth must be in the range [1,5]
	at org.joda.time.field.FieldUtils.verifyValueBounds(FieldUtils.java:252)
	at org.joda.time.chrono.BasicChronology.getDateMidnightMillis(BasicChronology.java:613)
	at org.joda.time.chrono.BasicChronology.getDateTimeMillis(BasicChronology.java:177)
	at org.joda.time.chrono.CopticChronology.getDateTimeMillis(CopticChronology.java:50)
	at org.joda.time.chrono.LimitChronology.getDateTimeMillis(LimitChronology.java:187)
	at org.joda.time.chrono.BasicChronology.getDateTimeMillis(BasicChronology.java:168)
	at org.joda.time.chrono.CopticChronology.getDateTimeMillis(CopticChronology.java:50)
	at org.joda.time.chrono.ZonedChronology.getDateTimeMillis(ZonedChronology.java:118)
	at org.joda.time.chrono.BasicChronology.getDateTimeMillis(BasicChronology.java:168)
	at org.joda.time.chrono.CopticChronology.getDateTimeMillis(CopticChronology.java:50)
	at org.joda.time.base.BaseDateTime.<init>(BaseDateTime.java:258)
	at org.joda.time.DateTime.<init>(DateTime.java:532)
	at org.joda.time.TestMutableInterval_Basics.testToPeriod_PeriodType1(TestMutableInterval_Basics.java:429)

testConstructor_long_long_Chronology1(org.joda.time.TestPeriod_Constructors)  Time elapsed: 0.001 sec  <<< ERROR!
org.joda.time.IllegalFieldValueException: Value 9 for dayOfMonth must be in the range [1,5]
	at org.joda.time.field.FieldUtils.verifyValueBounds(FieldUtils.java:252)
	at org.joda.time.chrono.BasicChronology.getDateMidnightMillis(BasicChronology.java:613)
	at org.joda.time.chrono.BasicChronology.getDateTimeMillis(BasicChronology.java:177)
	at org.joda.time.chrono.CopticChronology.getDateTimeMillis(CopticChronology.java:50)
	at org.joda.time.chrono.LimitChronology.getDateTimeMillis(LimitChronology.java:187)
	at org.joda.time.chrono.BasicChronology.getDateTimeMillis(BasicChronology.java:168)
	at org.joda.time.chrono.CopticChronology.getDateTimeMillis(CopticChronology.java:50)
	at org.joda.time.chrono.ZonedChronology.getDateTimeMillis(ZonedChronology.java:118)
	at org.joda.time.chrono.BasicChronology.getDateTimeMillis(BasicChronology.java:168)
	at org.joda.time.chrono.CopticChronology.getDateTimeMillis(CopticChronology.java:50)
	at org.joda.time.base.BaseDateTime.<init>(BaseDateTime.java:258)
	at org.joda.time.DateTime.<init>(DateTime.java:532)
	at org.joda.time.TestPeriod_Constructors.testConstructor_long_long_Chronology1(TestPeriod_Constructors.java:556)

testConstructor_long_long_PeriodType_Chronology1(org.joda.time.TestPeriod_Constructors)  Time elapsed: 0.001 sec  <<< ERROR!
org.joda.time.IllegalFieldValueException: Value 9 for dayOfMonth must be in the range [1,5]
	at org.joda.time.field.FieldUtils.verifyValueBounds(FieldUtils.java:252)
	at org.joda.time.chrono.BasicChronology.getDateMidnightMillis(BasicChronology.java:613)
	at org.joda.time.chrono.BasicChronology.getDateTimeMillis(BasicChronology.java:177)
	at org.joda.time.chrono.CopticChronology.getDateTimeMillis(CopticChronology.java:50)
	at org.joda.time.chrono.LimitChronology.getDateTimeMillis(LimitChronology.java:187)
	at org.joda.time.chrono.BasicChronology.getDateTimeMillis(BasicChronology.java:168)
	at org.joda.time.chrono.CopticChronology.getDateTimeMillis(CopticChronology.java:50)
	at org.joda.time.chrono.ZonedChronology.getDateTimeMillis(ZonedChronology.java:118)
	at org.joda.time.chrono.BasicChronology.getDateTimeMillis(BasicChronology.java:168)
	at org.joda.time.chrono.CopticChronology.getDateTimeMillis(CopticChronology.java:50)
	at org.joda.time.base.BaseDateTime.<init>(BaseDateTime.java:258)
	at org.joda.time.DateTime.<init>(DateTime.java:532)
	at org.joda.time.TestPeriod_Constructors.testConstructor_long_long_PeriodType_Chronology1(TestPeriod_Constructors.java:587)

testConstructor_long_long_Chronology1(org.joda.time.TestMutablePeriod_Constructors)  Time elapsed: 0 sec  <<< ERROR!
org.joda.time.IllegalFieldValueException: Value 9 for dayOfMonth must be in the range [1,5]
	at org.joda.time.field.FieldUtils.verifyValueBounds(FieldUtils.java:252)
	at org.joda.time.chrono.BasicChronology.getDateMidnightMillis(BasicChronology.java:613)
	at org.joda.time.chrono.BasicChronology.getDateTimeMillis(BasicChronology.java:177)
	at org.joda.time.chrono.CopticChronology.getDateTimeMillis(CopticChronology.java:50)
	at org.joda.time.chrono.LimitChronology.getDateTimeMillis(LimitChronology.java:187)
	at org.joda.time.chrono.BasicChronology.getDateTimeMillis(BasicChronology.java:168)
	at org.joda.time.chrono.CopticChronology.getDateTimeMillis(CopticChronology.java:50)
	at org.joda.time.chrono.ZonedChronology.getDateTimeMillis(ZonedChronology.java:118)
	at org.joda.time.chrono.BasicChronology.getDateTimeMillis(BasicChronology.java:168)
	at org.joda.time.chrono.CopticChronology.getDateTimeMillis(CopticChronology.java:50)
	at org.joda.time.base.BaseDateTime.<init>(BaseDateTime.java:258)
	at org.joda.time.DateTime.<init>(DateTime.java:532)
	at org.joda.time.TestMutablePeriod_Constructors.testConstructor_long_long_Chronology1(TestMutablePeriod_Constructors.java:546)

testConstructor_long_long_PeriodType_Chronology1(org.joda.time.TestMutablePeriod_Constructors)  Time elapsed: 0 sec  <<< ERROR!
org.joda.time.IllegalFieldValueException: Value 9 for dayOfMonth must be in the range [1,5]
	at org.joda.time.field.FieldUtils.verifyValueBounds(FieldUtils.java:252)
	at org.joda.time.chrono.BasicChronology.getDateMidnightMillis(BasicChronology.java:613)
	at org.joda.time.chrono.BasicChronology.getDateTimeMillis(BasicChronology.java:177)
	at org.joda.time.chrono.CopticChronology.getDateTimeMillis(CopticChronology.java:50)
	at org.joda.time.chrono.LimitChronology.getDateTimeMillis(LimitChronology.java:187)
	at org.joda.time.chrono.BasicChronology.getDateTimeMillis(BasicChronology.java:168)
	at org.joda.time.chrono.CopticChronology.getDateTimeMillis(CopticChronology.java:50)
	at org.joda.time.chrono.ZonedChronology.getDateTimeMillis(ZonedChronology.java:118)
	at org.joda.time.chrono.BasicChronology.getDateTimeMillis(BasicChronology.java:168)
	at org.joda.time.chrono.CopticChronology.getDateTimeMillis(CopticChronology.java:50)
	at org.joda.time.base.BaseDateTime.<init>(BaseDateTime.java:258)
	at org.joda.time.DateTime.<init>(DateTime.java:532)
	at org.joda.time.TestMutablePeriod_Constructors.testConstructor_long_long_PeriodType_Chronology1(TestMutablePeriod_Constructors.java:577)

testToDateMidnight(org.joda.time.TestYearMonthDay_Basics)  Time elapsed: 0 sec  <<< ERROR!
org.joda.time.IllegalFieldValueException: Value 9 for dayOfMonth must be in the range [1,5]
	at org.joda.time.field.FieldUtils.verifyValueBounds(FieldUtils.java:252)
	at org.joda.time.chrono.BasicChronology.getDateMidnightMillis(BasicChronology.java:613)
	at org.joda.time.chrono.BasicChronology.getDateTimeMillis(BasicChronology.java:177)
	at org.joda.time.chrono.CopticChronology.getDateTimeMillis(CopticChronology.java:50)
	at org.joda.time.chrono.LimitChronology.getDateTimeMillis(LimitChronology.java:187)
	at org.joda.time.chrono.BasicChronology.getDateTimeMillis(BasicChronology.java:168)
	at org.joda.time.chrono.CopticChronology.getDateTimeMillis(CopticChronology.java:50)
	at org.joda.time.chrono.ZonedChronology.getDateTimeMillis(ZonedChronology.java:118)
	at org.joda.time.chrono.BasicChronology.getDateTimeMillis(BasicChronology.java:168)
	at org.joda.time.chrono.CopticChronology.getDateTimeMillis(CopticChronology.java:50)
	at org.joda.time.base.BaseDateTime.<init>(BaseDateTime.java:258)
	at org.joda.time.DateMidnight.<init>(DateMidnight.java:350)
	at org.joda.time.YearMonthDay.toDateMidnight(YearMonthDay.java:736)
	at org.joda.time.YearMonthDay.toDateMidnight(YearMonthDay.java:725)
	at org.joda.time.TestYearMonthDay_Basics.testToDateMidnight(TestYearMonthDay_Basics.java:661)

testToLocalDate(org.joda.time.TestYearMonthDay_Basics)  Time elapsed: 0.001 sec  <<< ERROR!
org.joda.time.IllegalFieldValueException: Value 9 for dayOfMonth must be in the range [1,5]
	at org.joda.time.field.FieldUtils.verifyValueBounds(FieldUtils.java:252)
	at org.joda.time.chrono.BasicChronology.getDateMidnightMillis(BasicChronology.java:613)
	at org.joda.time.chrono.BasicChronology.getDateTimeMillis(BasicChronology.java:159)
	at org.joda.time.chrono.CopticChronology.getDateTimeMillis(CopticChronology.java:50)
	at org.joda.time.chrono.LimitChronology.getDateTimeMillis(LimitChronology.java:177)
	at org.joda.time.chrono.BasicChronology.getDateTimeMillis(BasicChronology.java:154)
	at org.joda.time.chrono.CopticChronology.getDateTimeMillis(CopticChronology.java:50)
	at org.joda.time.LocalDate.<init>(LocalDate.java:457)
	at org.joda.time.YearMonthDay.toLocalDate(YearMonthDay.java:659)
	at org.joda.time.TestYearMonthDay_Basics.testToLocalDate(TestYearMonthDay_Basics.java:529)

testToInterval(org.joda.time.TestYearMonthDay_Basics)  Time elapsed: 0 sec  <<< ERROR!
org.joda.time.IllegalFieldValueException: Value 9 for dayOfMonth must be in the range [1,5]
	at org.joda.time.field.FieldUtils.verifyValueBounds(FieldUtils.java:252)
	at org.joda.time.chrono.BasicChronology.getDateMidnightMillis(BasicChronology.java:613)
	at org.joda.time.chrono.BasicChronology.getDateTimeMillis(BasicChronology.java:177)
	at org.joda.time.chrono.CopticChronology.getDateTimeMillis(CopticChronology.java:50)
	at org.joda.time.chrono.LimitChronology.getDateTimeMillis(LimitChronology.java:187)
	at org.joda.time.chrono.BasicChronology.getDateTimeMillis(BasicChronology.java:168)
	at org.joda.time.chrono.CopticChronology.getDateTimeMillis(CopticChronology.java:50)
	at org.joda.time.chrono.ZonedChronology.getDateTimeMillis(ZonedChronology.java:118)
	at org.joda.time.chrono.BasicChronology.getDateTimeMillis(BasicChronology.java:168)
	at org.joda.time.chrono.CopticChronology.getDateTimeMillis(CopticChronology.java:50)
	at org.joda.time.base.BaseDateTime.<init>(BaseDateTime.java:258)
	at org.joda.time.DateMidnight.<init>(DateMidnight.java:350)
	at org.joda.time.YearMonthDay.toDateMidnight(YearMonthDay.java:736)
	at org.joda.time.YearMonthDay.toInterval(YearMonthDay.java:798)
	at org.joda.time.YearMonthDay.toInterval(YearMonthDay.java:787)
	at org.joda.time.TestYearMonthDay_Basics.testToInterval(TestYearMonthDay_Basics.java:714)

testToDateTimeAtMidnight(org.joda.time.TestYearMonthDay_Basics)  Time elapsed: 0 sec  <<< ERROR!
org.joda.time.IllegalFieldValueException: Value 9 for dayOfMonth must be in the range [1,5]
	at org.joda.time.field.FieldUtils.verifyValueBounds(FieldUtils.java:252)
	at org.joda.time.chrono.BasicChronology.getDateMidnightMillis(BasicChronology.java:613)
	at org.joda.time.chrono.BasicChronology.getDateTimeMillis(BasicChronology.java:177)
	at org.joda.time.chrono.CopticChronology.getDateTimeMillis(CopticChronology.java:50)
	at org.joda.time.chrono.LimitChronology.getDateTimeMillis(LimitChronology.java:187)
	at org.joda.time.chrono.BasicChronology.getDateTimeMillis(BasicChronology.java:168)
	at org.joda.time.chrono.CopticChronology.getDateTimeMillis(CopticChronology.java:50)
	at org.joda.time.chrono.ZonedChronology.getDateTimeMillis(ZonedChronology.java:118)
	at org.joda.time.chrono.BasicChronology.getDateTimeMillis(BasicChronology.java:168)
	at org.joda.time.chrono.CopticChronology.getDateTimeMillis(CopticChronology.java:50)
	at org.joda.time.base.BaseDateTime.<init>(BaseDateTime.java:258)
	at org.joda.time.DateTime.<init>(DateTime.java:532)
	at org.joda.time.YearMonthDay.toDateTimeAtMidnight(YearMonthDay.java:685)
	at org.joda.time.YearMonthDay.toDateTimeAtMidnight(YearMonthDay.java:670)
	at org.joda.time.TestYearMonthDay_Basics.testToDateTimeAtMidnight(TestYearMonthDay_Basics.java:537)

testToDateTimeAtMidnight_Zone(org.joda.time.TestYearMonthDay_Basics)  Time elapsed: 0 sec  <<< ERROR!
org.joda.time.IllegalFieldValueException: Value 9 for dayOfMonth must be in the range [1,5]
	at org.joda.time.field.FieldUtils.verifyValueBounds(FieldUtils.java:252)
	at org.joda.time.chrono.BasicChronology.getDateMidnightMillis(BasicChronology.java:613)
	at org.joda.time.chrono.BasicChronology.getDateTimeMillis(BasicChronology.java:177)
	at org.joda.time.chrono.CopticChronology.getDateTimeMillis(CopticChronology.java:50)
	at org.joda.time.chrono.LimitChronology.getDateTimeMillis(LimitChronology.java:187)
	at org.joda.time.chrono.BasicChronology.getDateTimeMillis(BasicChronology.java:168)
	at org.joda.time.chrono.CopticChronology.getDateTimeMillis(CopticChronology.java:50)
	at org.joda.time.chrono.ZonedChronology.getDateTimeMillis(ZonedChronology.java:118)
	at org.joda.time.chrono.BasicChronology.getDateTimeMillis(BasicChronology.java:168)
	at org.joda.time.chrono.CopticChronology.getDateTimeMillis(CopticChronology.java:50)
	at org.joda.time.base.BaseDateTime.<init>(BaseDateTime.java:258)
	at org.joda.time.DateTime.<init>(DateTime.java:532)
	at org.joda.time.YearMonthDay.toDateTimeAtMidnight(YearMonthDay.java:685)
	at org.joda.time.TestYearMonthDay_Basics.testToDateTimeAtMidnight_Zone(TestYearMonthDay_Basics.java:546)

testToDateTimeAtMidnight_nullZone(org.joda.time.TestYearMonthDay_Basics)  Time elapsed: 0.001 sec  <<< ERROR!
org.joda.time.IllegalFieldValueException: Value 9 for dayOfMonth must be in the range [1,5]
	at org.joda.time.field.FieldUtils.verifyValueBounds(FieldUtils.java:252)
	at org.joda.time.chrono.BasicChronology.getDateMidnightMillis(BasicChronology.java:613)
	at org.joda.time.chrono.BasicChronology.getDateTimeMillis(BasicChronology.java:177)
	at org.joda.time.chrono.CopticChronology.getDateTimeMillis(CopticChronology.java:50)
	at org.joda.time.chrono.LimitChronology.getDateTimeMillis(LimitChronology.java:187)
	at org.joda.time.chrono.BasicChronology.getDateTimeMillis(BasicChronology.java:168)
	at org.joda.time.chrono.CopticChronology.getDateTimeMillis(CopticChronology.java:50)
	at org.joda.time.chrono.ZonedChronology.getDateTimeMillis(ZonedChronology.java:118)
	at org.joda.time.chrono.BasicChronology.getDateTimeMillis(BasicChronology.java:168)
	at org.joda.time.chrono.CopticChronology.getDateTimeMillis(CopticChronology.java:50)
	at org.joda.time.base.BaseDateTime.<init>(BaseDateTime.java:258)
	at org.joda.time.DateTime.<init>(DateTime.java:532)
	at org.joda.time.YearMonthDay.toDateTimeAtMidnight(YearMonthDay.java:685)
	at org.joda.time.TestYearMonthDay_Basics.testToDateTimeAtMidnight_nullZone(TestYearMonthDay_Basics.java:554)

testToDateTimeAtCurrentTime(org.joda.time.TestYearMonthDay_Basics)  Time elapsed: 0 sec  <<< ERROR!
org.joda.time.IllegalFieldValueException: Value 9 for dayOfMonth must be in the range [1,5]
	at org.joda.time.field.FieldUtils.verifyValueBounds(FieldUtils.java:234)
	at org.joda.time.field.PreciseDurationDateTimeField.set(PreciseDurationDateTimeField.java:79)
	at org.joda.time.chrono.LimitChronology$LimitDateTimeField.set(LimitChronology.java:511)
	at org.joda.time.chrono.ZonedChronology$ZonedDateTimeField.set(ZonedChronology.java:482)
	at org.joda.time.chrono.BaseChronology.set(BaseChronology.java:240)
	at org.joda.time.YearMonthDay.toDateTimeAtCurrentTime(YearMonthDay.java:714)
	at org.joda.time.YearMonthDay.toDateTimeAtCurrentTime(YearMonthDay.java:697)
	at org.joda.time.TestYearMonthDay_Basics.testToDateTimeAtCurrentTime(TestYearMonthDay_Basics.java:565)

testToDateTimeAtCurrentTime_Zone(org.joda.time.TestYearMonthDay_Basics)  Time elapsed: 0.001 sec  <<< ERROR!
org.joda.time.IllegalFieldValueException: Value 9 for dayOfMonth must be in the range [1,5]
	at org.joda.time.field.FieldUtils.verifyValueBounds(FieldUtils.java:234)
	at org.joda.time.field.PreciseDurationDateTimeField.set(PreciseDurationDateTimeField.java:79)
	at org.joda.time.chrono.LimitChronology$LimitDateTimeField.set(LimitChronology.java:511)
	at org.joda.time.chrono.ZonedChronology$ZonedDateTimeField.set(ZonedChronology.java:482)
	at org.joda.time.chrono.BaseChronology.set(BaseChronology.java:240)
	at org.joda.time.YearMonthDay.toDateTimeAtCurrentTime(YearMonthDay.java:714)
	at org.joda.time.TestYearMonthDay_Basics.testToDateTimeAtCurrentTime_Zone(TestYearMonthDay_Basics.java:580)

testToDateTimeAtCurrentTime_nullZone(org.joda.time.TestYearMonthDay_Basics)  Time elapsed: 0.001 sec  <<< ERROR!
org.joda.time.IllegalFieldValueException: Value 9 for dayOfMonth must be in the range [1,5]
	at org.joda.time.field.FieldUtils.verifyValueBounds(FieldUtils.java:234)
	at org.joda.time.field.PreciseDurationDateTimeField.set(PreciseDurationDateTimeField.java:79)
	at org.joda.time.chrono.LimitChronology$LimitDateTimeField.set(LimitChronology.java:511)
	at org.joda.time.chrono.ZonedChronology$ZonedDateTimeField.set(ZonedChronology.java:482)
	at org.joda.time.chrono.BaseChronology.set(BaseChronology.java:240)
	at org.joda.time.YearMonthDay.toDateTimeAtCurrentTime(YearMonthDay.java:714)
	at org.joda.time.TestYearMonthDay_Basics.testToDateTimeAtCurrentTime_nullZone(TestYearMonthDay_Basics.java:594)

testToDateTime_TOD(org.joda.time.TestYearMonthDay_Basics)  Time elapsed: 0.001 sec  <<< ERROR!
org.joda.time.IllegalFieldValueException: Value 9 for dayOfMonth must be in the range [1,5]
	at org.joda.time.field.FieldUtils.verifyValueBounds(FieldUtils.java:234)
	at org.joda.time.field.PreciseDurationDateTimeField.set(PreciseDurationDateTimeField.java:79)
	at org.joda.time.chrono.LimitChronology$LimitDateTimeField.set(LimitChronology.java:511)
	at org.joda.time.chrono.ZonedChronology$ZonedDateTimeField.set(ZonedChronology.java:482)
	at org.joda.time.chrono.BaseChronology.set(BaseChronology.java:240)
	at org.joda.time.YearMonthDay.toDateTime(YearMonthDay.java:772)
	at org.joda.time.YearMonthDay.toDateTime(YearMonthDay.java:753)
	at org.joda.time.TestYearMonthDay_Basics.testToDateTime_TOD(TestYearMonthDay_Basics.java:608)

testToDateTime_nullTOD(org.joda.time.TestYearMonthDay_Basics)  Time elapsed: 0.001 sec  <<< ERROR!
org.joda.time.IllegalFieldValueException: Value 8 for dayOfMonth must be in the range [1,5]
	at org.joda.time.field.FieldUtils.verifyValueBounds(FieldUtils.java:252)
	at org.joda.time.chrono.BasicChronology.getDateMidnightMillis(BasicChronology.java:613)
	at org.joda.time.chrono.BasicChronology.getDateTimeMillis(BasicChronology.java:177)
	at org.joda.time.chrono.CopticChronology.getDateTimeMillis(CopticChronology.java:50)
	at org.joda.time.chrono.LimitChronology.getDateTimeMillis(LimitChronology.java:187)
	at org.joda.time.chrono.BasicChronology.getDateTimeMillis(BasicChronology.java:168)
	at org.joda.time.chrono.CopticChronology.getDateTimeMillis(CopticChronology.java:50)
	at org.joda.time.chrono.ZonedChronology.getDateTimeMillis(ZonedChronology.java:118)
	at org.joda.time.chrono.BasicChronology.getDateTimeMillis(BasicChronology.java:168)
	at org.joda.time.chrono.CopticChronology.getDateTimeMillis(CopticChronology.java:50)
	at org.joda.time.base.BaseDateTime.<init>(BaseDateTime.java:258)
	at org.joda.time.DateTime.<init>(DateTime.java:532)
	at org.joda.time.TestYearMonthDay_Basics.testToDateTime_nullTOD(TestYearMonthDay_Basics.java:616)

testToDateTime_TOD_Zone(org.joda.time.TestYearMonthDay_Basics)  Time elapsed: 0 sec  <<< ERROR!
org.joda.time.IllegalFieldValueException: Value 9 for dayOfMonth must be in the range [1,5]
	at org.joda.time.field.FieldUtils.verifyValueBounds(FieldUtils.java:234)
	at org.joda.time.field.PreciseDurationDateTimeField.set(PreciseDurationDateTimeField.java:79)
	at org.joda.time.chrono.LimitChronology$LimitDateTimeField.set(LimitChronology.java:511)
	at org.joda.time.chrono.ZonedChronology$ZonedDateTimeField.set(ZonedChronology.java:482)
	at org.joda.time.chrono.BaseChronology.set(BaseChronology.java:240)
	at org.joda.time.YearMonthDay.toDateTime(YearMonthDay.java:772)
	at org.joda.time.TestYearMonthDay_Basics.testToDateTime_TOD_Zone(TestYearMonthDay_Basics.java:630)

testToDateTime_TOD_nullZone(org.joda.time.TestYearMonthDay_Basics)  Time elapsed: 0.001 sec  <<< ERROR!
org.joda.time.IllegalFieldValueException: Value 9 for dayOfMonth must be in the range [1,5]
	at org.joda.time.field.FieldUtils.verifyValueBounds(FieldUtils.java:234)
	at org.joda.time.field.PreciseDurationDateTimeField.set(PreciseDurationDateTimeField.java:79)
	at org.joda.time.chrono.LimitChronology$LimitDateTimeField.set(LimitChronology.java:511)
	at org.joda.time.chrono.ZonedChronology$ZonedDateTimeField.set(ZonedChronology.java:482)
	at org.joda.time.chrono.BaseChronology.set(BaseChronology.java:240)
	at org.joda.time.YearMonthDay.toDateTime(YearMonthDay.java:772)
	at org.joda.time.TestYearMonthDay_Basics.testToDateTime_TOD_nullZone(TestYearMonthDay_Basics.java:640)

testToDateTime_nullTOD_Zone(org.joda.time.TestYearMonthDay_Basics)  Time elapsed: 0 sec  <<< ERROR!
org.joda.time.IllegalFieldValueException: Value 8 for dayOfMonth must be in the range [1,5]
	at org.joda.time.field.FieldUtils.verifyValueBounds(FieldUtils.java:252)
	at org.joda.time.chrono.BasicChronology.getDateMidnightMillis(BasicChronology.java:613)
	at org.joda.time.chrono.BasicChronology.getDateTimeMillis(BasicChronology.java:177)
	at org.joda.time.chrono.CopticChronology.getDateTimeMillis(CopticChronology.java:50)
	at org.joda.time.chrono.LimitChronology.getDateTimeMillis(LimitChronology.java:187)
	at org.joda.time.chrono.BasicChronology.getDateTimeMillis(BasicChronology.java:168)
	at org.joda.time.chrono.CopticChronology.getDateTimeMillis(CopticChronology.java:50)
	at org.joda.time.chrono.ZonedChronology.getDateTimeMillis(ZonedChronology.java:118)
	at org.joda.time.chrono.BasicChronology.getDateTimeMillis(BasicChronology.java:168)
	at org.joda.time.chrono.CopticChronology.getDateTimeMillis(CopticChronology.java:50)
	at org.joda.time.base.BaseDateTime.<init>(BaseDateTime.java:258)
	at org.joda.time.DateTime.<init>(DateTime.java:532)
	at org.joda.time.TestYearMonthDay_Basics.testToDateTime_nullTOD_Zone(TestYearMonthDay_Basics.java:648)

testToDateMidnight_Zone(org.joda.time.TestYearMonthDay_Basics)  Time elapsed: 0 sec  <<< ERROR!
org.joda.time.IllegalFieldValueException: Value 9 for dayOfMonth must be in the range [1,5]
	at org.joda.time.field.FieldUtils.verifyValueBounds(FieldUtils.java:252)
	at org.joda.time.chrono.BasicChronology.getDateMidnightMillis(BasicChronology.java:613)
	at org.joda.time.chrono.BasicChronology.getDateTimeMillis(BasicChronology.java:177)
	at org.joda.time.chrono.CopticChronology.getDateTimeMillis(CopticChronology.java:50)
	at org.joda.time.chrono.LimitChronology.getDateTimeMillis(LimitChronology.java:187)
	at org.joda.time.chrono.BasicChronology.getDateTimeMillis(BasicChronology.java:168)
	at org.joda.time.chrono.CopticChronology.getDateTimeMillis(CopticChronology.java:50)
	at org.joda.time.chrono.ZonedChronology.getDateTimeMillis(ZonedChronology.java:118)
	at org.joda.time.chrono.BasicChronology.getDateTimeMillis(BasicChronology.java:168)
	at org.joda.time.chrono.CopticChronology.getDateTimeMillis(CopticChronology.java:50)
	at org.joda.time.base.BaseDateTime.<init>(BaseDateTime.java:258)
	at org.joda.time.DateMidnight.<init>(DateMidnight.java:350)
	at org.joda.time.YearMonthDay.toDateMidnight(YearMonthDay.java:736)
	at org.joda.time.TestYearMonthDay_Basics.testToDateMidnight_Zone(TestYearMonthDay_Basics.java:670)

testToDateMidnight_nullZone(org.joda.time.TestYearMonthDay_Basics)  Time elapsed: 0.001 sec  <<< ERROR!
org.joda.time.IllegalFieldValueException: Value 9 for dayOfMonth must be in the range [1,5]
	at org.joda.time.field.FieldUtils.verifyValueBounds(FieldUtils.java:252)
	at org.joda.time.chrono.BasicChronology.getDateMidnightMillis(BasicChronology.java:613)
	at org.joda.time.chrono.BasicChronology.getDateTimeMillis(BasicChronology.java:177)
	at org.joda.time.chrono.CopticChronology.getDateTimeMillis(CopticChronology.java:50)
	at org.joda.time.chrono.LimitChronology.getDateTimeMillis(LimitChronology.java:187)
	at org.joda.time.chrono.BasicChronology.getDateTimeMillis(BasicChronology.java:168)
	at org.joda.time.chrono.CopticChronology.getDateTimeMillis(CopticChronology.java:50)
	at org.joda.time.chrono.ZonedChronology.getDateTimeMillis(ZonedChronology.java:118)
	at org.joda.time.chrono.BasicChronology.getDateTimeMillis(BasicChronology.java:168)
	at org.joda.time.chrono.CopticChronology.getDateTimeMillis(CopticChronology.java:50)
	at org.joda.time.base.BaseDateTime.<init>(BaseDateTime.java:258)
	at org.joda.time.DateMidnight.<init>(DateMidnight.java:350)
	at org.joda.time.YearMonthDay.toDateMidnight(YearMonthDay.java:736)
	at org.joda.time.TestYearMonthDay_Basics.testToDateMidnight_nullZone(TestYearMonthDay_Basics.java:678)

testToInterval_Zone(org.joda.time.TestYearMonthDay_Basics)  Time elapsed: 0 sec  <<< ERROR!
org.joda.time.IllegalFieldValueException: Value 9 for dayOfMonth must be in the range [1,5]
	at org.joda.time.field.FieldUtils.verifyValueBounds(FieldUtils.java:252)
	at org.joda.time.chrono.BasicChronology.getDateMidnightMillis(BasicChronology.java:613)
	at org.joda.time.chrono.BasicChronology.getDateTimeMillis(BasicChronology.java:177)
	at org.joda.time.chrono.CopticChronology.getDateTimeMillis(CopticChronology.java:50)
	at org.joda.time.chrono.LimitChronology.getDateTimeMillis(LimitChronology.java:187)
	at org.joda.time.chrono.BasicChronology.getDateTimeMillis(BasicChronology.java:168)
	at org.joda.time.chrono.CopticChronology.getDateTimeMillis(CopticChronology.java:50)
	at org.joda.time.chrono.ZonedChronology.getDateTimeMillis(ZonedChronology.java:118)
	at org.joda.time.chrono.BasicChronology.getDateTimeMillis(BasicChronology.java:168)
	at org.joda.time.chrono.CopticChronology.getDateTimeMillis(CopticChronology.java:50)
	at org.joda.time.base.BaseDateTime.<init>(BaseDateTime.java:258)
	at org.joda.time.DateMidnight.<init>(DateMidnight.java:350)
	at org.joda.time.YearMonthDay.toDateMidnight(YearMonthDay.java:736)
	at org.joda.time.YearMonthDay.toInterval(YearMonthDay.java:798)
	at org.joda.time.TestYearMonthDay_Basics.testToInterval_Zone(TestYearMonthDay_Basics.java:725)

testToInterval_nullZone(org.joda.time.TestYearMonthDay_Basics)  Time elapsed: 0.001 sec  <<< ERROR!
org.joda.time.IllegalFieldValueException: Value 9 for dayOfMonth must be in the range [1,5]
	at org.joda.time.field.FieldUtils.verifyValueBounds(FieldUtils.java:252)
	at org.joda.time.chrono.BasicChronology.getDateMidnightMillis(BasicChronology.java:613)
	at org.joda.time.chrono.BasicChronology.getDateTimeMillis(BasicChronology.java:177)
	at org.joda.time.chrono.CopticChronology.getDateTimeMillis(CopticChronology.java:50)
	at org.joda.time.chrono.LimitChronology.getDateTimeMillis(LimitChronology.java:187)
	at org.joda.time.chrono.BasicChronology.getDateTimeMillis(BasicChronology.java:168)
	at org.joda.time.chrono.CopticChronology.getDateTimeMillis(CopticChronology.java:50)
	at org.joda.time.chrono.ZonedChronology.getDateTimeMillis(ZonedChronology.java:118)
	at org.joda.time.chrono.BasicChronology.getDateTimeMillis(BasicChronology.java:168)
	at org.joda.time.chrono.CopticChronology.getDateTimeMillis(CopticChronology.java:50)
	at org.joda.time.base.BaseDateTime.<init>(BaseDateTime.java:258)
	at org.joda.time.DateMidnight.<init>(DateMidnight.java:350)
	at org.joda.time.YearMonthDay.toDateMidnight(YearMonthDay.java:736)
	at org.joda.time.YearMonthDay.toInterval(YearMonthDay.java:798)
	at org.joda.time.TestYearMonthDay_Basics.testToInterval_nullZone(TestYearMonthDay_Basics.java:735)

testToLocalDate(org.joda.time.TestYearMonth_Basics)  Time elapsed: 0 sec  <<< ERROR!
org.joda.time.IllegalFieldValueException: Value 9 for dayOfMonth must be in the range [1,5]
	at org.joda.time.field.FieldUtils.verifyValueBounds(FieldUtils.java:252)
	at org.joda.time.chrono.BasicChronology.getDateMidnightMillis(BasicChronology.java:613)
	at org.joda.time.chrono.BasicChronology.getDateTimeMillis(BasicChronology.java:159)
	at org.joda.time.chrono.CopticChronology.getDateTimeMillis(CopticChronology.java:50)
	at org.joda.time.chrono.LimitChronology.getDateTimeMillis(LimitChronology.java:177)
	at org.joda.time.chrono.BasicChronology.getDateTimeMillis(BasicChronology.java:154)
	at org.joda.time.chrono.CopticChronology.getDateTimeMillis(CopticChronology.java:50)
	at org.joda.time.LocalDate.<init>(LocalDate.java:457)
	at org.joda.time.YearMonth.toLocalDate(YearMonth.java:669)
	at org.joda.time.TestYearMonth_Basics.testToLocalDate(TestYearMonth_Basics.java:503)

testToLocalDate(org.joda.time.TestMonthDay_Basics)  Time elapsed: 0 sec  <<< ERROR!
org.joda.time.IllegalFieldValueException: Value 6 for dayOfMonth must be in the range [1,5]
	at org.joda.time.field.FieldUtils.verifyValueBounds(FieldUtils.java:252)
	at org.joda.time.chrono.BasicChronology.getDateMidnightMillis(BasicChronology.java:613)
	at org.joda.time.chrono.BasicChronology.getDateTimeMillis(BasicChronology.java:159)
	at org.joda.time.chrono.CopticChronology.getDateTimeMillis(CopticChronology.java:50)
	at org.joda.time.chrono.LimitChronology.getDateTimeMillis(LimitChronology.java:177)
	at org.joda.time.chrono.BasicChronology.getDateTimeMillis(BasicChronology.java:154)
	at org.joda.time.chrono.CopticChronology.getDateTimeMillis(CopticChronology.java:50)
	at org.joda.time.LocalDate.<init>(LocalDate.java:457)
	at org.joda.time.MonthDay.toLocalDate(MonthDay.java:686)
	at org.joda.time.TestMonthDay_Basics.testToLocalDate(TestMonthDay_Basics.java:701)

testCalendar(org.joda.time.chrono.TestCopticChronology)  Time elapsed: 0.001 sec  <<< FAILURE!
junit.framework.AssertionFailedError: expected:<30> but was:<5>
	at junit.framework.Assert.fail(Assert.java:47)
	at junit.framework.Assert.failNotEquals(Assert.java:280)
	at junit.framework.Assert.assertEquals(Assert.java:64)
	at junit.framework.Assert.assertEquals(Assert.java:198)
	at junit.framework.Assert.assertEquals(Assert.java:204)
	at org.joda.time.chrono.TestCopticChronology.testCalendar(TestCopticChronology.java:373)

testSampleDate(org.joda.time.chrono.TestCopticChronology)  Time elapsed: 0 sec  <<< FAILURE!
junit.framework.AssertionFailedError: expected:<30> but was:<5>
	at junit.framework.Assert.fail(Assert.java:47)
	at junit.framework.Assert.failNotEquals(Assert.java:280)
	at junit.framework.Assert.assertEquals(Assert.java:64)
	at junit.framework.Assert.assertEquals(Assert.java:198)
	at junit.framework.Assert.assertEquals(Assert.java:204)
	at org.joda.time.chrono.TestCopticChronology.testSampleDate(TestCopticChronology.java:433)

testCalendar(org.joda.time.chrono.TestEthiopicChronology)  Time elapsed: 0.001 sec  <<< FAILURE!
junit.framework.AssertionFailedError: expected:<30> but was:<5>
	at junit.framework.Assert.fail(Assert.java:47)
	at junit.framework.Assert.failNotEquals(Assert.java:280)
	at junit.framework.Assert.assertEquals(Assert.java:64)
	at junit.framework.Assert.assertEquals(Assert.java:198)
	at junit.framework.Assert.assertEquals(Assert.java:204)
	at org.joda.time.chrono.TestEthiopicChronology.testCalendar(TestEthiopicChronology.java:373)

testSampleDate(org.joda.time.chrono.TestEthiopicChronology)  Time elapsed: 0.001 sec  <<< FAILURE!
junit.framework.AssertionFailedError: expected:<30> but was:<5>
	at junit.framework.Assert.fail(Assert.java:47)
	at junit.framework.Assert.failNotEquals(Assert.java:280)
	at junit.framework.Assert.assertEquals(Assert.java:64)
	at junit.framework.Assert.assertEquals(Assert.java:198)
	at junit.framework.Assert.assertEquals(Assert.java:204)
	at org.joda.time.chrono.TestEthiopicChronology.testSampleDate(TestEthiopicChronology.java:433)


Results :

Failed tests: 
  org.joda.time.chrono.TestCopticChronology#testCalendar AssertionFailedError ex...
  org.joda.time.chrono.TestCopticChronology#testSampleDate AssertionFailedError ...
  org.joda.time.chrono.TestEthiopicChronology#testCalendar AssertionFailedError ...
  org.joda.time.chrono.TestEthiopicChronology#testSampleDate AssertionFailedError
Tests in error: 
  org.joda.time.TestDateMidnight_Properties#testPropertyEqualsHashCodeStrict IllegalFieldValueException
  org.joda.time.TestDateTime_Properties#testPropertyEqualsHashCodeStrict IllegalFieldValueException
  org.joda.time.TestDateTime_Properties#testPropertyEqualsHashCodeYear IllegalFieldValueException
  org.joda.time.TestDateTime_Properties#testPropertyToIntervalHourOfDay IllegalFieldValueException
  org.joda.time.TestInterval_Basics#testToPeriod IllegalFieldValueException Valu...
  org.joda.time.TestInterval_Basics#testToPeriod_PeriodType1 IllegalFieldValueException
  org.joda.time.TestLocalDateTime_Basics#testEqualsHashCode IllegalFieldValueException
  org.joda.time.TestLocalDateTime_Basics#testSerialization IllegalFieldValueException
  org.joda.time.TestLocalDateTime_Basics#testToDateTime IllegalFieldValueException
  org.joda.time.TestLocalDateTime_Basics#testToDateTime_RI IllegalFieldValueException
  org.joda.time.TestLocalDateTime_Basics#testToDateTime_Zone IllegalFieldValueException
  org.joda.time.TestLocalDateTime_Basics#testToDateTime_nullRI IllegalFieldValueException
  org.joda.time.TestLocalDateTime_Basics#testToDateTime_nullZone IllegalFieldValueException
  org.joda.time.TestLocalDateTime_Basics#testToDate_summer IllegalFieldValueException
  org.joda.time.TestLocalDateTime_Basics#testToDate_summer_Zone IllegalFieldValueException
  org.joda.time.TestLocalDateTime_Basics#testToDate_winter IllegalFieldValueException
  org.joda.time.TestLocalDateTime_Basics#testToDate_winter_Zone IllegalFieldValueException
  org.joda.time.TestLocalDateTime_Basics#testToLocalDate IllegalFieldValueException
  org.joda.time.TestLocalDateTime_Basics#testToLocalTime IllegalFieldValueException
  org.joda.time.TestLocalDateTime_Properties#testPropertyEquals IllegalFieldValueException
  org.joda.time.TestLocalDate_Basics#testEqualsHashCode IllegalFieldValueException
  org.joda.time.TestLocalDate_Basics#testEqualsHashCodeAPI IllegalFieldValueException
  org.joda.time.TestLocalDate_Basics#testEqualsHashCodeStrict IllegalFieldValueException
  org.joda.time.TestLocalDate_Basics#testSerialization IllegalFieldValueException
  org.joda.time.TestLocalDate_Basics#testToDateMidnight IllegalFieldValueException
  org.joda.time.TestLocalDate_Basics#testToDateMidnight_Zone IllegalFieldValueException
  org.joda.time.TestLocalDate_Basics#testToDateMidnight_nullZone IllegalFieldValueException
  org.joda.time.TestLocalDate_Basics#testToDateTimeAtCurrentTime IllegalFieldValueException
  org.joda.time.TestLocalDate_Basics#testToDateTimeAtCurrentTime_Zone IllegalFieldValueException
  org.joda.time.TestLocalDate_Basics#testToDateTimeAtCurrentTime_nullZone IllegalFieldValueException
  org.joda.time.TestLocalDate_Basics#testToDateTimeAtMidnight IllegalFieldValueException
  org.joda.time.TestLocalDate_Basics#testToDateTimeAtMidnight_Zone IllegalFieldValueException
  org.joda.time.TestLocalDate_Basics#testToDateTimeAtMidnight_nullZone IllegalFieldValueException
  org.joda.time.TestLocalDate_Basics#testToDateTimeAtStartOfDay IllegalFieldValueException
  org.joda.time.TestLocalDate_Basics#testToDateTimeAtStartOfDay_Zone IllegalFieldValueException
  org.joda.time.TestLocalDate_Basics#testToDateTimeAtStartOfDay_nullZone IllegalFieldValueException
  org.joda.time.TestLocalDate_Basics#testToDateTime_LocalTime IllegalFieldValueException
  org.joda.time.TestLocalDate_Basics#testToDateTime_LocalTime_Zone IllegalFieldValueException
  org.joda.time.TestLocalDate_Basics#testToDateTime_LocalTime_nullZone IllegalFieldValueException
  org.joda.time.TestLocalDate_Basics#testToDateTime_RI IllegalFieldValueException
  org.joda.time.TestLocalDate_Basics#testToDateTime_nullLocalTime IllegalFieldValueException
  org.joda.time.TestLocalDate_Basics#testToDateTime_nullLocalTime_Zone IllegalFieldValueException
  org.joda.time.TestLocalDate_Basics#testToDateTime_wrongChronoLocalTime_Zone IllegalFieldValueException
  org.joda.time.TestLocalDate_Basics#testToDate_summer IllegalFieldValueException
  org.joda.time.TestLocalDate_Basics#testToDate_winter IllegalFieldValueException
  org.joda.time.TestLocalDate_Basics#testToInterval IllegalFieldValueException V...
  org.joda.time.TestLocalDate_Basics#testToInterval_Zone IllegalFieldValueException
  org.joda.time.TestLocalDate_Basics#testToInterval_nullZone IllegalFieldValueException
  org.joda.time.TestLocalDate_Basics#testToLocalDateTime_LocalTime IllegalFieldValueException
  org.joda.time.TestLocalDate_Basics#testToLocalDateTime_nullLocalTime IllegalFieldValueException
  org.joda.time.TestLocalDate_Basics#testToLocalDateTime_wrongChronologyLocalTime IllegalFieldValueException
  org.joda.time.TestLocalDate_Properties#testPropertyEquals IllegalFieldValueException
  org.joda.time.TestLocalDate_Properties#testPropertyEqualsHashCodeStrict IllegalFieldValueException
  org.joda.time.TestMonthDay_Basics#testToLocalDate IllegalFieldValueException V...
  org.joda.time.TestMutableInterval_Basics#testToPeriod IllegalFieldValueException
  org.joda.time.TestMutableInterval_Basics#testToPeriod_PeriodType1 IllegalFieldValueException
  org.joda.time.TestMutablePeriod_Constructors#testConstructor_long_long_Chronology1 IllegalFieldValueException
  org.joda.time.TestMutablePeriod_Constructors#testConstructor_long_long_PeriodType_Chronology1 IllegalFieldValueException
  org.joda.time.TestPeriod_Constructors#testConstructor_long_long_Chronology1 IllegalFieldValueException
  org.joda.time.TestPeriod_Constructors#testConstructor_long_long_PeriodType_Chronology1 IllegalFieldValueException
  org.joda.time.TestYearMonthDay_Basics#testToDateMidnight IllegalFieldValueException
  org.joda.time.TestYearMonthDay_Basics#testToDateMidnight_Zone IllegalFieldValueException
  org.joda.time.TestYearMonthDay_Basics#testToDateMidnight_nullZone IllegalFieldValueException
  org.joda.time.TestYearMonthDay_Basics#testToDateTimeAtCurrentTime IllegalFieldValueException
  org.joda.time.TestYearMonthDay_Basics#testToDateTimeAtCurrentTime_Zone IllegalFieldValueException
  org.joda.time.TestYearMonthDay_Basics#testToDateTimeAtCurrentTime_nullZone IllegalFieldValueException
  org.joda.time.TestYearMonthDay_Basics#testToDateTimeAtMidnight IllegalFieldValueException
  org.joda.time.TestYearMonthDay_Basics#testToDateTimeAtMidnight_Zone IllegalFieldValueException
  org.joda.time.TestYearMonthDay_Basics#testToDateTimeAtMidnight_nullZone IllegalFieldValueException
  org.joda.time.TestYearMonthDay_Basics#testToDateTime_TOD IllegalFieldValueException
  org.joda.time.TestYearMonthDay_Basics#testToDateTime_TOD_Zone IllegalFieldValueException
  org.joda.time.TestYearMonthDay_Basics#testToDateTime_TOD_nullZone IllegalFieldValueException
  org.joda.time.TestYearMonthDay_Basics#testToDateTime_nullTOD IllegalFieldValueException
  org.joda.time.TestYearMonthDay_Basics#testToDateTime_nullTOD_Zone IllegalFieldValueException
  org.joda.time.TestYearMonthDay_Basics#testToInterval IllegalFieldValueException
  org.joda.time.TestYearMonthDay_Basics#testToInterval_Zone IllegalFieldValueException
  org.joda.time.TestYearMonthDay_Basics#testToInterval_nullZone IllegalFieldValueException
  org.joda.time.TestYearMonthDay_Basics#testToLocalDate IllegalFieldValueException
  org.joda.time.TestYearMonth_Basics#testToLocalDate IllegalFieldValueException ...

Tests run: 4157, Failures: 4, Errors: 79, Skipped: 0

[INFO] ------------------------------------------------------------------------
[INFO] BUILD FAILURE
[INFO] ------------------------------------------------------------------------
[INFO] Total time: 14.520s
[INFO] Finished at: Wed Aug 05 22:40:10 BST 2015
[INFO] Final Memory: 9M/213M
[INFO] ------------------------------------------------------------------------
[ERROR] Failed to execute goal org.apache.maven.plugins:maven-surefire-plugin:2.18.1:test (default-test) on project joda-time: There are test failures.
[ERROR] 
[ERROR] Please refer to /home/perham/Study/LittleDarwin/Cases/joda-time-2.8.1/target/surefire-reports for the individual test results.
[ERROR] -> [Help 1]
[ERROR] 
[ERROR] To see the full stack trace of the errors, re-run Maven with the -e switch.
[ERROR] Re-run Maven using the -X switch to enable full debug logging.
[ERROR] 
[ERROR] For more information about the errors and possible solutions, please read the following articles:
[ERROR] [Help 1] http://cwiki.apache.org/confluence/display/MAVEN/MojoFailureException
