[INFO] Scanning for projects...
[INFO]                                                                         
[INFO] ------------------------------------------------------------------------
[INFO] Building Joda-Time 2.8.1
[INFO] ------------------------------------------------------------------------
[INFO] 
[INFO] --- maven-resources-plugin:2.7:resources (default-resources) @ joda-time ---
[INFO] Using 'UTF-8' encoding to copy filtered resources.
[INFO] Copying 2 resources to META-INF
[INFO] Copying 10 resources
[INFO] 
[INFO] --- maven-compiler-plugin:3.3:compile (default-compile) @ joda-time ---
[INFO] Changes detected - recompiling the module!
[INFO] Compiling 166 source files to /home/perham/Study/LittleDarwin/Cases/joda-time-2.8.1/target/classes
[INFO] 
[INFO] --- exec-maven-plugin:1.4.0:java (compile-tzdb) @ joda-time ---
Writing zoneinfo files
Writing ZoneInfoMap
[INFO] 
[INFO] --- maven-resources-plugin:2.7:testResources (default-testResources) @ joda-time ---
[INFO] Using 'UTF-8' encoding to copy filtered resources.
[INFO] Copying 34 resources
[INFO] 
[INFO] --- maven-compiler-plugin:3.3:testCompile (default-testCompile) @ joda-time ---
[INFO] Nothing to compile - all classes are up to date
[INFO] 
[INFO] --- maven-surefire-plugin:2.18.1:test (default-test) @ joda-time ---
[INFO] Surefire report directory: /home/perham/Study/LittleDarwin/Cases/joda-time-2.8.1/target/surefire-reports

-------------------------------------------------------
 T E S T S
-------------------------------------------------------
Running org.joda.time.TestAllPackages

TestBuddhistChronology.testCalendar

TestCopticChronology.testCalendar

TestEthiopicChronology.testCalendar

TestIslamicChronology.testCalendar

Testing Gregorian chronology over 1000 iterations
100% complete (i=1000)

Testing Julian chronology over 1000 iterations
100% complete (i=1000)
Writing zoneinfo files
Writing ZoneInfoMap
Tests run: 4157, Failures: 0, Errors: 123, Skipped: 0, Time elapsed: 4.547 sec <<< FAILURE! - in org.joda.time.TestAllPackages
testToDateMidnight(org.joda.time.TestDateTime_Basics)  Time elapsed: 0.004 sec  <<< ERROR!
java.lang.ArithmeticException: / by zero
	at org.joda.time.chrono.BasicChronology.getYear(BasicChronology.java:412)
	at org.joda.time.chrono.BasicYearDateTimeField.get(BasicYearDateTimeField.java:55)
	at org.joda.time.field.DelegatedDateTimeField.get(DelegatedDateTimeField.java:110)
	at org.joda.time.field.SkipDateTimeField.get(SkipDateTimeField.java:80)
	at org.joda.time.chrono.LimitChronology$LimitDateTimeField.get(LimitChronology.java:463)
	at org.joda.time.chrono.ZonedChronology$ZonedDateTimeField.get(ZonedChronology.java:423)
	at org.joda.time.base.BaseDateTime.<init>(BaseDateTime.java:129)
	at org.joda.time.DateTime.<init>(DateTime.java:236)
	at org.joda.time.TestDateTime_Basics.testToDateMidnight(TestDateTime_Basics.java:713)

testToYearMonthDay(org.joda.time.TestDateTime_Basics)  Time elapsed: 0 sec  <<< ERROR!
java.lang.ArithmeticException: / by zero
	at org.joda.time.chrono.BasicChronology.getYear(BasicChronology.java:412)
	at org.joda.time.chrono.BasicYearDateTimeField.get(BasicYearDateTimeField.java:55)
	at org.joda.time.field.DelegatedDateTimeField.get(DelegatedDateTimeField.java:110)
	at org.joda.time.field.SkipDateTimeField.get(SkipDateTimeField.java:80)
	at org.joda.time.chrono.LimitChronology$LimitDateTimeField.get(LimitChronology.java:463)
	at org.joda.time.chrono.ZonedChronology$ZonedDateTimeField.get(ZonedChronology.java:423)
	at org.joda.time.base.BaseDateTime.<init>(BaseDateTime.java:129)
	at org.joda.time.DateTime.<init>(DateTime.java:236)
	at org.joda.time.TestDateTime_Basics.testToYearMonthDay(TestDateTime_Basics.java:720)

testToTimeOfDay(org.joda.time.TestDateTime_Basics)  Time elapsed: 0 sec  <<< ERROR!
java.lang.ArithmeticException: / by zero
	at org.joda.time.chrono.BasicChronology.getYear(BasicChronology.java:412)
	at org.joda.time.chrono.BasicYearDateTimeField.get(BasicYearDateTimeField.java:55)
	at org.joda.time.field.DelegatedDateTimeField.get(DelegatedDateTimeField.java:110)
	at org.joda.time.field.SkipDateTimeField.get(SkipDateTimeField.java:80)
	at org.joda.time.chrono.LimitChronology$LimitDateTimeField.get(LimitChronology.java:463)
	at org.joda.time.chrono.ZonedChronology$ZonedDateTimeField.get(ZonedChronology.java:423)
	at org.joda.time.base.BaseDateTime.<init>(BaseDateTime.java:129)
	at org.joda.time.DateTime.<init>(DateTime.java:236)
	at org.joda.time.TestDateTime_Basics.testToTimeOfDay(TestDateTime_Basics.java:727)

testToLocalDateTime(org.joda.time.TestDateTime_Basics)  Time elapsed: 0.001 sec  <<< ERROR!
java.lang.ArithmeticException: / by zero
	at org.joda.time.chrono.BasicChronology.getYear(BasicChronology.java:412)
	at org.joda.time.chrono.BasicYearDateTimeField.get(BasicYearDateTimeField.java:55)
	at org.joda.time.field.DelegatedDateTimeField.get(DelegatedDateTimeField.java:110)
	at org.joda.time.field.SkipDateTimeField.get(SkipDateTimeField.java:80)
	at org.joda.time.chrono.LimitChronology$LimitDateTimeField.get(LimitChronology.java:463)
	at org.joda.time.chrono.ZonedChronology$ZonedDateTimeField.get(ZonedChronology.java:423)
	at org.joda.time.base.BaseDateTime.<init>(BaseDateTime.java:129)
	at org.joda.time.DateTime.<init>(DateTime.java:236)
	at org.joda.time.TestDateTime_Basics.testToLocalDateTime(TestDateTime_Basics.java:733)

testToLocalDate(org.joda.time.TestDateTime_Basics)  Time elapsed: 0.001 sec  <<< ERROR!
java.lang.ArithmeticException: / by zero
	at org.joda.time.chrono.BasicChronology.getYear(BasicChronology.java:412)
	at org.joda.time.chrono.BasicYearDateTimeField.get(BasicYearDateTimeField.java:55)
	at org.joda.time.field.DelegatedDateTimeField.get(DelegatedDateTimeField.java:110)
	at org.joda.time.field.SkipDateTimeField.get(SkipDateTimeField.java:80)
	at org.joda.time.chrono.LimitChronology$LimitDateTimeField.get(LimitChronology.java:463)
	at org.joda.time.chrono.ZonedChronology$ZonedDateTimeField.get(ZonedChronology.java:423)
	at org.joda.time.base.BaseDateTime.<init>(BaseDateTime.java:129)
	at org.joda.time.DateTime.<init>(DateTime.java:236)
	at org.joda.time.TestDateTime_Basics.testToLocalDate(TestDateTime_Basics.java:739)

testToLocalTime(org.joda.time.TestDateTime_Basics)  Time elapsed: 0.002 sec  <<< ERROR!
java.lang.ArithmeticException: / by zero
	at org.joda.time.chrono.BasicChronology.getYear(BasicChronology.java:412)
	at org.joda.time.chrono.BasicYearDateTimeField.get(BasicYearDateTimeField.java:55)
	at org.joda.time.field.DelegatedDateTimeField.get(DelegatedDateTimeField.java:110)
	at org.joda.time.field.SkipDateTimeField.get(SkipDateTimeField.java:80)
	at org.joda.time.chrono.LimitChronology$LimitDateTimeField.get(LimitChronology.java:463)
	at org.joda.time.chrono.ZonedChronology$ZonedDateTimeField.get(ZonedChronology.java:423)
	at org.joda.time.base.BaseDateTime.<init>(BaseDateTime.java:129)
	at org.joda.time.DateTime.<init>(DateTime.java:236)
	at org.joda.time.TestDateTime_Basics.testToLocalTime(TestDateTime_Basics.java:745)

testPropertyEqualsHashCodeYear(org.joda.time.TestDateTime_Properties)  Time elapsed: 0.001 sec  <<< ERROR!
java.lang.ArithmeticException: / by zero
	at org.joda.time.chrono.BasicChronology.getYear(BasicChronology.java:412)
	at org.joda.time.chrono.BasicYearDateTimeField.get(BasicYearDateTimeField.java:55)
	at org.joda.time.field.DelegatedDateTimeField.get(DelegatedDateTimeField.java:110)
	at org.joda.time.field.SkipDateTimeField.get(SkipDateTimeField.java:80)
	at org.joda.time.chrono.LimitChronology$LimitDateTimeField.get(LimitChronology.java:463)
	at org.joda.time.chrono.ZonedChronology$ZonedDateTimeField.get(ZonedChronology.java:423)
	at org.joda.time.field.AbstractReadableInstantFieldProperty.get(AbstractReadableInstantFieldProperty.java:120)
	at org.joda.time.field.AbstractReadableInstantFieldProperty.equals(AbstractReadableInstantFieldProperty.java:449)
	at org.joda.time.TestDateTime_Properties.testPropertyEqualsHashCodeYear(TestDateTime_Properties.java:331)

testPropertyToIntervalHourOfDay(org.joda.time.TestDateTime_Properties)  Time elapsed: 0.001 sec  <<< ERROR!
java.lang.ArithmeticException: / by zero
	at org.joda.time.chrono.BasicChronology.getYear(BasicChronology.java:412)
	at org.joda.time.chrono.BasicYearDateTimeField.get(BasicYearDateTimeField.java:55)
	at org.joda.time.field.DelegatedDateTimeField.get(DelegatedDateTimeField.java:110)
	at org.joda.time.field.SkipDateTimeField.get(SkipDateTimeField.java:80)
	at org.joda.time.chrono.LimitChronology$LimitDateTimeField.get(LimitChronology.java:463)
	at org.joda.time.chrono.ZonedChronology$ZonedDateTimeField.get(ZonedChronology.java:423)
	at org.joda.time.base.BaseDateTime.<init>(BaseDateTime.java:129)
	at org.joda.time.DateTime.<init>(DateTime.java:236)
	at org.joda.time.base.AbstractInterval.getStart(AbstractInterval.java:74)
	at org.joda.time.TestDateTime_Properties.testPropertyToIntervalHourOfDay(TestDateTime_Properties.java:1348)

testPropertyEqualsHashCodeLenient(org.joda.time.TestDateTime_Properties)  Time elapsed: 0.001 sec  <<< ERROR!
java.lang.ArithmeticException: / by zero
	at org.joda.time.chrono.BasicChronology.getYear(BasicChronology.java:412)
	at org.joda.time.chrono.BasicYearDateTimeField.get(BasicYearDateTimeField.java:55)
	at org.joda.time.field.DelegatedDateTimeField.get(DelegatedDateTimeField.java:110)
	at org.joda.time.field.SkipDateTimeField.get(SkipDateTimeField.java:80)
	at org.joda.time.chrono.LimitChronology$LimitDateTimeField.get(LimitChronology.java:463)
	at org.joda.time.chrono.ZonedChronology$ZonedDateTimeField.get(ZonedChronology.java:423)
	at org.joda.time.field.DelegatedDateTimeField.get(DelegatedDateTimeField.java:110)
	at org.joda.time.field.LenientDateTimeField.set(LenientDateTimeField.java:73)
	at org.joda.time.chrono.BaseChronology.getDateTimeMillis(BaseChronology.java:132)
	at org.joda.time.chrono.AssembledChronology.getDateTimeMillis(AssembledChronology.java:136)
	at org.joda.time.base.BaseDateTime.<init>(BaseDateTime.java:258)
	at org.joda.time.DateTime.<init>(DateTime.java:532)
	at org.joda.time.TestDateTime_Properties.testPropertyEqualsHashCodeLenient(TestDateTime_Properties.java:1374)

testPropertyEqualsHashCodeStrict(org.joda.time.TestDateTime_Properties)  Time elapsed: 0.001 sec  <<< ERROR!
java.lang.ArithmeticException: / by zero
	at org.joda.time.chrono.BasicChronology.getYear(BasicChronology.java:412)
	at org.joda.time.chrono.BasicChronology.getDayOfYear(BasicChronology.java:485)
	at org.joda.time.chrono.BasicFixedMonthChronology.getDayOfMonth(BasicFixedMonthChronology.java:31)
	at org.joda.time.chrono.BasicDayOfMonthDateTimeField.get(BasicDayOfMonthDateTimeField.java:48)
	at org.joda.time.chrono.LimitChronology$LimitDateTimeField.get(LimitChronology.java:463)
	at org.joda.time.chrono.ZonedChronology$ZonedDateTimeField.get(ZonedChronology.java:423)
	at org.joda.time.field.AbstractReadableInstantFieldProperty.get(AbstractReadableInstantFieldProperty.java:120)
	at org.joda.time.field.AbstractReadableInstantFieldProperty.equals(AbstractReadableInstantFieldProperty.java:449)
	at org.joda.time.TestDateTime_Properties.testPropertyEqualsHashCodeStrict(TestDateTime_Properties.java:1388)

testToYearMonthDay(org.joda.time.TestDateMidnight_Basics)  Time elapsed: 0 sec  <<< ERROR!
java.lang.ArithmeticException

testToLocalDate(org.joda.time.TestDateMidnight_Basics)  Time elapsed: 0 sec  <<< ERROR!
java.lang.ArithmeticException

testToInterval(org.joda.time.TestDateMidnight_Basics)  Time elapsed: 0.001 sec  <<< ERROR!
java.lang.ArithmeticException

testPropertyEqualsHashCodeLenient(org.joda.time.TestDateMidnight_Properties)  Time elapsed: 0 sec  <<< ERROR!
java.lang.ArithmeticException

testPropertyEqualsHashCodeStrict(org.joda.time.TestDateMidnight_Properties)  Time elapsed: 0 sec  <<< ERROR!
java.lang.ArithmeticException

testConstructor_RI_RP3(org.joda.time.TestInterval_Constructors)  Time elapsed: 0.001 sec  <<< ERROR!
java.lang.ArithmeticException

testConstructor_RP_RI3(org.joda.time.TestInterval_Constructors)  Time elapsed: 0 sec  <<< ERROR!
java.lang.ArithmeticException

testToPeriod(org.joda.time.TestInterval_Basics)  Time elapsed: 0.001 sec  <<< ERROR!
java.lang.ArithmeticException

testToPeriod_PeriodType1(org.joda.time.TestInterval_Basics)  Time elapsed: 0 sec  <<< ERROR!
java.lang.ArithmeticException

testWithPeriodAfterStart1(org.joda.time.TestInterval_Basics)  Time elapsed: 0 sec  <<< ERROR!
java.lang.ArithmeticException

testWithPeriodBeforeEnd1(org.joda.time.TestInterval_Basics)  Time elapsed: 0 sec  <<< ERROR!
java.lang.ArithmeticException

testEqualsHashCodeLenient(org.joda.time.TestInterval_Basics)  Time elapsed: 0 sec  <<< ERROR!
java.lang.ArithmeticException

testEqualsHashCodeStrict(org.joda.time.TestInterval_Basics)  Time elapsed: 0 sec  <<< ERROR!
java.lang.ArithmeticException

testSerialization(org.joda.time.TestLocalDateTime_Basics)  Time elapsed: 0.003 sec  <<< ERROR!
java.lang.ArithmeticException

testToDateTime(org.joda.time.TestLocalDateTime_Basics)  Time elapsed: 0 sec  <<< ERROR!
java.lang.ArithmeticException

testEqualsHashCode(org.joda.time.TestLocalDateTime_Basics)  Time elapsed: 0 sec  <<< ERROR!
java.lang.ArithmeticException

testToDateTime_Zone(org.joda.time.TestLocalDateTime_Basics)  Time elapsed: 0 sec  <<< ERROR!
java.lang.ArithmeticException

testToDateTime_nullZone(org.joda.time.TestLocalDateTime_Basics)  Time elapsed: 0 sec  <<< ERROR!
java.lang.ArithmeticException

testToDateTime_RI(org.joda.time.TestLocalDateTime_Basics)  Time elapsed: 0 sec  <<< ERROR!
java.lang.ArithmeticException

testToDateTime_nullRI(org.joda.time.TestLocalDateTime_Basics)  Time elapsed: 0 sec  <<< ERROR!
java.lang.ArithmeticException

testToDate_summer(org.joda.time.TestLocalDateTime_Basics)  Time elapsed: 0 sec  <<< ERROR!
java.lang.ArithmeticException

testToDate_winter(org.joda.time.TestLocalDateTime_Basics)  Time elapsed: 0 sec  <<< ERROR!
java.lang.ArithmeticException

testToDate_summer_Zone(org.joda.time.TestLocalDateTime_Basics)  Time elapsed: 0.001 sec  <<< ERROR!
java.lang.ArithmeticException

testToDate_winter_Zone(org.joda.time.TestLocalDateTime_Basics)  Time elapsed: 0 sec  <<< ERROR!
java.lang.ArithmeticException

testPropertyEquals(org.joda.time.TestLocalDateTime_Properties)  Time elapsed: 0 sec  <<< ERROR!
java.lang.ArithmeticException

testSerialization(org.joda.time.TestLocalDate_Basics)  Time elapsed: 0.003 sec  <<< ERROR!
java.lang.ArithmeticException

testToDateMidnight(org.joda.time.TestLocalDate_Basics)  Time elapsed: 0 sec  <<< ERROR!
java.lang.ArithmeticException

testEqualsHashCode(org.joda.time.TestLocalDate_Basics)  Time elapsed: 0 sec  <<< ERROR!
java.lang.ArithmeticException

testToInterval(org.joda.time.TestLocalDate_Basics)  Time elapsed: 0 sec  <<< ERROR!
java.lang.ArithmeticException

testToDateTimeAtStartOfDay(org.joda.time.TestLocalDate_Basics)  Time elapsed: 0 sec  <<< ERROR!
java.lang.ArithmeticException

testToDateTimeAtStartOfDay_Zone(org.joda.time.TestLocalDate_Basics)  Time elapsed: 0 sec  <<< ERROR!
java.lang.ArithmeticException

testToDateTimeAtStartOfDay_nullZone(org.joda.time.TestLocalDate_Basics)  Time elapsed: 0.001 sec  <<< ERROR!
java.lang.ArithmeticException

testToDateTimeAtMidnight(org.joda.time.TestLocalDate_Basics)  Time elapsed: 0 sec  <<< ERROR!
java.lang.ArithmeticException

testToDateTimeAtMidnight_Zone(org.joda.time.TestLocalDate_Basics)  Time elapsed: 0 sec  <<< ERROR!
java.lang.ArithmeticException

testToDateTimeAtMidnight_nullZone(org.joda.time.TestLocalDate_Basics)  Time elapsed: 0 sec  <<< ERROR!
java.lang.ArithmeticException

testToDateTimeAtCurrentTime(org.joda.time.TestLocalDate_Basics)  Time elapsed: 0 sec  <<< ERROR!
java.lang.ArithmeticException

testToDateTimeAtCurrentTime_Zone(org.joda.time.TestLocalDate_Basics)  Time elapsed: 0.001 sec  <<< ERROR!
java.lang.ArithmeticException

testToDateTimeAtCurrentTime_nullZone(org.joda.time.TestLocalDate_Basics)  Time elapsed: 0 sec  <<< ERROR!
java.lang.ArithmeticException

testToLocalDateTime_LocalTime(org.joda.time.TestLocalDate_Basics)  Time elapsed: 0 sec  <<< ERROR!
java.lang.ArithmeticException

testToDateTime_LocalTime(org.joda.time.TestLocalDate_Basics)  Time elapsed: 0 sec  <<< ERROR!
java.lang.ArithmeticException

testEqualsHashCodeAPI(org.joda.time.TestLocalDate_Basics)  Time elapsed: 0 sec  <<< ERROR!
java.lang.ArithmeticException

testToDateTime_nullLocalTime(org.joda.time.TestLocalDate_Basics)  Time elapsed: 0 sec  <<< ERROR!
java.lang.ArithmeticException

testToDateTime_LocalTime_Zone(org.joda.time.TestLocalDate_Basics)  Time elapsed: 0 sec  <<< ERROR!
java.lang.ArithmeticException

testToDateTime_LocalTime_nullZone(org.joda.time.TestLocalDate_Basics)  Time elapsed: 0 sec  <<< ERROR!
java.lang.ArithmeticException

testToDateTime_nullLocalTime_Zone(org.joda.time.TestLocalDate_Basics)  Time elapsed: 0 sec  <<< ERROR!
java.lang.ArithmeticException

testToDateMidnight_Zone(org.joda.time.TestLocalDate_Basics)  Time elapsed: 0 sec  <<< ERROR!
java.lang.ArithmeticException

testToDateMidnight_nullZone(org.joda.time.TestLocalDate_Basics)  Time elapsed: 0 sec  <<< ERROR!
java.lang.ArithmeticException

testToInterval_Zone(org.joda.time.TestLocalDate_Basics)  Time elapsed: 0 sec  <<< ERROR!
java.lang.ArithmeticException

testToInterval_nullZone(org.joda.time.TestLocalDate_Basics)  Time elapsed: 0 sec  <<< ERROR!
java.lang.ArithmeticException

testToDateTime_RI(org.joda.time.TestLocalDate_Basics)  Time elapsed: 0.003 sec  <<< ERROR!
java.lang.ArithmeticException

testToDate_summer(org.joda.time.TestLocalDate_Basics)  Time elapsed: 0 sec  <<< ERROR!
java.lang.ArithmeticException

testToDate_winter(org.joda.time.TestLocalDate_Basics)  Time elapsed: 0 sec  <<< ERROR!
java.lang.ArithmeticException

testEqualsHashCodeLenient(org.joda.time.TestLocalDate_Basics)  Time elapsed: 0 sec  <<< ERROR!
java.lang.ArithmeticException

testEqualsHashCodeStrict(org.joda.time.TestLocalDate_Basics)  Time elapsed: 0.001 sec  <<< ERROR!
java.lang.ArithmeticException

testPropertyEqualsHashCodeLenient(org.joda.time.TestLocalDate_Properties)  Time elapsed: 0 sec  <<< ERROR!
java.lang.ArithmeticException

testPropertyEqualsHashCodeStrict(org.joda.time.TestLocalDate_Properties)  Time elapsed: 0.001 sec  <<< ERROR!
java.lang.ArithmeticException

testPropertyEquals(org.joda.time.TestLocalDate_Properties)  Time elapsed: 0 sec  <<< ERROR!
java.lang.ArithmeticException

testToDateTimeToday_nullZone(org.joda.time.TestLocalTime_Basics)  Time elapsed: 0 sec  <<< ERROR!
java.lang.ArithmeticException

testToDateTimeToday_Zone(org.joda.time.TestLocalTime_Basics)  Time elapsed: 0 sec  <<< ERROR!
java.lang.ArithmeticException

testToDateTimeTodayDefaultZone(org.joda.time.TestLocalTime_Basics)  Time elapsed: 0 sec  <<< ERROR!
java.lang.ArithmeticException

testToPeriod(org.joda.time.TestMutableInterval_Basics)  Time elapsed: 0 sec  <<< ERROR!
java.lang.ArithmeticException

testToPeriod_PeriodType1(org.joda.time.TestMutableInterval_Basics)  Time elapsed: 0 sec  <<< ERROR!
java.lang.ArithmeticException

testConstructor_long_long_Chronology1(org.joda.time.TestPeriod_Constructors)  Time elapsed: 0 sec  <<< ERROR!
java.lang.ArithmeticException

testConstructor_long_long_PeriodType_Chronology1(org.joda.time.TestPeriod_Constructors)  Time elapsed: 0 sec  <<< ERROR!
java.lang.ArithmeticException

testConstructor_long_long_Chronology1(org.joda.time.TestMutablePeriod_Constructors)  Time elapsed: 0 sec  <<< ERROR!
java.lang.ArithmeticException

testConstructor_long_long_PeriodType_Chronology1(org.joda.time.TestMutablePeriod_Constructors)  Time elapsed: 0.001 sec  <<< ERROR!
java.lang.ArithmeticException

testToDateTimeToday(org.joda.time.TestTimeOfDay_Basics)  Time elapsed: 0.001 sec  <<< ERROR!
java.lang.ArithmeticException

testToDateTimeToday_nullZone(org.joda.time.TestTimeOfDay_Basics)  Time elapsed: 0.001 sec  <<< ERROR!
java.lang.ArithmeticException

testToDateTimeToday_Zone(org.joda.time.TestTimeOfDay_Basics)  Time elapsed: 0.001 sec  <<< ERROR!
java.lang.ArithmeticException

testToInterval(org.joda.time.TestYearMonthDay_Basics)  Time elapsed: 0 sec  <<< ERROR!
java.lang.ArithmeticException

testGetFieldType(org.joda.time.TestYearMonthDay_Basics)  Time elapsed: 0 sec  <<< ERROR!
java.lang.ArithmeticException

testGetField(org.joda.time.TestYearMonthDay_Basics)  Time elapsed: 0.001 sec  <<< ERROR!
java.lang.ArithmeticException

testToDateTimeAtCurrentTime(org.joda.time.TestYearMonthDay_Basics)  Time elapsed: 0 sec  <<< ERROR!
java.lang.ArithmeticException

testToDateTimeAtCurrentTime_Zone(org.joda.time.TestYearMonthDay_Basics)  Time elapsed: 0.001 sec  <<< ERROR!
java.lang.ArithmeticException

testToDateTimeAtCurrentTime_nullZone(org.joda.time.TestYearMonthDay_Basics)  Time elapsed: 0 sec  <<< ERROR!
java.lang.ArithmeticException

testGetFieldTypes(org.joda.time.TestYearMonthDay_Basics)  Time elapsed: 0 sec  <<< ERROR!
java.lang.ArithmeticException

testGetFields(org.joda.time.TestYearMonthDay_Basics)  Time elapsed: 0.001 sec  <<< ERROR!
java.lang.ArithmeticException

testToInterval_Zone(org.joda.time.TestYearMonthDay_Basics)  Time elapsed: 0 sec  <<< ERROR!
java.lang.ArithmeticException

testToInterval_nullZone(org.joda.time.TestYearMonthDay_Basics)  Time elapsed: 0.001 sec  <<< ERROR!
java.lang.ArithmeticException

testIsSupported(org.joda.time.TestYearMonthDay_Basics)  Time elapsed: 0 sec  <<< ERROR!
java.lang.ArithmeticException

testToDateTime_TOD(org.joda.time.TestYearMonthDay_Basics)  Time elapsed: 0 sec  <<< ERROR!
java.lang.ArithmeticException

testToDateTime_nullTOD(org.joda.time.TestYearMonthDay_Basics)  Time elapsed: 0 sec  <<< ERROR!
java.lang.ArithmeticException

testToDateTime_TOD_Zone(org.joda.time.TestYearMonthDay_Basics)  Time elapsed: 0 sec  <<< ERROR!
java.lang.ArithmeticException

testToDateTime_TOD_nullZone(org.joda.time.TestYearMonthDay_Basics)  Time elapsed: 0 sec  <<< ERROR!
java.lang.ArithmeticException

testToDateTime_nullTOD_Zone(org.joda.time.TestYearMonthDay_Basics)  Time elapsed: 0.001 sec  <<< ERROR!
java.lang.ArithmeticException

testToInterval(org.joda.time.TestYearMonth_Basics)  Time elapsed: 0.001 sec  <<< ERROR!
java.lang.ArithmeticException

testGetFieldType(org.joda.time.TestYearMonth_Basics)  Time elapsed: 0 sec  <<< ERROR!
java.lang.ArithmeticException

testGetField(org.joda.time.TestYearMonth_Basics)  Time elapsed: 0.001 sec  <<< ERROR!
java.lang.ArithmeticException

testGetFieldTypes(org.joda.time.TestYearMonth_Basics)  Time elapsed: 0.001 sec  <<< ERROR!
java.lang.ArithmeticException

testGetFields(org.joda.time.TestYearMonth_Basics)  Time elapsed: 0 sec  <<< ERROR!
java.lang.ArithmeticException

testToInterval_Zone(org.joda.time.TestYearMonth_Basics)  Time elapsed: 0 sec  <<< ERROR!
java.lang.ArithmeticException

testToInterval_nullZone(org.joda.time.TestYearMonth_Basics)  Time elapsed: 0 sec  <<< ERROR!
java.lang.ArithmeticException

testIsSupported(org.joda.time.TestYearMonth_Basics)  Time elapsed: 0 sec  <<< ERROR!
java.lang.ArithmeticException

testGetFieldType(org.joda.time.TestMonthDay_Basics)  Time elapsed: 0 sec  <<< ERROR!
java.lang.ArithmeticException

testGetField(org.joda.time.TestMonthDay_Basics)  Time elapsed: 0.001 sec  <<< ERROR!
java.lang.ArithmeticException

testGetFieldTypes(org.joda.time.TestMonthDay_Basics)  Time elapsed: 0 sec  <<< ERROR!
java.lang.ArithmeticException

testGetFields(org.joda.time.TestMonthDay_Basics)  Time elapsed: 0 sec  <<< ERROR!
java.lang.ArithmeticException

testIsSupported(org.joda.time.TestMonthDay_Basics)  Time elapsed: 0 sec  <<< ERROR!
java.lang.ArithmeticException

testGetIntervalChronology_RI_RI(org.joda.time.TestDateTimeUtils)  Time elapsed: 0 sec  <<< ERROR!
java.lang.ArithmeticException

testSampleDate(org.joda.time.chrono.TestCopticChronology)  Time elapsed: 0.001 sec  <<< ERROR!
java.lang.ArithmeticException

testSampleDateWithZone(org.joda.time.chrono.TestCopticChronology)  Time elapsed: 0 sec  <<< ERROR!
java.lang.ArithmeticException

testDurationYear(org.joda.time.chrono.TestCopticChronology)  Time elapsed: 0 sec  <<< ERROR!
java.lang.ArithmeticException

testDurationMonth(org.joda.time.chrono.TestCopticChronology)  Time elapsed: 0 sec  <<< ERROR!
java.lang.ArithmeticException

testLeap_5_13(org.joda.time.chrono.TestCopticChronology)  Time elapsed: 0 sec  <<< ERROR!
java.lang.ArithmeticException

testLeap_6_13(org.joda.time.chrono.TestCopticChronology)  Time elapsed: 0.001 sec  <<< ERROR!
java.lang.ArithmeticException

testCalendar(org.joda.time.chrono.TestCopticChronology)  Time elapsed: 0 sec  <<< ERROR!
java.lang.ArithmeticException

testSampleDate(org.joda.time.chrono.TestEthiopicChronology)  Time elapsed: 0 sec  <<< ERROR!
java.lang.ArithmeticException

testSampleDateWithZone(org.joda.time.chrono.TestEthiopicChronology)  Time elapsed: 0 sec  <<< ERROR!
java.lang.ArithmeticException

testDurationYear(org.joda.time.chrono.TestEthiopicChronology)  Time elapsed: 0.001 sec  <<< ERROR!
java.lang.ArithmeticException

testDurationMonth(org.joda.time.chrono.TestEthiopicChronology)  Time elapsed: 0 sec  <<< ERROR!
java.lang.ArithmeticException

testLeap_5_13(org.joda.time.chrono.TestEthiopicChronology)  Time elapsed: 0 sec  <<< ERROR!
java.lang.ArithmeticException

testLeap_6_13(org.joda.time.chrono.TestEthiopicChronology)  Time elapsed: 0 sec  <<< ERROR!
java.lang.ArithmeticException

testCalendar(org.joda.time.chrono.TestEthiopicChronology)  Time elapsed: 0 sec  <<< ERROR!
java.lang.ArithmeticException


Results :

Tests in error: 
  org.joda.time.TestDateMidnight_Basics#testToInterval ArithmeticException
  org.joda.time.TestDateMidnight_Basics#testToLocalDate ArithmeticException
  org.joda.time.TestDateMidnight_Basics#testToYearMonthDay ArithmeticException
  org.joda.time.TestDateMidnight_Properties#testPropertyEqualsHashCodeLenient ArithmeticException
  org.joda.time.TestDateMidnight_Properties#testPropertyEqualsHashCodeStrict ArithmeticException
  org.joda.time.TestDateTimeUtils#testGetIntervalChronology_RI_RI ArithmeticException
  org.joda.time.TestDateTime_Basics#testToDateMidnight ArithmeticException / by ...
  org.joda.time.TestDateTime_Basics#testToLocalDate ArithmeticException / by zer...
  org.joda.time.TestDateTime_Basics#testToLocalDateTime ArithmeticException / by...
  org.joda.time.TestDateTime_Basics#testToLocalTime ArithmeticException / by zer...
  org.joda.time.TestDateTime_Basics#testToTimeOfDay ArithmeticException / by zer...
  org.joda.time.TestDateTime_Basics#testToYearMonthDay ArithmeticException / by ...
  org.joda.time.TestDateTime_Properties#testPropertyEqualsHashCodeLenient ArithmeticException
  org.joda.time.TestDateTime_Properties#testPropertyEqualsHashCodeStrict ArithmeticException
  org.joda.time.TestDateTime_Properties#testPropertyEqualsHashCodeYear ArithmeticException
  org.joda.time.TestDateTime_Properties#testPropertyToIntervalHourOfDay ArithmeticException
  org.joda.time.TestInterval_Basics#testEqualsHashCodeLenient ArithmeticException
  org.joda.time.TestInterval_Basics#testEqualsHashCodeStrict ArithmeticException
  org.joda.time.TestInterval_Basics#testToPeriod ArithmeticException
  org.joda.time.TestInterval_Basics#testToPeriod_PeriodType1 ArithmeticException
  org.joda.time.TestInterval_Basics#testWithPeriodAfterStart1 ArithmeticException
  org.joda.time.TestInterval_Basics#testWithPeriodBeforeEnd1 ArithmeticException
  org.joda.time.TestInterval_Constructors#testConstructor_RI_RP3 ArithmeticException
  org.joda.time.TestInterval_Constructors#testConstructor_RP_RI3 ArithmeticException
  org.joda.time.TestLocalDateTime_Basics#testEqualsHashCode ArithmeticException
  org.joda.time.TestLocalDateTime_Basics#testSerialization ArithmeticException
  org.joda.time.TestLocalDateTime_Basics#testToDateTime ArithmeticException
  org.joda.time.TestLocalDateTime_Basics#testToDateTime_RI ArithmeticException
  org.joda.time.TestLocalDateTime_Basics#testToDateTime_Zone ArithmeticException
  org.joda.time.TestLocalDateTime_Basics#testToDateTime_nullRI ArithmeticException
  org.joda.time.TestLocalDateTime_Basics#testToDateTime_nullZone ArithmeticException
  org.joda.time.TestLocalDateTime_Basics#testToDate_summer ArithmeticException
  org.joda.time.TestLocalDateTime_Basics#testToDate_summer_Zone ArithmeticException
  org.joda.time.TestLocalDateTime_Basics#testToDate_winter ArithmeticException
  org.joda.time.TestLocalDateTime_Basics#testToDate_winter_Zone ArithmeticException
  org.joda.time.TestLocalDateTime_Properties#testPropertyEquals ArithmeticException
  org.joda.time.TestLocalDate_Basics#testEqualsHashCode ArithmeticException
  org.joda.time.TestLocalDate_Basics#testEqualsHashCodeAPI ArithmeticException
  org.joda.time.TestLocalDate_Basics#testEqualsHashCodeLenient ArithmeticException
  org.joda.time.TestLocalDate_Basics#testEqualsHashCodeStrict ArithmeticException
  org.joda.time.TestLocalDate_Basics#testSerialization ArithmeticException
  org.joda.time.TestLocalDate_Basics#testToDateMidnight ArithmeticException
  org.joda.time.TestLocalDate_Basics#testToDateMidnight_Zone ArithmeticException
  org.joda.time.TestLocalDate_Basics#testToDateMidnight_nullZone ArithmeticException
  org.joda.time.TestLocalDate_Basics#testToDateTimeAtCurrentTime ArithmeticException
  org.joda.time.TestLocalDate_Basics#testToDateTimeAtCurrentTime_Zone ArithmeticException
  org.joda.time.TestLocalDate_Basics#testToDateTimeAtCurrentTime_nullZone ArithmeticException
  org.joda.time.TestLocalDate_Basics#testToDateTimeAtMidnight ArithmeticException
  org.joda.time.TestLocalDate_Basics#testToDateTimeAtMidnight_Zone ArithmeticException
  org.joda.time.TestLocalDate_Basics#testToDateTimeAtMidnight_nullZone ArithmeticException
  org.joda.time.TestLocalDate_Basics#testToDateTimeAtStartOfDay ArithmeticException
  org.joda.time.TestLocalDate_Basics#testToDateTimeAtStartOfDay_Zone ArithmeticException
  org.joda.time.TestLocalDate_Basics#testToDateTimeAtStartOfDay_nullZone ArithmeticException
  org.joda.time.TestLocalDate_Basics#testToDateTime_LocalTime ArithmeticException
  org.joda.time.TestLocalDate_Basics#testToDateTime_LocalTime_Zone ArithmeticException
  org.joda.time.TestLocalDate_Basics#testToDateTime_LocalTime_nullZone ArithmeticException
  org.joda.time.TestLocalDate_Basics#testToDateTime_RI ArithmeticException
  org.joda.time.TestLocalDate_Basics#testToDateTime_nullLocalTime ArithmeticException
  org.joda.time.TestLocalDate_Basics#testToDateTime_nullLocalTime_Zone ArithmeticException
  org.joda.time.TestLocalDate_Basics#testToDate_summer ArithmeticException
  org.joda.time.TestLocalDate_Basics#testToDate_winter ArithmeticException
  org.joda.time.TestLocalDate_Basics#testToInterval ArithmeticException
  org.joda.time.TestLocalDate_Basics#testToInterval_Zone ArithmeticException
  org.joda.time.TestLocalDate_Basics#testToInterval_nullZone ArithmeticException
  org.joda.time.TestLocalDate_Basics#testToLocalDateTime_LocalTime ArithmeticException
  org.joda.time.TestLocalDate_Properties#testPropertyEquals ArithmeticException
  org.joda.time.TestLocalDate_Properties#testPropertyEqualsHashCodeLenient ArithmeticException
  org.joda.time.TestLocalDate_Properties#testPropertyEqualsHashCodeStrict ArithmeticException
  org.joda.time.TestLocalTime_Basics#testToDateTimeTodayDefaultZone ArithmeticException
  org.joda.time.TestLocalTime_Basics#testToDateTimeToday_Zone ArithmeticException
  org.joda.time.TestLocalTime_Basics#testToDateTimeToday_nullZone ArithmeticException
  org.joda.time.TestMonthDay_Basics#testGetField ArithmeticException
  org.joda.time.TestMonthDay_Basics#testGetFieldType ArithmeticException
  org.joda.time.TestMonthDay_Basics#testGetFieldTypes ArithmeticException
  org.joda.time.TestMonthDay_Basics#testGetFields ArithmeticException
  org.joda.time.TestMonthDay_Basics#testIsSupported ArithmeticException
  org.joda.time.TestMutableInterval_Basics#testToPeriod ArithmeticException
  org.joda.time.TestMutableInterval_Basics#testToPeriod_PeriodType1 ArithmeticException
  org.joda.time.TestMutablePeriod_Constructors#testConstructor_long_long_Chronology1 ArithmeticException
  org.joda.time.TestMutablePeriod_Constructors#testConstructor_long_long_PeriodType_Chronology1 ArithmeticException
  org.joda.time.TestPeriod_Constructors#testConstructor_long_long_Chronology1 ArithmeticException
  org.joda.time.TestPeriod_Constructors#testConstructor_long_long_PeriodType_Chronology1 ArithmeticException
  org.joda.time.TestTimeOfDay_Basics#testToDateTimeToday ArithmeticException
  org.joda.time.TestTimeOfDay_Basics#testToDateTimeToday_Zone ArithmeticException
  org.joda.time.TestTimeOfDay_Basics#testToDateTimeToday_nullZone ArithmeticException
  org.joda.time.TestYearMonthDay_Basics#testGetField ArithmeticException
  org.joda.time.TestYearMonthDay_Basics#testGetFieldType ArithmeticException
  org.joda.time.TestYearMonthDay_Basics#testGetFieldTypes ArithmeticException
  org.joda.time.TestYearMonthDay_Basics#testGetFields ArithmeticException
  org.joda.time.TestYearMonthDay_Basics#testIsSupported ArithmeticException
  org.joda.time.TestYearMonthDay_Basics#testToDateTimeAtCurrentTime ArithmeticException
  org.joda.time.TestYearMonthDay_Basics#testToDateTimeAtCurrentTime_Zone ArithmeticException
  org.joda.time.TestYearMonthDay_Basics#testToDateTimeAtCurrentTime_nullZone ArithmeticException
  org.joda.time.TestYearMonthDay_Basics#testToDateTime_TOD ArithmeticException
  org.joda.time.TestYearMonthDay_Basics#testToDateTime_TOD_Zone ArithmeticException
  org.joda.time.TestYearMonthDay_Basics#testToDateTime_TOD_nullZone ArithmeticException
  org.joda.time.TestYearMonthDay_Basics#testToDateTime_nullTOD ArithmeticException
  org.joda.time.TestYearMonthDay_Basics#testToDateTime_nullTOD_Zone ArithmeticException
  org.joda.time.TestYearMonthDay_Basics#testToInterval ArithmeticException
  org.joda.time.TestYearMonthDay_Basics#testToInterval_Zone ArithmeticException
  org.joda.time.TestYearMonthDay_Basics#testToInterval_nullZone ArithmeticException
  org.joda.time.TestYearMonth_Basics#testGetField ArithmeticException
  org.joda.time.TestYearMonth_Basics#testGetFieldType ArithmeticException
  org.joda.time.TestYearMonth_Basics#testGetFieldTypes ArithmeticException
  org.joda.time.TestYearMonth_Basics#testGetFields ArithmeticException
  org.joda.time.TestYearMonth_Basics#testIsSupported ArithmeticException
  org.joda.time.TestYearMonth_Basics#testToInterval ArithmeticException
  org.joda.time.TestYearMonth_Basics#testToInterval_Zone ArithmeticException
  org.joda.time.TestYearMonth_Basics#testToInterval_nullZone ArithmeticException
  org.joda.time.chrono.TestCopticChronology#testCalendar ArithmeticException
  org.joda.time.chrono.TestCopticChronology#testDurationMonth ArithmeticException
  org.joda.time.chrono.TestCopticChronology#testDurationYear ArithmeticException
  org.joda.time.chrono.TestCopticChronology#testLeap_5_13 ArithmeticException
  org.joda.time.chrono.TestCopticChronology#testLeap_6_13 ArithmeticException
  org.joda.time.chrono.TestCopticChronology#testSampleDate ArithmeticException
  org.joda.time.chrono.TestCopticChronology#testSampleDateWithZone ArithmeticException
  org.joda.time.chrono.TestEthiopicChronology#testCalendar ArithmeticException
  org.joda.time.chrono.TestEthiopicChronology#testDurationMonth ArithmeticException
  org.joda.time.chrono.TestEthiopicChronology#testDurationYear ArithmeticException
  org.joda.time.chrono.TestEthiopicChronology#testLeap_5_13 ArithmeticException
  org.joda.time.chrono.TestEthiopicChronology#testLeap_6_13 ArithmeticException
  org.joda.time.chrono.TestEthiopicChronology#testSampleDate ArithmeticException
  org.joda.time.chrono.TestEthiopicChronology#testSampleDateWithZone ArithmeticException

Tests run: 4157, Failures: 0, Errors: 123, Skipped: 0

[INFO] ------------------------------------------------------------------------
[INFO] BUILD FAILURE
[INFO] ------------------------------------------------------------------------
[INFO] Total time: 14.682s
[INFO] Finished at: Wed Aug 05 22:38:45 BST 2015
[INFO] Final Memory: 9M/213M
[INFO] ------------------------------------------------------------------------
[ERROR] Failed to execute goal org.apache.maven.plugins:maven-surefire-plugin:2.18.1:test (default-test) on project joda-time: There are test failures.
[ERROR] 
[ERROR] Please refer to /home/perham/Study/LittleDarwin/Cases/joda-time-2.8.1/target/surefire-reports for the individual test results.
[ERROR] -> [Help 1]
[ERROR] 
[ERROR] To see the full stack trace of the errors, re-run Maven with the -e switch.
[ERROR] Re-run Maven using the -X switch to enable full debug logging.
[ERROR] 
[ERROR] For more information about the errors and possible solutions, please read the following articles:
[ERROR] [Help 1] http://cwiki.apache.org/confluence/display/MAVEN/MojoFailureException
