[INFO] Scanning for projects...
[INFO]                                                                         
[INFO] ------------------------------------------------------------------------
[INFO] Building Joda-Time 2.8.1
[INFO] ------------------------------------------------------------------------
[INFO] 
[INFO] --- maven-resources-plugin:2.7:resources (default-resources) @ joda-time ---
[INFO] Using 'UTF-8' encoding to copy filtered resources.
[INFO] Copying 2 resources to META-INF
[INFO] Copying 10 resources
[INFO] 
[INFO] --- maven-compiler-plugin:3.3:compile (default-compile) @ joda-time ---
[INFO] Changes detected - recompiling the module!
[INFO] Compiling 166 source files to /home/perham/Study/LittleDarwin/Cases/joda-time-2.8.1/target/classes
[INFO] 
[INFO] --- exec-maven-plugin:1.4.0:java (compile-tzdb) @ joda-time ---
Writing zoneinfo files
Writing ZoneInfoMap
[INFO] 
[INFO] --- maven-resources-plugin:2.7:testResources (default-testResources) @ joda-time ---
[INFO] Using 'UTF-8' encoding to copy filtered resources.
[INFO] Copying 34 resources
[INFO] 
[INFO] --- maven-compiler-plugin:3.3:testCompile (default-testCompile) @ joda-time ---
[INFO] Nothing to compile - all classes are up to date
[INFO] 
[INFO] --- maven-surefire-plugin:2.18.1:test (default-test) @ joda-time ---
[INFO] Surefire report directory: /home/perham/Study/LittleDarwin/Cases/joda-time-2.8.1/target/surefire-reports

-------------------------------------------------------
 T E S T S
-------------------------------------------------------
Running org.joda.time.TestAllPackages

TestBuddhistChronology.testCalendar

TestCopticChronology.testCalendar

TestEthiopicChronology.testCalendar

TestIslamicChronology.testCalendar

Testing Gregorian chronology over 1000 iterations
100% complete (i=1000)

Testing Julian chronology over 1000 iterations
100% complete (i=1000)
Writing zoneinfo files
Writing ZoneInfoMap
Tests run: 4157, Failures: 0, Errors: 98, Skipped: 0, Time elapsed: 5.452 sec <<< FAILURE! - in org.joda.time.TestAllPackages
testWithFields_RPartial(org.joda.time.TestDateTime_Basics)  Time elapsed: 0.005 sec  <<< ERROR!
java.lang.ArrayIndexOutOfBoundsException: -1
	at org.joda.time.YearMonthDay.getFieldType(YearMonthDay.java:351)
	at org.joda.time.chrono.BasicDayOfMonthDateTimeField.getMaximumValue(BasicDayOfMonthDateTimeField.java:30)
	at org.joda.time.chrono.BaseChronology.validate(BaseChronology.java:207)
	at org.joda.time.base.BasePartial.<init>(BasePartial.java:183)
	at org.joda.time.YearMonthDay.<init>(YearMonthDay.java:288)
	at org.joda.time.YearMonthDay.<init>(YearMonthDay.java:272)
	at org.joda.time.TestDateTime_Basics.testWithFields_RPartial(TestDateTime_Basics.java:917)

testPropertyCompareToYear2(org.joda.time.TestDateTime_Properties)  Time elapsed: 0.001 sec  <<< ERROR!
java.lang.ArrayIndexOutOfBoundsException: -1
	at org.joda.time.YearMonthDay.getFieldType(YearMonthDay.java:351)
	at org.joda.time.chrono.BasicDayOfMonthDateTimeField.getMaximumValue(BasicDayOfMonthDateTimeField.java:30)
	at org.joda.time.chrono.BaseChronology.validate(BaseChronology.java:207)
	at org.joda.time.base.BasePartial.<init>(BasePartial.java:183)
	at org.joda.time.YearMonthDay.<init>(YearMonthDay.java:288)
	at org.joda.time.YearMonthDay.<init>(YearMonthDay.java:272)
	at org.joda.time.TestDateTime_Properties.testPropertyCompareToYear2(TestDateTime_Properties.java:314)

testWithFields_RPartial(org.joda.time.TestDateMidnight_Basics)  Time elapsed: 0.001 sec  <<< ERROR!
java.lang.ArrayIndexOutOfBoundsException: -1
	at org.joda.time.YearMonthDay.getFieldType(YearMonthDay.java:351)
	at org.joda.time.chrono.BasicDayOfMonthDateTimeField.getMaximumValue(BasicDayOfMonthDateTimeField.java:30)
	at org.joda.time.chrono.BaseChronology.validate(BaseChronology.java:207)
	at org.joda.time.base.BasePartial.<init>(BasePartial.java:183)
	at org.joda.time.YearMonthDay.<init>(YearMonthDay.java:288)
	at org.joda.time.YearMonthDay.<init>(YearMonthDay.java:272)
	at org.joda.time.TestDateMidnight_Basics.testWithFields_RPartial(TestDateMidnight_Basics.java:730)

testCompareTo(org.joda.time.TestLocalDateTime_Basics)  Time elapsed: 0 sec  <<< ERROR!
java.lang.ArrayIndexOutOfBoundsException: -1
	at org.joda.time.Partial.getFieldType(Partial.java:369)
	at org.joda.time.chrono.BasicDayOfMonthDateTimeField.getMaximumValue(BasicDayOfMonthDateTimeField.java:30)
	at org.joda.time.chrono.BaseChronology.validate(BaseChronology.java:207)
	at org.joda.time.Partial.<init>(Partial.java:272)
	at org.joda.time.Partial.<init>(Partial.java:177)
	at org.joda.time.TestLocalDateTime_Basics.testCompareTo(TestLocalDateTime_Basics.java:355)

testCompareTo(org.joda.time.TestLocalDate_Basics)  Time elapsed: 0.001 sec  <<< ERROR!
java.lang.ArrayIndexOutOfBoundsException: -1
	at org.joda.time.Partial.getFieldType(Partial.java:369)
	at org.joda.time.chrono.BasicDayOfMonthDateTimeField.getMaximumValue(BasicDayOfMonthDateTimeField.java:30)
	at org.joda.time.chrono.BaseChronology.validate(BaseChronology.java:207)
	at org.joda.time.Partial.<init>(Partial.java:272)
	at org.joda.time.Partial.<init>(Partial.java:177)
	at org.joda.time.TestLocalDate_Basics.testCompareTo(TestLocalDate_Basics.java:348)

testFactoryFieldDifference1(org.joda.time.TestPeriod_Constructors)  Time elapsed: 0.001 sec  <<< ERROR!
java.lang.ArrayIndexOutOfBoundsException: -1
	at org.joda.time.YearMonthDay.getFieldType(YearMonthDay.java:351)
	at org.joda.time.chrono.BasicDayOfMonthDateTimeField.getMaximumValue(BasicDayOfMonthDateTimeField.java:30)
	at org.joda.time.chrono.BaseChronology.validate(BaseChronology.java:207)
	at org.joda.time.base.BasePartial.<init>(BasePartial.java:183)
	at org.joda.time.YearMonthDay.<init>(YearMonthDay.java:288)
	at org.joda.time.YearMonthDay.<init>(YearMonthDay.java:272)
	at org.joda.time.TestPeriod_Constructors.testFactoryFieldDifference1(TestPeriod_Constructors.java:1491)

testFactoryFieldDifference2(org.joda.time.TestPeriod_Constructors)  Time elapsed: 0 sec  <<< ERROR!
java.lang.ArrayIndexOutOfBoundsException: -1
	at org.joda.time.YearMonthDay.getFieldType(YearMonthDay.java:351)
	at org.joda.time.chrono.BasicDayOfMonthDateTimeField.getMaximumValue(BasicDayOfMonthDateTimeField.java:30)
	at org.joda.time.chrono.BaseChronology.validate(BaseChronology.java:207)
	at org.joda.time.base.BasePartial.<init>(BasePartial.java:183)
	at org.joda.time.YearMonthDay.<init>(YearMonthDay.java:288)
	at org.joda.time.YearMonthDay.<init>(YearMonthDay.java:272)
	at org.joda.time.TestPeriod_Constructors.testFactoryFieldDifference2(TestPeriod_Constructors.java:1512)

testFactoryFieldDifference3(org.joda.time.TestPeriod_Constructors)  Time elapsed: 0.001 sec  <<< ERROR!
java.lang.ArrayIndexOutOfBoundsException: -1
	at org.joda.time.YearMonthDay.getFieldType(YearMonthDay.java:351)
	at org.joda.time.chrono.BasicDayOfMonthDateTimeField.getMaximumValue(BasicDayOfMonthDateTimeField.java:30)
	at org.joda.time.chrono.BaseChronology.validate(BaseChronology.java:207)
	at org.joda.time.base.BasePartial.<init>(BasePartial.java:183)
	at org.joda.time.YearMonthDay.<init>(YearMonthDay.java:288)
	at org.joda.time.YearMonthDay.<init>(YearMonthDay.java:272)
	at org.joda.time.TestPeriod_Constructors.testFactoryFieldDifference3(TestPeriod_Constructors.java:1525)

testFactoryFieldDifference4(org.joda.time.TestPeriod_Constructors)  Time elapsed: 0 sec  <<< ERROR!
java.lang.ArrayIndexOutOfBoundsException: -1
	at org.joda.time.YearMonthDay.getFieldType(YearMonthDay.java:351)
	at org.joda.time.chrono.BasicDayOfMonthDateTimeField.getMaximumValue(BasicDayOfMonthDateTimeField.java:30)
	at org.joda.time.chrono.BaseChronology.validate(BaseChronology.java:207)
	at org.joda.time.base.BasePartial.<init>(BasePartial.java:183)
	at org.joda.time.YearMonthDay.<init>(YearMonthDay.java:288)
	at org.joda.time.YearMonthDay.<init>(YearMonthDay.java:272)
	at org.joda.time.TestPeriod_Constructors.testFactoryFieldDifference4(TestPeriod_Constructors.java:1540)

testFactoryFieldDifference5(org.joda.time.TestPeriod_Constructors)  Time elapsed: 0.001 sec  <<< ERROR!
java.lang.ArrayIndexOutOfBoundsException: -1
	at org.joda.time.Partial.getFieldType(Partial.java:369)
	at org.joda.time.chrono.BasicDayOfMonthDateTimeField.getMaximumValue(BasicDayOfMonthDateTimeField.java:30)
	at org.joda.time.chrono.BaseChronology.validate(BaseChronology.java:207)
	at org.joda.time.Partial.<init>(Partial.java:272)
	at org.joda.time.Partial.<init>(Partial.java:177)
	at org.joda.time.TestPeriod_Constructors.testFactoryFieldDifference5(TestPeriod_Constructors.java:1554)

testConstructor_RP_RP1(org.joda.time.TestPeriod_Constructors)  Time elapsed: 0.001 sec  <<< ERROR!
java.lang.ArrayIndexOutOfBoundsException: -1
	at org.joda.time.YearMonthDay.getFieldType(YearMonthDay.java:351)
	at org.joda.time.chrono.BasicDayOfMonthDateTimeField.getMaximumValue(BasicDayOfMonthDateTimeField.java:30)
	at org.joda.time.chrono.BaseChronology.validate(BaseChronology.java:207)
	at org.joda.time.base.BasePartial.<init>(BasePartial.java:183)
	at org.joda.time.YearMonthDay.<init>(YearMonthDay.java:288)
	at org.joda.time.YearMonthDay.<init>(YearMonthDay.java:272)
	at org.joda.time.TestPeriod_Constructors.testConstructor_RP_RP1(TestPeriod_Constructors.java:803)

testConstructor_RP_RP2(org.joda.time.TestPeriod_Constructors)  Time elapsed: 0 sec  <<< ERROR!
java.lang.ArrayIndexOutOfBoundsException: -1
	at org.joda.time.YearMonthDay.getFieldType(YearMonthDay.java:351)
	at org.joda.time.chrono.BasicDayOfMonthDateTimeField.getMaximumValue(BasicDayOfMonthDateTimeField.java:30)
	at org.joda.time.chrono.BaseChronology.validate(BaseChronology.java:207)
	at org.joda.time.base.BasePartial.<init>(BasePartial.java:183)
	at org.joda.time.YearMonthDay.<init>(YearMonthDay.java:288)
	at org.joda.time.YearMonthDay.<init>(YearMonthDay.java:272)
	at org.joda.time.TestPeriod_Constructors.testConstructor_RP_RP2(TestPeriod_Constructors.java:819)

testConstructor_RP_RP3(org.joda.time.TestPeriod_Constructors)  Time elapsed: 0.001 sec  <<< ERROR!
java.lang.ArrayIndexOutOfBoundsException: -1
	at org.joda.time.YearMonthDay.getFieldType(YearMonthDay.java:351)
	at org.joda.time.chrono.BasicDayOfMonthDateTimeField.getMaximumValue(BasicDayOfMonthDateTimeField.java:30)
	at org.joda.time.chrono.BaseChronology.validate(BaseChronology.java:207)
	at org.joda.time.base.BasePartial.<init>(BasePartial.java:183)
	at org.joda.time.YearMonthDay.<init>(YearMonthDay.java:288)
	at org.joda.time.YearMonthDay.<init>(YearMonthDay.java:272)
	at org.joda.time.TestPeriod_Constructors.testConstructor_RP_RP3(TestPeriod_Constructors.java:851)

testConstructor_RP_RP4(org.joda.time.TestPeriod_Constructors)  Time elapsed: 0 sec  <<< ERROR!
java.lang.ArrayIndexOutOfBoundsException: -1
	at org.joda.time.YearMonthDay.getFieldType(YearMonthDay.java:351)
	at org.joda.time.chrono.BasicDayOfMonthDateTimeField.getMaximumValue(BasicDayOfMonthDateTimeField.java:30)
	at org.joda.time.chrono.BaseChronology.validate(BaseChronology.java:207)
	at org.joda.time.base.BasePartial.<init>(BasePartial.java:183)
	at org.joda.time.YearMonthDay.<init>(YearMonthDay.java:288)
	at org.joda.time.YearMonthDay.<init>(YearMonthDay.java:272)
	at org.joda.time.TestPeriod_Constructors.testConstructor_RP_RP4(TestPeriod_Constructors.java:860)

testConstructor_RP_RP6(org.joda.time.TestPeriod_Constructors)  Time elapsed: 0 sec  <<< ERROR!
java.lang.ArrayIndexOutOfBoundsException: -1
	at org.joda.time.YearMonthDay.getFieldType(YearMonthDay.java:351)
	at org.joda.time.chrono.BasicDayOfMonthDateTimeField.getMaximumValue(BasicDayOfMonthDateTimeField.java:30)
	at org.joda.time.chrono.BaseChronology.validate(BaseChronology.java:207)
	at org.joda.time.base.BasePartial.<init>(BasePartial.java:183)
	at org.joda.time.YearMonthDay.<init>(YearMonthDay.java:288)
	at org.joda.time.YearMonthDay.<init>(YearMonthDay.java:272)
	at org.joda.time.TestPeriod_Constructors.testConstructor_RP_RP6(TestPeriod_Constructors.java:880)

testConstructor_RP_RP_PeriodType1(org.joda.time.TestPeriod_Constructors)  Time elapsed: 0.001 sec  <<< ERROR!
java.lang.ArrayIndexOutOfBoundsException: -1
	at org.joda.time.YearMonthDay.getFieldType(YearMonthDay.java:351)
	at org.joda.time.chrono.BasicDayOfMonthDateTimeField.getMaximumValue(BasicDayOfMonthDateTimeField.java:30)
	at org.joda.time.chrono.BaseChronology.validate(BaseChronology.java:207)
	at org.joda.time.base.BasePartial.<init>(BasePartial.java:183)
	at org.joda.time.YearMonthDay.<init>(YearMonthDay.java:288)
	at org.joda.time.YearMonthDay.<init>(YearMonthDay.java:272)
	at org.joda.time.TestPeriod_Constructors.testConstructor_RP_RP_PeriodType1(TestPeriod_Constructors.java:909)

testConstructor_RP_RP_PeriodType2(org.joda.time.TestPeriod_Constructors)  Time elapsed: 0.001 sec  <<< ERROR!
java.lang.ArrayIndexOutOfBoundsException: -1
	at org.joda.time.YearMonthDay.getFieldType(YearMonthDay.java:351)
	at org.joda.time.chrono.BasicDayOfMonthDateTimeField.getMaximumValue(BasicDayOfMonthDateTimeField.java:30)
	at org.joda.time.chrono.BaseChronology.validate(BaseChronology.java:207)
	at org.joda.time.base.BasePartial.<init>(BasePartial.java:183)
	at org.joda.time.YearMonthDay.<init>(YearMonthDay.java:288)
	at org.joda.time.YearMonthDay.<init>(YearMonthDay.java:272)
	at org.joda.time.TestPeriod_Constructors.testConstructor_RP_RP_PeriodType2(TestPeriod_Constructors.java:925)

testConstructor_RP_RP_PeriodType3(org.joda.time.TestPeriod_Constructors)  Time elapsed: 0 sec  <<< ERROR!
java.lang.ArrayIndexOutOfBoundsException: -1
	at org.joda.time.YearMonthDay.getFieldType(YearMonthDay.java:351)
	at org.joda.time.chrono.BasicDayOfMonthDateTimeField.getMaximumValue(BasicDayOfMonthDateTimeField.java:30)
	at org.joda.time.chrono.BaseChronology.validate(BaseChronology.java:207)
	at org.joda.time.base.BasePartial.<init>(BasePartial.java:183)
	at org.joda.time.YearMonthDay.<init>(YearMonthDay.java:288)
	at org.joda.time.YearMonthDay.<init>(YearMonthDay.java:272)
	at org.joda.time.TestPeriod_Constructors.testConstructor_RP_RP_PeriodType3(TestPeriod_Constructors.java:957)

testConstructor_RP_RP_PeriodType4(org.joda.time.TestPeriod_Constructors)  Time elapsed: 0.001 sec  <<< ERROR!
java.lang.ArrayIndexOutOfBoundsException: -1
	at org.joda.time.YearMonthDay.getFieldType(YearMonthDay.java:351)
	at org.joda.time.chrono.BasicDayOfMonthDateTimeField.getMaximumValue(BasicDayOfMonthDateTimeField.java:30)
	at org.joda.time.chrono.BaseChronology.validate(BaseChronology.java:207)
	at org.joda.time.base.BasePartial.<init>(BasePartial.java:183)
	at org.joda.time.YearMonthDay.<init>(YearMonthDay.java:288)
	at org.joda.time.YearMonthDay.<init>(YearMonthDay.java:272)
	at org.joda.time.TestPeriod_Constructors.testConstructor_RP_RP_PeriodType4(TestPeriod_Constructors.java:966)

testConstructor_RP_RP_PeriodType6(org.joda.time.TestPeriod_Constructors)  Time elapsed: 0.001 sec  <<< ERROR!
java.lang.ArrayIndexOutOfBoundsException: -1
	at org.joda.time.YearMonthDay.getFieldType(YearMonthDay.java:351)
	at org.joda.time.chrono.BasicDayOfMonthDateTimeField.getMaximumValue(BasicDayOfMonthDateTimeField.java:30)
	at org.joda.time.chrono.BaseChronology.validate(BaseChronology.java:207)
	at org.joda.time.base.BasePartial.<init>(BasePartial.java:183)
	at org.joda.time.YearMonthDay.<init>(YearMonthDay.java:288)
	at org.joda.time.YearMonthDay.<init>(YearMonthDay.java:272)
	at org.joda.time.TestPeriod_Constructors.testConstructor_RP_RP_PeriodType6(TestPeriod_Constructors.java:986)

testFactory_between_RPartial(org.joda.time.TestBaseSingleFieldPeriod)  Time elapsed: 0.001 sec  <<< ERROR!
java.lang.ArrayIndexOutOfBoundsException: -1
	at org.joda.time.YearMonthDay.getFieldType(YearMonthDay.java:351)
	at org.joda.time.chrono.BasicDayOfMonthDateTimeField.getMaximumValue(BasicDayOfMonthDateTimeField.java:30)
	at org.joda.time.chrono.BaseChronology.validate(BaseChronology.java:207)
	at org.joda.time.base.BasePartial.<init>(BasePartial.java:183)
	at org.joda.time.YearMonthDay.<init>(YearMonthDay.java:288)
	at org.joda.time.YearMonthDay.<init>(YearMonthDay.java:272)
	at org.joda.time.TestBaseSingleFieldPeriod.testFactory_between_RPartial(TestBaseSingleFieldPeriod.java:87)

testFactory_yearsBetween_RPartial(org.joda.time.TestYears)  Time elapsed: 0 sec  <<< ERROR!
java.lang.ArrayIndexOutOfBoundsException: -1
	at org.joda.time.YearMonthDay.getFieldType(YearMonthDay.java:351)
	at org.joda.time.chrono.BasicDayOfMonthDateTimeField.getMaximumValue(BasicDayOfMonthDateTimeField.java:30)
	at org.joda.time.chrono.BaseChronology.validate(BaseChronology.java:207)
	at org.joda.time.base.BasePartial.<init>(BasePartial.java:183)
	at org.joda.time.YearMonthDay.<init>(YearMonthDay.java:288)
	at org.joda.time.YearMonthDay.<init>(YearMonthDay.java:272)
	at org.joda.time.TestYears.testFactory_yearsBetween_RPartial(TestYears.java:93)

testFactory_monthsBetween_RPartial_LocalDate(org.joda.time.TestMonths)  Time elapsed: 0 sec  <<< ERROR!
java.lang.ArrayIndexOutOfBoundsException: -1
	at org.joda.time.YearMonthDay.getFieldType(YearMonthDay.java:351)
	at org.joda.time.chrono.BasicDayOfMonthDateTimeField.getMaximumValue(BasicDayOfMonthDateTimeField.java:30)
	at org.joda.time.chrono.BaseChronology.validate(BaseChronology.java:207)
	at org.joda.time.base.BasePartial.<init>(BasePartial.java:183)
	at org.joda.time.YearMonthDay.<init>(YearMonthDay.java:288)
	at org.joda.time.YearMonthDay.<init>(YearMonthDay.java:272)
	at org.joda.time.TestMonths.testFactory_monthsBetween_RPartial_LocalDate(TestMonths.java:112)

testFactory_weeksBetween_RPartial(org.joda.time.TestWeeks)  Time elapsed: 0 sec  <<< ERROR!
java.lang.ArrayIndexOutOfBoundsException: -1
	at org.joda.time.YearMonthDay.getFieldType(YearMonthDay.java:351)
	at org.joda.time.chrono.BasicDayOfMonthDateTimeField.getMaximumValue(BasicDayOfMonthDateTimeField.java:30)
	at org.joda.time.chrono.BaseChronology.validate(BaseChronology.java:207)
	at org.joda.time.base.BasePartial.<init>(BasePartial.java:183)
	at org.joda.time.YearMonthDay.<init>(YearMonthDay.java:288)
	at org.joda.time.YearMonthDay.<init>(YearMonthDay.java:272)
	at org.joda.time.TestWeeks.testFactory_weeksBetween_RPartial(TestWeeks.java:93)

testFactory_daysBetween_RPartial_LocalDate(org.joda.time.TestDays)  Time elapsed: 0.001 sec  <<< ERROR!
java.lang.ArrayIndexOutOfBoundsException: -1
	at org.joda.time.YearMonthDay.getFieldType(YearMonthDay.java:351)
	at org.joda.time.chrono.BasicDayOfMonthDateTimeField.getMaximumValue(BasicDayOfMonthDateTimeField.java:30)
	at org.joda.time.chrono.BaseChronology.validate(BaseChronology.java:207)
	at org.joda.time.base.BasePartial.<init>(BasePartial.java:183)
	at org.joda.time.YearMonthDay.<init>(YearMonthDay.java:288)
	at org.joda.time.YearMonthDay.<init>(YearMonthDay.java:272)
	at org.joda.time.TestDays.testFactory_daysBetween_RPartial_LocalDate(TestDays.java:102)

testToString(org.joda.time.TestYearMonthDay_Basics)  Time elapsed: 0.001 sec  <<< ERROR!
java.lang.ArrayIndexOutOfBoundsException: -1
	at org.joda.time.YearMonthDay.getFieldType(YearMonthDay.java:351)
	at org.joda.time.chrono.BasicDayOfMonthDateTimeField.getMaximumValue(BasicDayOfMonthDateTimeField.java:30)
	at org.joda.time.chrono.BaseChronology.validate(BaseChronology.java:207)
	at org.joda.time.base.BasePartial.<init>(BasePartial.java:183)
	at org.joda.time.YearMonthDay.<init>(YearMonthDay.java:288)
	at org.joda.time.YearMonthDay.<init>(YearMonthDay.java:272)
	at org.joda.time.TestYearMonthDay_Basics.testToString(TestYearMonthDay_Basics.java:798)

testWithField1(org.joda.time.TestYearMonthDay_Basics)  Time elapsed: 0 sec  <<< ERROR!
java.lang.ArrayIndexOutOfBoundsException: -1
	at org.joda.time.YearMonthDay.getFieldType(YearMonthDay.java:351)
	at org.joda.time.chrono.BasicDayOfMonthDateTimeField.getMaximumValue(BasicDayOfMonthDateTimeField.java:30)
	at org.joda.time.chrono.BaseChronology.validate(BaseChronology.java:207)
	at org.joda.time.base.BasePartial.<init>(BasePartial.java:183)
	at org.joda.time.YearMonthDay.<init>(YearMonthDay.java:288)
	at org.joda.time.YearMonthDay.<init>(YearMonthDay.java:272)
	at org.joda.time.TestYearMonthDay_Basics.testWithField1(TestYearMonthDay_Basics.java:375)

testWithField2(org.joda.time.TestYearMonthDay_Basics)  Time elapsed: 0.001 sec  <<< ERROR!
java.lang.ArrayIndexOutOfBoundsException: -1
	at org.joda.time.YearMonthDay.getFieldType(YearMonthDay.java:351)
	at org.joda.time.chrono.BasicDayOfMonthDateTimeField.getMaximumValue(BasicDayOfMonthDateTimeField.java:30)
	at org.joda.time.chrono.BaseChronology.validate(BaseChronology.java:207)
	at org.joda.time.base.BasePartial.<init>(BasePartial.java:183)
	at org.joda.time.YearMonthDay.<init>(YearMonthDay.java:288)
	at org.joda.time.YearMonthDay.<init>(YearMonthDay.java:272)
	at org.joda.time.TestYearMonthDay_Basics.testWithField2(TestYearMonthDay_Basics.java:383)

testWithFieldAdded1(org.joda.time.TestYearMonthDay_Basics)  Time elapsed: 0 sec  <<< ERROR!
java.lang.ArrayIndexOutOfBoundsException: -1
	at org.joda.time.YearMonthDay.getFieldType(YearMonthDay.java:351)
	at org.joda.time.chrono.BasicDayOfMonthDateTimeField.getMaximumValue(BasicDayOfMonthDateTimeField.java:30)
	at org.joda.time.chrono.BaseChronology.validate(BaseChronology.java:207)
	at org.joda.time.base.BasePartial.<init>(BasePartial.java:183)
	at org.joda.time.YearMonthDay.<init>(YearMonthDay.java:288)
	at org.joda.time.YearMonthDay.<init>(YearMonthDay.java:272)
	at org.joda.time.TestYearMonthDay_Basics.testWithFieldAdded1(TestYearMonthDay_Basics.java:407)

testWithFieldAdded2(org.joda.time.TestYearMonthDay_Basics)  Time elapsed: 0.001 sec  <<< ERROR!
java.lang.ArrayIndexOutOfBoundsException: -1
	at org.joda.time.YearMonthDay.getFieldType(YearMonthDay.java:351)
	at org.joda.time.chrono.BasicDayOfMonthDateTimeField.getMaximumValue(BasicDayOfMonthDateTimeField.java:30)
	at org.joda.time.chrono.BaseChronology.validate(BaseChronology.java:207)
	at org.joda.time.base.BasePartial.<init>(BasePartial.java:183)
	at org.joda.time.YearMonthDay.<init>(YearMonthDay.java:288)
	at org.joda.time.YearMonthDay.<init>(YearMonthDay.java:272)
	at org.joda.time.TestYearMonthDay_Basics.testWithFieldAdded2(TestYearMonthDay_Basics.java:415)

testWithFieldAdded3(org.joda.time.TestYearMonthDay_Basics)  Time elapsed: 0 sec  <<< ERROR!
java.lang.ArrayIndexOutOfBoundsException: -1
	at org.joda.time.YearMonthDay.getFieldType(YearMonthDay.java:351)
	at org.joda.time.chrono.BasicDayOfMonthDateTimeField.getMaximumValue(BasicDayOfMonthDateTimeField.java:30)
	at org.joda.time.chrono.BaseChronology.validate(BaseChronology.java:207)
	at org.joda.time.base.BasePartial.<init>(BasePartial.java:183)
	at org.joda.time.YearMonthDay.<init>(YearMonthDay.java:288)
	at org.joda.time.YearMonthDay.<init>(YearMonthDay.java:272)
	at org.joda.time.TestYearMonthDay_Basics.testWithFieldAdded3(TestYearMonthDay_Basics.java:423)

testWithFieldAdded4(org.joda.time.TestYearMonthDay_Basics)  Time elapsed: 0.001 sec  <<< ERROR!
java.lang.ArrayIndexOutOfBoundsException: -1
	at org.joda.time.YearMonthDay.getFieldType(YearMonthDay.java:351)
	at org.joda.time.chrono.BasicDayOfMonthDateTimeField.getMaximumValue(BasicDayOfMonthDateTimeField.java:30)
	at org.joda.time.chrono.BaseChronology.validate(BaseChronology.java:207)
	at org.joda.time.base.BasePartial.<init>(BasePartial.java:183)
	at org.joda.time.YearMonthDay.<init>(YearMonthDay.java:288)
	at org.joda.time.YearMonthDay.<init>(YearMonthDay.java:272)
	at org.joda.time.TestYearMonthDay_Basics.testWithFieldAdded4(TestYearMonthDay_Basics.java:431)

testWithers(org.joda.time.TestYearMonthDay_Basics)  Time elapsed: 0.001 sec  <<< ERROR!
java.lang.ArrayIndexOutOfBoundsException: -1
	at org.joda.time.YearMonthDay.getFieldType(YearMonthDay.java:351)
	at org.joda.time.chrono.BasicDayOfMonthDateTimeField.getMaximumValue(BasicDayOfMonthDateTimeField.java:30)
	at org.joda.time.chrono.BaseChronology.validate(BaseChronology.java:207)
	at org.joda.time.base.BasePartial.<init>(BasePartial.java:183)
	at org.joda.time.YearMonthDay.<init>(YearMonthDay.java:288)
	at org.joda.time.YearMonthDay.<init>(YearMonthDay.java:272)
	at org.joda.time.TestYearMonthDay_Basics.testWithers(TestYearMonthDay_Basics.java:745)

testToString_String(org.joda.time.TestYearMonthDay_Basics)  Time elapsed: 0 sec  <<< ERROR!
java.lang.ArrayIndexOutOfBoundsException: -1
	at org.joda.time.YearMonthDay.getFieldType(YearMonthDay.java:351)
	at org.joda.time.chrono.BasicDayOfMonthDateTimeField.getMaximumValue(BasicDayOfMonthDateTimeField.java:30)
	at org.joda.time.chrono.BaseChronology.validate(BaseChronology.java:207)
	at org.joda.time.base.BasePartial.<init>(BasePartial.java:183)
	at org.joda.time.YearMonthDay.<init>(YearMonthDay.java:288)
	at org.joda.time.YearMonthDay.<init>(YearMonthDay.java:272)
	at org.joda.time.TestYearMonthDay_Basics.testToString_String(TestYearMonthDay_Basics.java:804)

testToString_String_Locale(org.joda.time.TestYearMonthDay_Basics)  Time elapsed: 0.001 sec  <<< ERROR!
java.lang.ArrayIndexOutOfBoundsException: -1
	at org.joda.time.YearMonthDay.getFieldType(YearMonthDay.java:351)
	at org.joda.time.chrono.BasicDayOfMonthDateTimeField.getMaximumValue(BasicDayOfMonthDateTimeField.java:30)
	at org.joda.time.chrono.BaseChronology.validate(BaseChronology.java:207)
	at org.joda.time.base.BasePartial.<init>(BasePartial.java:183)
	at org.joda.time.YearMonthDay.<init>(YearMonthDay.java:288)
	at org.joda.time.YearMonthDay.<init>(YearMonthDay.java:272)
	at org.joda.time.TestYearMonthDay_Basics.testToString_String_Locale(TestYearMonthDay_Basics.java:811)

testToString_DTFormatter(org.joda.time.TestYearMonthDay_Basics)  Time elapsed: 0 sec  <<< ERROR!
java.lang.ArrayIndexOutOfBoundsException: -1
	at org.joda.time.YearMonthDay.getFieldType(YearMonthDay.java:351)
	at org.joda.time.chrono.BasicDayOfMonthDateTimeField.getMaximumValue(BasicDayOfMonthDateTimeField.java:30)
	at org.joda.time.chrono.BaseChronology.validate(BaseChronology.java:207)
	at org.joda.time.base.BasePartial.<init>(BasePartial.java:183)
	at org.joda.time.YearMonthDay.<init>(YearMonthDay.java:288)
	at org.joda.time.YearMonthDay.<init>(YearMonthDay.java:272)
	at org.joda.time.TestYearMonthDay_Basics.testToString_DTFormatter(TestYearMonthDay_Basics.java:821)

testEqualsHashCode(org.joda.time.TestYearMonthDay_Basics)  Time elapsed: 0.001 sec  <<< ERROR!
java.lang.ArrayIndexOutOfBoundsException: -1
	at org.joda.time.YearMonthDay.getFieldType(YearMonthDay.java:351)
	at org.joda.time.chrono.BasicDayOfMonthDateTimeField.getMaximumValue(BasicDayOfMonthDateTimeField.java:30)
	at org.joda.time.chrono.BaseChronology.validate(BaseChronology.java:207)
	at org.joda.time.base.BasePartial.<init>(BasePartial.java:183)
	at org.joda.time.YearMonthDay.<init>(YearMonthDay.java:288)
	at org.joda.time.YearMonthDay.<init>(YearMonthDay.java:272)
	at org.joda.time.TestYearMonthDay_Basics.testEqualsHashCode(TestYearMonthDay_Basics.java:189)

testCompareTo(org.joda.time.TestYearMonthDay_Basics)  Time elapsed: 0 sec  <<< ERROR!
java.lang.ArrayIndexOutOfBoundsException: -1
	at org.joda.time.YearMonthDay.getFieldType(YearMonthDay.java:351)
	at org.joda.time.chrono.BasicDayOfMonthDateTimeField.getMaximumValue(BasicDayOfMonthDateTimeField.java:30)
	at org.joda.time.chrono.BaseChronology.validate(BaseChronology.java:207)
	at org.joda.time.base.BasePartial.<init>(BasePartial.java:183)
	at org.joda.time.YearMonthDay.<init>(YearMonthDay.java:288)
	at org.joda.time.YearMonthDay.<init>(YearMonthDay.java:272)
	at org.joda.time.TestYearMonthDay_Basics.testCompareTo(TestYearMonthDay_Basics.java:220)

testProperty(org.joda.time.TestYearMonthDay_Basics)  Time elapsed: 0 sec  <<< ERROR!
java.lang.ArrayIndexOutOfBoundsException: -1
	at org.joda.time.YearMonthDay.getFieldType(YearMonthDay.java:351)
	at org.joda.time.chrono.BasicDayOfMonthDateTimeField.getMaximumValue(BasicDayOfMonthDateTimeField.java:30)
	at org.joda.time.chrono.BaseChronology.validate(BaseChronology.java:207)
	at org.joda.time.base.BasePartial.<init>(BasePartial.java:183)
	at org.joda.time.YearMonthDay.<init>(YearMonthDay.java:288)
	at org.joda.time.YearMonthDay.<init>(YearMonthDay.java:272)
	at org.joda.time.TestYearMonthDay_Basics.testProperty(TestYearMonthDay_Basics.java:761)

testWithField3(org.joda.time.TestYearMonthDay_Basics)  Time elapsed: 0.001 sec  <<< ERROR!
java.lang.ArrayIndexOutOfBoundsException: -1
	at org.joda.time.YearMonthDay.getFieldType(YearMonthDay.java:351)
	at org.joda.time.chrono.BasicDayOfMonthDateTimeField.getMaximumValue(BasicDayOfMonthDateTimeField.java:30)
	at org.joda.time.chrono.BaseChronology.validate(BaseChronology.java:207)
	at org.joda.time.base.BasePartial.<init>(BasePartial.java:183)
	at org.joda.time.YearMonthDay.<init>(YearMonthDay.java:288)
	at org.joda.time.YearMonthDay.<init>(YearMonthDay.java:272)
	at org.joda.time.TestYearMonthDay_Basics.testWithField3(TestYearMonthDay_Basics.java:391)

testWithField4(org.joda.time.TestYearMonthDay_Basics)  Time elapsed: 0 sec  <<< ERROR!
java.lang.ArrayIndexOutOfBoundsException: -1
	at org.joda.time.YearMonthDay.getFieldType(YearMonthDay.java:351)
	at org.joda.time.chrono.BasicDayOfMonthDateTimeField.getMaximumValue(BasicDayOfMonthDateTimeField.java:30)
	at org.joda.time.chrono.BaseChronology.validate(BaseChronology.java:207)
	at org.joda.time.base.BasePartial.<init>(BasePartial.java:183)
	at org.joda.time.YearMonthDay.<init>(YearMonthDay.java:288)
	at org.joda.time.YearMonthDay.<init>(YearMonthDay.java:272)
	at org.joda.time.TestYearMonthDay_Basics.testWithField4(TestYearMonthDay_Basics.java:399)

testIsEqual_YMD(org.joda.time.TestYearMonthDay_Basics)  Time elapsed: 0 sec  <<< ERROR!
java.lang.ArrayIndexOutOfBoundsException: -1
	at org.joda.time.YearMonthDay.getFieldType(YearMonthDay.java:351)
	at org.joda.time.chrono.BasicDayOfMonthDateTimeField.getMaximumValue(BasicDayOfMonthDateTimeField.java:30)
	at org.joda.time.chrono.BaseChronology.validate(BaseChronology.java:207)
	at org.joda.time.base.BasePartial.<init>(BasePartial.java:183)
	at org.joda.time.YearMonthDay.<init>(YearMonthDay.java:288)
	at org.joda.time.YearMonthDay.<init>(YearMonthDay.java:272)
	at org.joda.time.TestYearMonthDay_Basics.testIsEqual_YMD(TestYearMonthDay_Basics.java:268)

testIsBefore_YMD(org.joda.time.TestYearMonthDay_Basics)  Time elapsed: 0 sec  <<< ERROR!
java.lang.ArrayIndexOutOfBoundsException: -1
	at org.joda.time.YearMonthDay.getFieldType(YearMonthDay.java:351)
	at org.joda.time.chrono.BasicDayOfMonthDateTimeField.getMaximumValue(BasicDayOfMonthDateTimeField.java:30)
	at org.joda.time.chrono.BaseChronology.validate(BaseChronology.java:207)
	at org.joda.time.base.BasePartial.<init>(BasePartial.java:183)
	at org.joda.time.YearMonthDay.<init>(YearMonthDay.java:288)
	at org.joda.time.YearMonthDay.<init>(YearMonthDay.java:272)
	at org.joda.time.TestYearMonthDay_Basics.testIsBefore_YMD(TestYearMonthDay_Basics.java:292)

testIsAfter_YMD(org.joda.time.TestYearMonthDay_Basics)  Time elapsed: 0.001 sec  <<< ERROR!
java.lang.ArrayIndexOutOfBoundsException: -1
	at org.joda.time.YearMonthDay.getFieldType(YearMonthDay.java:351)
	at org.joda.time.chrono.BasicDayOfMonthDateTimeField.getMaximumValue(BasicDayOfMonthDateTimeField.java:30)
	at org.joda.time.chrono.BaseChronology.validate(BaseChronology.java:207)
	at org.joda.time.base.BasePartial.<init>(BasePartial.java:183)
	at org.joda.time.YearMonthDay.<init>(YearMonthDay.java:288)
	at org.joda.time.YearMonthDay.<init>(YearMonthDay.java:272)
	at org.joda.time.TestYearMonthDay_Basics.testIsAfter_YMD(TestYearMonthDay_Basics.java:316)

testWithChronologyRetainFields_invalidInNewChrono(org.joda.time.TestYearMonthDay_Basics)  Time elapsed: 0 sec  <<< ERROR!
java.lang.ArrayIndexOutOfBoundsException: -1
	at org.joda.time.YearMonthDay.getFieldType(YearMonthDay.java:351)
	at org.joda.time.chrono.BasicDayOfMonthDateTimeField.getMaximumValue(BasicDayOfMonthDateTimeField.java:30)
	at org.joda.time.chrono.BaseChronology.validate(BaseChronology.java:207)
	at org.joda.time.base.BasePartial.<init>(BasePartial.java:183)
	at org.joda.time.YearMonthDay.<init>(YearMonthDay.java:288)
	at org.joda.time.TestYearMonthDay_Basics.testWithChronologyRetainFields_invalidInNewChrono(TestYearMonthDay_Basics.java:364)

testWithChronologyRetainFields_nullChrono(org.joda.time.TestYearMonthDay_Basics)  Time elapsed: 0.001 sec  <<< ERROR!
java.lang.ArrayIndexOutOfBoundsException: -1
	at org.joda.time.YearMonthDay.getFieldType(YearMonthDay.java:351)
	at org.joda.time.chrono.BasicDayOfMonthDateTimeField.getMaximumValue(BasicDayOfMonthDateTimeField.java:30)
	at org.joda.time.chrono.BaseChronology.validate(BaseChronology.java:207)
	at org.joda.time.YearMonthDay.withChronologyRetainFields(YearMonthDay.java:387)
	at org.joda.time.TestYearMonthDay_Basics.testWithChronologyRetainFields_nullChrono(TestYearMonthDay_Basics.java:356)

testWithFieldAdded5(org.joda.time.TestYearMonthDay_Basics)  Time elapsed: 0 sec  <<< ERROR!
java.lang.ArrayIndexOutOfBoundsException: -1
	at org.joda.time.YearMonthDay.getFieldType(YearMonthDay.java:351)
	at org.joda.time.chrono.BasicDayOfMonthDateTimeField.getMaximumValue(BasicDayOfMonthDateTimeField.java:30)
	at org.joda.time.chrono.BaseChronology.validate(BaseChronology.java:207)
	at org.joda.time.base.BasePartial.<init>(BasePartial.java:183)
	at org.joda.time.YearMonthDay.<init>(YearMonthDay.java:288)
	at org.joda.time.YearMonthDay.<init>(YearMonthDay.java:272)
	at org.joda.time.TestYearMonthDay_Basics.testWithFieldAdded5(TestYearMonthDay_Basics.java:437)

testToDateTime_nullRI(org.joda.time.TestYearMonthDay_Basics)  Time elapsed: 0.001 sec  <<< ERROR!
java.lang.ArrayIndexOutOfBoundsException: -1
	at org.joda.time.YearMonthDay.getFieldType(YearMonthDay.java:351)
	at org.joda.time.chrono.BasicDayOfMonthDateTimeField.getMaximumValue(BasicDayOfMonthDateTimeField.java:30)
	at org.joda.time.chrono.BaseChronology.validate(BaseChronology.java:207)
	at org.joda.time.base.BasePartial.<init>(BasePartial.java:183)
	at org.joda.time.YearMonthDay.<init>(YearMonthDay.java:288)
	at org.joda.time.YearMonthDay.<init>(YearMonthDay.java:272)
	at org.joda.time.TestYearMonthDay_Basics.testToDateTime_nullRI(TestYearMonthDay_Basics.java:698)

testConstructor_int_int_int(org.joda.time.TestYearMonthDay_Constructors)  Time elapsed: 0 sec  <<< ERROR!
java.lang.ArrayIndexOutOfBoundsException: -1
	at org.joda.time.YearMonthDay.getFieldType(YearMonthDay.java:351)
	at org.joda.time.chrono.BasicDayOfMonthDateTimeField.getMaximumValue(BasicDayOfMonthDateTimeField.java:30)
	at org.joda.time.chrono.BaseChronology.validate(BaseChronology.java:207)
	at org.joda.time.base.BasePartial.<init>(BasePartial.java:183)
	at org.joda.time.YearMonthDay.<init>(YearMonthDay.java:288)
	at org.joda.time.YearMonthDay.<init>(YearMonthDay.java:272)
	at org.joda.time.TestYearMonthDay_Constructors.testConstructor_int_int_int(TestYearMonthDay_Constructors.java:377)

testConstructor_int_int_int_Chronology(org.joda.time.TestYearMonthDay_Constructors)  Time elapsed: 0.001 sec  <<< ERROR!
java.lang.ArrayIndexOutOfBoundsException: -1
	at org.joda.time.YearMonthDay.getFieldType(YearMonthDay.java:351)
	at org.joda.time.chrono.BasicDayOfMonthDateTimeField.getMaximumValue(BasicDayOfMonthDateTimeField.java:30)
	at org.joda.time.chrono.BaseChronology.validate(BaseChronology.java:207)
	at org.joda.time.base.BasePartial.<init>(BasePartial.java:183)
	at org.joda.time.YearMonthDay.<init>(YearMonthDay.java:288)
	at org.joda.time.TestYearMonthDay_Constructors.testConstructor_int_int_int_Chronology(TestYearMonthDay_Constructors.java:417)

testConstructor_int_int_int_nullChronology(org.joda.time.TestYearMonthDay_Constructors)  Time elapsed: 0 sec  <<< ERROR!
java.lang.ArrayIndexOutOfBoundsException: -1
	at org.joda.time.YearMonthDay.getFieldType(YearMonthDay.java:351)
	at org.joda.time.chrono.BasicDayOfMonthDateTimeField.getMaximumValue(BasicDayOfMonthDateTimeField.java:30)
	at org.joda.time.chrono.BaseChronology.validate(BaseChronology.java:207)
	at org.joda.time.base.BasePartial.<init>(BasePartial.java:183)
	at org.joda.time.YearMonthDay.<init>(YearMonthDay.java:288)
	at org.joda.time.TestYearMonthDay_Constructors.testConstructor_int_int_int_nullChronology(TestYearMonthDay_Constructors.java:457)

testFactory_FromDateFields(org.joda.time.TestYearMonthDay_Constructors)  Time elapsed: 0.001 sec  <<< ERROR!
java.lang.ArrayIndexOutOfBoundsException: -1
	at org.joda.time.YearMonthDay.getFieldType(YearMonthDay.java:351)
	at org.joda.time.chrono.BasicDayOfMonthDateTimeField.getMaximumValue(BasicDayOfMonthDateTimeField.java:30)
	at org.joda.time.chrono.BaseChronology.validate(BaseChronology.java:207)
	at org.joda.time.base.BasePartial.<init>(BasePartial.java:183)
	at org.joda.time.YearMonthDay.<init>(YearMonthDay.java:288)
	at org.joda.time.YearMonthDay.<init>(YearMonthDay.java:272)
	at org.joda.time.TestYearMonthDay_Constructors.testFactory_FromDateFields(TestYearMonthDay_Constructors.java:97)

testFactory_FromCalendarFields(org.joda.time.TestYearMonthDay_Constructors)  Time elapsed: 0 sec  <<< ERROR!
java.lang.ArrayIndexOutOfBoundsException: -1
	at org.joda.time.YearMonthDay.getFieldType(YearMonthDay.java:351)
	at org.joda.time.chrono.BasicDayOfMonthDateTimeField.getMaximumValue(BasicDayOfMonthDateTimeField.java:30)
	at org.joda.time.chrono.BaseChronology.validate(BaseChronology.java:207)
	at org.joda.time.base.BasePartial.<init>(BasePartial.java:183)
	at org.joda.time.YearMonthDay.<init>(YearMonthDay.java:288)
	at org.joda.time.YearMonthDay.<init>(YearMonthDay.java:272)
	at org.joda.time.TestYearMonthDay_Constructors.testFactory_FromCalendarFields(TestYearMonthDay_Constructors.java:85)

testPropertyAddYear(org.joda.time.TestYearMonthDay_Properties)  Time elapsed: 0 sec  <<< ERROR!
java.lang.ArrayIndexOutOfBoundsException: -1
	at org.joda.time.YearMonthDay.getFieldType(YearMonthDay.java:351)
	at org.joda.time.chrono.BasicDayOfMonthDateTimeField.getMaximumValue(BasicDayOfMonthDateTimeField.java:30)
	at org.joda.time.chrono.BaseChronology.validate(BaseChronology.java:207)
	at org.joda.time.base.BasePartial.<init>(BasePartial.java:183)
	at org.joda.time.YearMonthDay.<init>(YearMonthDay.java:288)
	at org.joda.time.YearMonthDay.<init>(YearMonthDay.java:272)
	at org.joda.time.TestYearMonthDay_Properties.testPropertyAddYear(TestYearMonthDay_Properties.java:112)

testPropertyAddWrapFieldYear(org.joda.time.TestYearMonthDay_Properties)  Time elapsed: 0.001 sec  <<< ERROR!
java.lang.ArrayIndexOutOfBoundsException: -1
	at org.joda.time.YearMonthDay.getFieldType(YearMonthDay.java:351)
	at org.joda.time.chrono.BasicDayOfMonthDateTimeField.getMaximumValue(BasicDayOfMonthDateTimeField.java:30)
	at org.joda.time.chrono.BaseChronology.validate(BaseChronology.java:207)
	at org.joda.time.base.BasePartial.<init>(BasePartial.java:183)
	at org.joda.time.YearMonthDay.<init>(YearMonthDay.java:288)
	at org.joda.time.YearMonthDay.<init>(YearMonthDay.java:272)
	at org.joda.time.TestYearMonthDay_Properties.testPropertyAddWrapFieldYear(TestYearMonthDay_Properties.java:143)

testPropertySetYear(org.joda.time.TestYearMonthDay_Properties)  Time elapsed: 0 sec  <<< ERROR!
java.lang.ArrayIndexOutOfBoundsException: -1
	at org.joda.time.YearMonthDay.getFieldType(YearMonthDay.java:351)
	at org.joda.time.chrono.BasicDayOfMonthDateTimeField.getMaximumValue(BasicDayOfMonthDateTimeField.java:30)
	at org.joda.time.chrono.BaseChronology.validate(BaseChronology.java:207)
	at org.joda.time.base.BasePartial.<init>(BasePartial.java:183)
	at org.joda.time.YearMonthDay.<init>(YearMonthDay.java:288)
	at org.joda.time.YearMonthDay.<init>(YearMonthDay.java:272)
	at org.joda.time.TestYearMonthDay_Properties.testPropertySetYear(TestYearMonthDay_Properties.java:159)

testPropertySetTextYear(org.joda.time.TestYearMonthDay_Properties)  Time elapsed: 0.002 sec  <<< ERROR!
java.lang.ArrayIndexOutOfBoundsException: -1
	at org.joda.time.YearMonthDay.getFieldType(YearMonthDay.java:351)
	at org.joda.time.chrono.BasicDayOfMonthDateTimeField.getMaximumValue(BasicDayOfMonthDateTimeField.java:30)
	at org.joda.time.chrono.BaseChronology.validate(BaseChronology.java:207)
	at org.joda.time.base.BasePartial.<init>(BasePartial.java:183)
	at org.joda.time.YearMonthDay.<init>(YearMonthDay.java:288)
	at org.joda.time.YearMonthDay.<init>(YearMonthDay.java:272)
	at org.joda.time.TestYearMonthDay_Properties.testPropertySetTextYear(TestYearMonthDay_Properties.java:166)

testPropertyGetYear(org.joda.time.TestYearMonthDay_Properties)  Time elapsed: 0 sec  <<< ERROR!
java.lang.ArrayIndexOutOfBoundsException: -1
	at org.joda.time.YearMonthDay.getFieldType(YearMonthDay.java:351)
	at org.joda.time.chrono.BasicDayOfMonthDateTimeField.getMaximumValue(BasicDayOfMonthDateTimeField.java:30)
	at org.joda.time.chrono.BaseChronology.validate(BaseChronology.java:207)
	at org.joda.time.base.BasePartial.<init>(BasePartial.java:183)
	at org.joda.time.YearMonthDay.<init>(YearMonthDay.java:288)
	at org.joda.time.YearMonthDay.<init>(YearMonthDay.java:272)
	at org.joda.time.TestYearMonthDay_Properties.testPropertyGetYear(TestYearMonthDay_Properties.java:85)

testPropertyGetMaxMinValuesYear(org.joda.time.TestYearMonthDay_Properties)  Time elapsed: 0 sec  <<< ERROR!
java.lang.ArrayIndexOutOfBoundsException: -1
	at org.joda.time.YearMonthDay.getFieldType(YearMonthDay.java:351)
	at org.joda.time.chrono.BasicDayOfMonthDateTimeField.getMaximumValue(BasicDayOfMonthDateTimeField.java:30)
	at org.joda.time.chrono.BaseChronology.validate(BaseChronology.java:207)
	at org.joda.time.base.BasePartial.<init>(BasePartial.java:183)
	at org.joda.time.YearMonthDay.<init>(YearMonthDay.java:288)
	at org.joda.time.YearMonthDay.<init>(YearMonthDay.java:272)
	at org.joda.time.TestYearMonthDay_Properties.testPropertyGetMaxMinValuesYear(TestYearMonthDay_Properties.java:104)

testPropertyAddMonth(org.joda.time.TestYearMonthDay_Properties)  Time elapsed: 0.001 sec  <<< ERROR!
java.lang.ArrayIndexOutOfBoundsException: -1
	at org.joda.time.YearMonthDay.getFieldType(YearMonthDay.java:351)
	at org.joda.time.chrono.BasicDayOfMonthDateTimeField.getMaximumValue(BasicDayOfMonthDateTimeField.java:30)
	at org.joda.time.chrono.BaseChronology.validate(BaseChronology.java:207)
	at org.joda.time.base.BasePartial.<init>(BasePartial.java:183)
	at org.joda.time.YearMonthDay.<init>(YearMonthDay.java:288)
	at org.joda.time.YearMonthDay.<init>(YearMonthDay.java:272)
	at org.joda.time.TestYearMonthDay_Properties.testPropertyAddMonth(TestYearMonthDay_Properties.java:226)

testPropertyAddWrapFieldMonth(org.joda.time.TestYearMonthDay_Properties)  Time elapsed: 0 sec  <<< ERROR!
java.lang.ArrayIndexOutOfBoundsException: -1
	at org.joda.time.YearMonthDay.getFieldType(YearMonthDay.java:351)
	at org.joda.time.chrono.BasicDayOfMonthDateTimeField.getMaximumValue(BasicDayOfMonthDateTimeField.java:30)
	at org.joda.time.chrono.BaseChronology.validate(BaseChronology.java:207)
	at org.joda.time.base.BasePartial.<init>(BasePartial.java:183)
	at org.joda.time.YearMonthDay.<init>(YearMonthDay.java:288)
	at org.joda.time.YearMonthDay.<init>(YearMonthDay.java:272)
	at org.joda.time.TestYearMonthDay_Properties.testPropertyAddWrapFieldMonth(TestYearMonthDay_Properties.java:256)

testPropertySetMonth(org.joda.time.TestYearMonthDay_Properties)  Time elapsed: 0 sec  <<< ERROR!
java.lang.ArrayIndexOutOfBoundsException: -1
	at org.joda.time.YearMonthDay.getFieldType(YearMonthDay.java:351)
	at org.joda.time.chrono.BasicDayOfMonthDateTimeField.getMaximumValue(BasicDayOfMonthDateTimeField.java:30)
	at org.joda.time.chrono.BaseChronology.validate(BaseChronology.java:207)
	at org.joda.time.base.BasePartial.<init>(BasePartial.java:183)
	at org.joda.time.YearMonthDay.<init>(YearMonthDay.java:288)
	at org.joda.time.YearMonthDay.<init>(YearMonthDay.java:272)
	at org.joda.time.TestYearMonthDay_Properties.testPropertySetMonth(TestYearMonthDay_Properties.java:283)

testPropertySetTextMonth(org.joda.time.TestYearMonthDay_Properties)  Time elapsed: 0 sec  <<< ERROR!
java.lang.ArrayIndexOutOfBoundsException: -1
	at org.joda.time.YearMonthDay.getFieldType(YearMonthDay.java:351)
	at org.joda.time.chrono.BasicDayOfMonthDateTimeField.getMaximumValue(BasicDayOfMonthDateTimeField.java:30)
	at org.joda.time.chrono.BaseChronology.validate(BaseChronology.java:207)
	at org.joda.time.base.BasePartial.<init>(BasePartial.java:183)
	at org.joda.time.YearMonthDay.<init>(YearMonthDay.java:288)
	at org.joda.time.YearMonthDay.<init>(YearMonthDay.java:272)
	at org.joda.time.TestYearMonthDay_Properties.testPropertySetTextMonth(TestYearMonthDay_Properties.java:303)

testPropertyAddDay(org.joda.time.TestYearMonthDay_Properties)  Time elapsed: 0 sec  <<< ERROR!
java.lang.ArrayIndexOutOfBoundsException: -1
	at org.joda.time.YearMonthDay.getFieldType(YearMonthDay.java:351)
	at org.joda.time.chrono.BasicDayOfMonthDateTimeField.getMaximumValue(BasicDayOfMonthDateTimeField.java:30)
	at org.joda.time.chrono.BaseChronology.validate(BaseChronology.java:207)
	at org.joda.time.base.BasePartial.<init>(BasePartial.java:183)
	at org.joda.time.YearMonthDay.<init>(YearMonthDay.java:288)
	at org.joda.time.YearMonthDay.<init>(YearMonthDay.java:272)
	at org.joda.time.TestYearMonthDay_Properties.testPropertyAddDay(TestYearMonthDay_Properties.java:374)

testPropertyAddWrapFieldDay(org.joda.time.TestYearMonthDay_Properties)  Time elapsed: 0.001 sec  <<< ERROR!
java.lang.ArrayIndexOutOfBoundsException: -1
	at org.joda.time.YearMonthDay.getFieldType(YearMonthDay.java:351)
	at org.joda.time.chrono.BasicDayOfMonthDateTimeField.getMaximumValue(BasicDayOfMonthDateTimeField.java:30)
	at org.joda.time.chrono.BaseChronology.validate(BaseChronology.java:207)
	at org.joda.time.base.BasePartial.<init>(BasePartial.java:183)
	at org.joda.time.YearMonthDay.<init>(YearMonthDay.java:288)
	at org.joda.time.YearMonthDay.<init>(YearMonthDay.java:272)
	at org.joda.time.TestYearMonthDay_Properties.testPropertyAddWrapFieldDay(TestYearMonthDay_Properties.java:411)

testPropertySetDay(org.joda.time.TestYearMonthDay_Properties)  Time elapsed: 0 sec  <<< ERROR!
java.lang.ArrayIndexOutOfBoundsException: -1
	at org.joda.time.YearMonthDay.getFieldType(YearMonthDay.java:351)
	at org.joda.time.chrono.BasicDayOfMonthDateTimeField.getMaximumValue(BasicDayOfMonthDateTimeField.java:30)
	at org.joda.time.chrono.BaseChronology.validate(BaseChronology.java:207)
	at org.joda.time.base.BasePartial.<init>(BasePartial.java:183)
	at org.joda.time.YearMonthDay.<init>(YearMonthDay.java:288)
	at org.joda.time.YearMonthDay.<init>(YearMonthDay.java:272)
	at org.joda.time.TestYearMonthDay_Properties.testPropertySetDay(TestYearMonthDay_Properties.java:437)

testPropertySetTextDay(org.joda.time.TestYearMonthDay_Properties)  Time elapsed: 0.001 sec  <<< ERROR!
java.lang.ArrayIndexOutOfBoundsException: -1
	at org.joda.time.YearMonthDay.getFieldType(YearMonthDay.java:351)
	at org.joda.time.chrono.BasicDayOfMonthDateTimeField.getMaximumValue(BasicDayOfMonthDateTimeField.java:30)
	at org.joda.time.chrono.BaseChronology.validate(BaseChronology.java:207)
	at org.joda.time.base.BasePartial.<init>(BasePartial.java:183)
	at org.joda.time.YearMonthDay.<init>(YearMonthDay.java:288)
	at org.joda.time.YearMonthDay.<init>(YearMonthDay.java:272)
	at org.joda.time.TestYearMonthDay_Properties.testPropertySetTextDay(TestYearMonthDay_Properties.java:453)

testPropertyGetMonth(org.joda.time.TestYearMonthDay_Properties)  Time elapsed: 0 sec  <<< ERROR!
java.lang.ArrayIndexOutOfBoundsException: -1
	at org.joda.time.YearMonthDay.getFieldType(YearMonthDay.java:351)
	at org.joda.time.chrono.BasicDayOfMonthDateTimeField.getMaximumValue(BasicDayOfMonthDateTimeField.java:30)
	at org.joda.time.chrono.BaseChronology.validate(BaseChronology.java:207)
	at org.joda.time.base.BasePartial.<init>(BasePartial.java:183)
	at org.joda.time.YearMonthDay.<init>(YearMonthDay.java:288)
	at org.joda.time.YearMonthDay.<init>(YearMonthDay.java:272)
	at org.joda.time.TestYearMonthDay_Properties.testPropertyGetMonth(TestYearMonthDay_Properties.java:196)

testPropertyGetMaxMinValuesMonth(org.joda.time.TestYearMonthDay_Properties)  Time elapsed: 0.001 sec  <<< ERROR!
java.lang.ArrayIndexOutOfBoundsException: -1
	at org.joda.time.YearMonthDay.getFieldType(YearMonthDay.java:351)
	at org.joda.time.chrono.BasicDayOfMonthDateTimeField.getMaximumValue(BasicDayOfMonthDateTimeField.java:30)
	at org.joda.time.chrono.BaseChronology.validate(BaseChronology.java:207)
	at org.joda.time.base.BasePartial.<init>(BasePartial.java:183)
	at org.joda.time.YearMonthDay.<init>(YearMonthDay.java:288)
	at org.joda.time.YearMonthDay.<init>(YearMonthDay.java:272)
	at org.joda.time.TestYearMonthDay_Properties.testPropertyGetMaxMinValuesMonth(TestYearMonthDay_Properties.java:218)

testPropertyWithMaximumValueDayOfMonth(org.joda.time.TestYearMonthDay_Properties)  Time elapsed: 0 sec  <<< ERROR!
java.lang.ArrayIndexOutOfBoundsException: -1
	at org.joda.time.YearMonthDay.getFieldType(YearMonthDay.java:351)
	at org.joda.time.chrono.BasicDayOfMonthDateTimeField.getMaximumValue(BasicDayOfMonthDateTimeField.java:30)
	at org.joda.time.chrono.BaseChronology.validate(BaseChronology.java:207)
	at org.joda.time.base.BasePartial.<init>(BasePartial.java:183)
	at org.joda.time.YearMonthDay.<init>(YearMonthDay.java:288)
	at org.joda.time.YearMonthDay.<init>(YearMonthDay.java:272)
	at org.joda.time.TestYearMonthDay_Properties.testPropertyWithMaximumValueDayOfMonth(TestYearMonthDay_Properties.java:460)

testPropertyWithMinimumValueDayOfMonth(org.joda.time.TestYearMonthDay_Properties)  Time elapsed: 0.001 sec  <<< ERROR!
java.lang.ArrayIndexOutOfBoundsException: -1
	at org.joda.time.YearMonthDay.getFieldType(YearMonthDay.java:351)
	at org.joda.time.chrono.BasicDayOfMonthDateTimeField.getMaximumValue(BasicDayOfMonthDateTimeField.java:30)
	at org.joda.time.chrono.BaseChronology.validate(BaseChronology.java:207)
	at org.joda.time.base.BasePartial.<init>(BasePartial.java:183)
	at org.joda.time.YearMonthDay.<init>(YearMonthDay.java:288)
	at org.joda.time.YearMonthDay.<init>(YearMonthDay.java:272)
	at org.joda.time.TestYearMonthDay_Properties.testPropertyWithMinimumValueDayOfMonth(TestYearMonthDay_Properties.java:467)

testPropertyGetDay(org.joda.time.TestYearMonthDay_Properties)  Time elapsed: 0 sec  <<< ERROR!
java.lang.ArrayIndexOutOfBoundsException: -1
	at org.joda.time.YearMonthDay.getFieldType(YearMonthDay.java:351)
	at org.joda.time.chrono.BasicDayOfMonthDateTimeField.getMaximumValue(BasicDayOfMonthDateTimeField.java:30)
	at org.joda.time.chrono.BaseChronology.validate(BaseChronology.java:207)
	at org.joda.time.base.BasePartial.<init>(BasePartial.java:183)
	at org.joda.time.YearMonthDay.<init>(YearMonthDay.java:288)
	at org.joda.time.YearMonthDay.<init>(YearMonthDay.java:272)
	at org.joda.time.TestYearMonthDay_Properties.testPropertyGetDay(TestYearMonthDay_Properties.java:341)

testPropertyGetMaxMinValuesDay(org.joda.time.TestYearMonthDay_Properties)  Time elapsed: 0.001 sec  <<< ERROR!
java.lang.ArrayIndexOutOfBoundsException: -1
	at org.joda.time.YearMonthDay.getFieldType(YearMonthDay.java:351)
	at org.joda.time.chrono.BasicDayOfMonthDateTimeField.getMaximumValue(BasicDayOfMonthDateTimeField.java:30)
	at org.joda.time.chrono.BaseChronology.validate(BaseChronology.java:207)
	at org.joda.time.base.BasePartial.<init>(BasePartial.java:183)
	at org.joda.time.YearMonthDay.<init>(YearMonthDay.java:288)
	at org.joda.time.YearMonthDay.<init>(YearMonthDay.java:272)
	at org.joda.time.TestYearMonthDay_Properties.testPropertyGetMaxMinValuesDay(TestYearMonthDay_Properties.java:360)

testPropertyEquals(org.joda.time.TestYearMonthDay_Properties)  Time elapsed: 0 sec  <<< ERROR!
java.lang.ArrayIndexOutOfBoundsException: -1
	at org.joda.time.YearMonthDay.getFieldType(YearMonthDay.java:351)
	at org.joda.time.chrono.BasicDayOfMonthDateTimeField.getMaximumValue(BasicDayOfMonthDateTimeField.java:30)
	at org.joda.time.chrono.BaseChronology.validate(BaseChronology.java:207)
	at org.joda.time.base.BasePartial.<init>(BasePartial.java:183)
	at org.joda.time.YearMonthDay.<init>(YearMonthDay.java:288)
	at org.joda.time.YearMonthDay.<init>(YearMonthDay.java:272)
	at org.joda.time.TestYearMonthDay_Properties.testPropertyEquals(TestYearMonthDay_Properties.java:496)

testPropertyHashCode(org.joda.time.TestYearMonthDay_Properties)  Time elapsed: 0.001 sec  <<< ERROR!
java.lang.ArrayIndexOutOfBoundsException: -1
	at org.joda.time.YearMonthDay.getFieldType(YearMonthDay.java:351)
	at org.joda.time.chrono.BasicDayOfMonthDateTimeField.getMaximumValue(BasicDayOfMonthDateTimeField.java:30)
	at org.joda.time.chrono.BaseChronology.validate(BaseChronology.java:207)
	at org.joda.time.base.BasePartial.<init>(BasePartial.java:183)
	at org.joda.time.YearMonthDay.<init>(YearMonthDay.java:288)
	at org.joda.time.YearMonthDay.<init>(YearMonthDay.java:272)
	at org.joda.time.TestYearMonthDay_Properties.testPropertyHashCode(TestYearMonthDay_Properties.java:521)

testCompareTo(org.joda.time.TestYearMonth_Basics)  Time elapsed: 0.001 sec  <<< ERROR!
java.lang.ArrayIndexOutOfBoundsException: -1
	at org.joda.time.Partial.getFieldType(Partial.java:369)
	at org.joda.time.chrono.BasicDayOfMonthDateTimeField.getMaximumValue(BasicDayOfMonthDateTimeField.java:30)
	at org.joda.time.chrono.BaseChronology.validate(BaseChronology.java:207)
	at org.joda.time.Partial.<init>(Partial.java:272)
	at org.joda.time.Partial.with(Partial.java:495)
	at org.joda.time.TestYearMonth_Basics.testCompareTo(TestYearMonth_Basics.java:250)

testCompareTo(org.joda.time.TestMonthDay_Basics)  Time elapsed: 0 sec  <<< ERROR!
java.lang.ArrayIndexOutOfBoundsException: -1
	at org.joda.time.Partial.getFieldType(Partial.java:369)
	at org.joda.time.chrono.BasicDayOfMonthDateTimeField.getMaximumValue(BasicDayOfMonthDateTimeField.java:30)
	at org.joda.time.chrono.BaseChronology.validate(BaseChronology.java:207)
	at org.joda.time.Partial.<init>(Partial.java:272)
	at org.joda.time.Partial.with(Partial.java:495)
	at org.joda.time.TestMonthDay_Basics.testCompareTo(TestMonthDay_Basics.java:255)

testWith3c(org.joda.time.TestPartial_Basics)  Time elapsed: 0.001 sec  <<< ERROR!
java.lang.ArrayIndexOutOfBoundsException: -1
	at org.joda.time.Partial.getFieldType(Partial.java:369)
	at org.joda.time.chrono.BasicDayOfMonthDateTimeField.getMaximumValue(BasicDayOfMonthDateTimeField.java:30)
	at org.joda.time.chrono.BaseChronology.validate(BaseChronology.java:207)
	at org.joda.time.Partial.<init>(Partial.java:272)
	at org.joda.time.Partial.with(Partial.java:495)
	at org.joda.time.TestPartial_Basics.testWith3c(TestPartial_Basics.java:403)

testGetFormatter1(org.joda.time.TestPartial_Basics)  Time elapsed: 0.001 sec  <<< ERROR!
java.lang.ArrayIndexOutOfBoundsException: -1
	at org.joda.time.Partial.getFieldType(Partial.java:369)
	at org.joda.time.chrono.BasicDayOfMonthDateTimeField.getMaximumValue(BasicDayOfMonthDateTimeField.java:30)
	at org.joda.time.chrono.BaseChronology.validate(BaseChronology.java:207)
	at org.joda.time.Partial.<init>(Partial.java:272)
	at org.joda.time.Partial.with(Partial.java:495)
	at org.joda.time.TestPartial_Basics.testGetFormatter1(TestPartial_Basics.java:806)

testGetFormatter3(org.joda.time.TestPartial_Basics)  Time elapsed: 0.001 sec  <<< ERROR!
java.lang.ArrayIndexOutOfBoundsException: -1
	at org.joda.time.Partial.getFieldType(Partial.java:369)
	at org.joda.time.chrono.BasicDayOfMonthDateTimeField.getMaximumValue(BasicDayOfMonthDateTimeField.java:30)
	at org.joda.time.chrono.BaseChronology.validate(BaseChronology.java:207)
	at org.joda.time.Partial.<init>(Partial.java:272)
	at org.joda.time.Partial.with(Partial.java:495)
	at org.joda.time.TestPartial_Basics.testGetFormatter3(TestPartial_Basics.java:829)

testToString3(org.joda.time.TestPartial_Basics)  Time elapsed: 0.001 sec  <<< ERROR!
java.lang.ArrayIndexOutOfBoundsException: -1
	at org.joda.time.Partial.getFieldType(Partial.java:369)
	at org.joda.time.chrono.BasicDayOfMonthDateTimeField.getMaximumValue(BasicDayOfMonthDateTimeField.java:30)
	at org.joda.time.chrono.BaseChronology.validate(BaseChronology.java:207)
	at org.joda.time.Partial.<init>(Partial.java:272)
	at org.joda.time.Partial.with(Partial.java:495)
	at org.joda.time.TestPartial_Basics.testToString3(TestPartial_Basics.java:851)

testToString4(org.joda.time.TestPartial_Basics)  Time elapsed: 0.001 sec  <<< ERROR!
java.lang.ArrayIndexOutOfBoundsException: -1
	at org.joda.time.Partial.getFieldType(Partial.java:369)
	at org.joda.time.chrono.BasicDayOfMonthDateTimeField.getMaximumValue(BasicDayOfMonthDateTimeField.java:30)
	at org.joda.time.chrono.BaseChronology.validate(BaseChronology.java:207)
	at org.joda.time.Partial.<init>(Partial.java:272)
	at org.joda.time.Partial.with(Partial.java:495)
	at org.joda.time.TestPartial_Basics.testToString4(TestPartial_Basics.java:862)

testConstructor_Partial(org.joda.time.TestPartial_Constructors)  Time elapsed: 0 sec  <<< ERROR!
java.lang.ArrayIndexOutOfBoundsException: -1
	at org.joda.time.YearMonthDay.getFieldType(YearMonthDay.java:351)
	at org.joda.time.chrono.BasicDayOfMonthDateTimeField.getMaximumValue(BasicDayOfMonthDateTimeField.java:30)
	at org.joda.time.chrono.BaseChronology.validate(BaseChronology.java:207)
	at org.joda.time.base.BasePartial.<init>(BasePartial.java:183)
	at org.joda.time.YearMonthDay.<init>(YearMonthDay.java:288)
	at org.joda.time.TestPartial_Constructors.testConstructor_Partial(TestPartial_Constructors.java:443)

testIsContiguous_RP(org.joda.time.TestDateTimeUtils)  Time elapsed: 0 sec  <<< ERROR!
java.lang.ArrayIndexOutOfBoundsException: -1
	at org.joda.time.YearMonthDay.getFieldType(YearMonthDay.java:351)
	at org.joda.time.chrono.BasicDayOfMonthDateTimeField.getMaximumValue(BasicDayOfMonthDateTimeField.java:30)
	at org.joda.time.chrono.BaseChronology.validate(BaseChronology.java:207)
	at org.joda.time.base.BasePartial.<init>(BasePartial.java:183)
	at org.joda.time.YearMonthDay.<init>(YearMonthDay.java:288)
	at org.joda.time.YearMonthDay.<init>(YearMonthDay.java:272)
	at org.joda.time.TestDateTimeUtils.testIsContiguous_RP(TestDateTimeUtils.java:430)

testIsContiguous_RP_GJChronology(org.joda.time.TestDateTimeUtils)  Time elapsed: 0.002 sec  <<< ERROR!
java.lang.ArrayIndexOutOfBoundsException: -1
	at org.joda.time.Partial.getFieldType(Partial.java:369)
	at org.joda.time.chrono.BasicDayOfMonthDateTimeField.getMaximumValue(BasicDayOfMonthDateTimeField.java:30)
	at org.joda.time.chrono.BaseChronology.validate(BaseChronology.java:207)
	at org.joda.time.Partial.<init>(Partial.java:161)
	at org.joda.time.Partial.<init>(Partial.java:139)
	at org.joda.time.TestDateTimeUtils.testIsContiguous_RP_GJChronology(TestDateTimeUtils.java:466)

testReadablePartialValidate(org.joda.time.TestIllegalFieldValueException)  Time elapsed: 0 sec  <<< ERROR!
java.lang.ArrayIndexOutOfBoundsException: -1
	at org.joda.time.YearMonthDay.getFieldType(YearMonthDay.java:351)
	at org.joda.time.chrono.BasicDayOfMonthDateTimeField.getMaximumValue(BasicDayOfMonthDateTimeField.java:30)
	at org.joda.time.chrono.BaseChronology.validate(BaseChronology.java:207)
	at org.joda.time.base.BasePartial.<init>(BasePartial.java:183)
	at org.joda.time.YearMonthDay.<init>(YearMonthDay.java:288)
	at org.joda.time.YearMonthDay.<init>(YearMonthDay.java:272)
	at org.joda.time.TestIllegalFieldValueException.testReadablePartialValidate(TestIllegalFieldValueException.java:291)

testMaximumValue(org.joda.time.chrono.TestGregorianChronology)  Time elapsed: 0.001 sec  <<< ERROR!
java.lang.ArrayIndexOutOfBoundsException

testCutoverAddYears(org.joda.time.chrono.TestISOChronology)  Time elapsed: 0 sec  <<< ERROR!
java.lang.ArrayIndexOutOfBoundsException

testGetPartialValues(org.joda.time.convert.TestReadablePartialConverter)  Time elapsed: 0.001 sec  <<< ERROR!
java.lang.ArrayIndexOutOfBoundsException

testFormat_date_partial(org.joda.time.format.TestISODateTimeFormat)  Time elapsed: 0 sec  <<< ERROR!
java.lang.ArrayIndexOutOfBoundsException: -1
	at org.joda.time.Partial.getFieldType(Partial.java:369)
	at org.joda.time.chrono.BasicDayOfMonthDateTimeField.getMaximumValue(BasicDayOfMonthDateTimeField.java:30)
	at org.joda.time.chrono.BaseChronology.validate(BaseChronology.java:207)
	at org.joda.time.Partial.<init>(Partial.java:272)
	at org.joda.time.Partial.<init>(Partial.java:177)
	at org.joda.time.format.TestISODateTimeFormat.testFormat_date_partial(TestISODateTimeFormat.java:108)

testForFields_calBased_YMD(org.joda.time.format.TestISODateTimeFormat_Fields)  Time elapsed: 0 sec  <<< ERROR!
java.lang.ArrayIndexOutOfBoundsException: -1
	at org.joda.time.Partial.getFieldType(Partial.java:369)
	at org.joda.time.chrono.BasicDayOfMonthDateTimeField.getMaximumValue(BasicDayOfMonthDateTimeField.java:30)
	at org.joda.time.chrono.BaseChronology.validate(BaseChronology.java:207)
	at org.joda.time.Partial.<init>(Partial.java:272)
	at org.joda.time.Partial.<init>(Partial.java:177)
	at org.joda.time.format.TestISODateTimeFormat_Fields.testForFields_calBased_YMD(TestISODateTimeFormat_Fields.java:83)

testForFields_calBased_YMD_unmodifiable(org.joda.time.format.TestISODateTimeFormat_Fields)  Time elapsed: 0.001 sec  <<< ERROR!
java.lang.ArrayIndexOutOfBoundsException: -1
	at org.joda.time.Partial.getFieldType(Partial.java:369)
	at org.joda.time.chrono.BasicDayOfMonthDateTimeField.getMaximumValue(BasicDayOfMonthDateTimeField.java:30)
	at org.joda.time.chrono.BaseChronology.validate(BaseChronology.java:207)
	at org.joda.time.Partial.<init>(Partial.java:272)
	at org.joda.time.Partial.<init>(Partial.java:177)
	at org.joda.time.format.TestISODateTimeFormat_Fields.testForFields_calBased_YMD_unmodifiable(TestISODateTimeFormat_Fields.java:112)

testForFields_calBased_YMD_duplicates(org.joda.time.format.TestISODateTimeFormat_Fields)  Time elapsed: 0 sec  <<< ERROR!
java.lang.ArrayIndexOutOfBoundsException: -1
	at org.joda.time.Partial.getFieldType(Partial.java:369)
	at org.joda.time.chrono.BasicDayOfMonthDateTimeField.getMaximumValue(BasicDayOfMonthDateTimeField.java:30)
	at org.joda.time.chrono.BaseChronology.validate(BaseChronology.java:207)
	at org.joda.time.Partial.<init>(Partial.java:272)
	at org.joda.time.Partial.<init>(Partial.java:177)
	at org.joda.time.format.TestISODateTimeFormat_Fields.testForFields_calBased_YMD_duplicates(TestISODateTimeFormat_Fields.java:137)

testForFields_calBased_D(org.joda.time.format.TestISODateTimeFormat_Fields)  Time elapsed: 0 sec  <<< ERROR!
java.lang.ArrayIndexOutOfBoundsException: -1
	at org.joda.time.Partial.getFieldType(Partial.java:369)
	at org.joda.time.chrono.BasicDayOfMonthDateTimeField.getMaximumValue(BasicDayOfMonthDateTimeField.java:30)
	at org.joda.time.chrono.BaseChronology.validate(BaseChronology.java:207)
	at org.joda.time.Partial.<init>(Partial.java:272)
	at org.joda.time.Partial.<init>(Partial.java:177)
	at org.joda.time.format.TestISODateTimeFormat_Fields.testForFields_calBased_D(TestISODateTimeFormat_Fields.java:208)

testForFields_calBased_YD(org.joda.time.format.TestISODateTimeFormat_Fields)  Time elapsed: 0 sec  <<< ERROR!
java.lang.ArrayIndexOutOfBoundsException: -1
	at org.joda.time.Partial.getFieldType(Partial.java:369)
	at org.joda.time.chrono.BasicDayOfMonthDateTimeField.getMaximumValue(BasicDayOfMonthDateTimeField.java:30)
	at org.joda.time.chrono.BaseChronology.validate(BaseChronology.java:207)
	at org.joda.time.Partial.<init>(Partial.java:272)
	at org.joda.time.Partial.<init>(Partial.java:177)
	at org.joda.time.format.TestISODateTimeFormat_Fields.testForFields_calBased_YD(TestISODateTimeFormat_Fields.java:292)

testForFields_datetime_YMDH(org.joda.time.format.TestISODateTimeFormat_Fields)  Time elapsed: 0.001 sec  <<< ERROR!
java.lang.ArrayIndexOutOfBoundsException: -1
	at org.joda.time.Partial.getFieldType(Partial.java:369)
	at org.joda.time.chrono.BasicDayOfMonthDateTimeField.getMaximumValue(BasicDayOfMonthDateTimeField.java:30)
	at org.joda.time.chrono.BaseChronology.validate(BaseChronology.java:207)
	at org.joda.time.Partial.<init>(Partial.java:272)
	at org.joda.time.Partial.<init>(Partial.java:177)
	at org.joda.time.format.TestISODateTimeFormat_Fields.testForFields_datetime_YMDH(TestISODateTimeFormat_Fields.java:1044)

testForFields_datetime_DH(org.joda.time.format.TestISODateTimeFormat_Fields)  Time elapsed: 0 sec  <<< ERROR!
java.lang.ArrayIndexOutOfBoundsException: -1
	at org.joda.time.Partial.getFieldType(Partial.java:369)
	at org.joda.time.chrono.BasicDayOfMonthDateTimeField.getMaximumValue(BasicDayOfMonthDateTimeField.java:30)
	at org.joda.time.chrono.BaseChronology.validate(BaseChronology.java:207)
	at org.joda.time.Partial.<init>(Partial.java:272)
	at org.joda.time.Partial.<init>(Partial.java:177)
	at org.joda.time.format.TestISODateTimeFormat_Fields.testForFields_datetime_DH(TestISODateTimeFormat_Fields.java:1072)

testForFields_datetime_DM(org.joda.time.format.TestISODateTimeFormat_Fields)  Time elapsed: 0 sec  <<< ERROR!
java.lang.ArrayIndexOutOfBoundsException: -1
	at org.joda.time.Partial.getFieldType(Partial.java:369)
	at org.joda.time.chrono.BasicDayOfMonthDateTimeField.getMaximumValue(BasicDayOfMonthDateTimeField.java:30)
	at org.joda.time.chrono.BaseChronology.validate(BaseChronology.java:207)
	at org.joda.time.Partial.<init>(Partial.java:272)
	at org.joda.time.Partial.<init>(Partial.java:177)
	at org.joda.time.format.TestISODateTimeFormat_Fields.testForFields_datetime_DM(TestISODateTimeFormat_Fields.java:1130)


Results :

Tests in error: 
  org.joda.time.TestBaseSingleFieldPeriod#testFactory_between_RPartial ArrayIndexOutOfBoundsException
  org.joda.time.TestDateMidnight_Basics#testWithFields_RPartial ArrayIndexOutOfBoundsException
  org.joda.time.TestDateTimeUtils#testIsContiguous_RP ArrayIndexOutOfBoundsException
  org.joda.time.TestDateTimeUtils#testIsContiguous_RP_GJChronology ArrayIndexOutOfBoundsException
  org.joda.time.TestDateTime_Basics#testWithFields_RPartial ArrayIndexOutOfBoundsException
  org.joda.time.TestDateTime_Properties#testPropertyCompareToYear2 ArrayIndexOutOfBoundsException
  org.joda.time.TestDays#testFactory_daysBetween_RPartial_LocalDate ArrayIndexOutOfBoundsException
  org.joda.time.TestIllegalFieldValueException#testReadablePartialValidate ArrayIndexOutOfBoundsException
  org.joda.time.TestLocalDateTime_Basics#testCompareTo ArrayIndexOutOfBoundsException
  org.joda.time.TestLocalDate_Basics#testCompareTo ArrayIndexOutOfBoundsException
  org.joda.time.TestMonthDay_Basics#testCompareTo ArrayIndexOutOfBoundsException
  org.joda.time.TestMonths#testFactory_monthsBetween_RPartial_LocalDate ArrayIndexOutOfBoundsException
  org.joda.time.TestPartial_Basics#testGetFormatter1 ArrayIndexOutOfBoundsException
  org.joda.time.TestPartial_Basics#testGetFormatter3 ArrayIndexOutOfBoundsException
  org.joda.time.TestPartial_Basics#testToString3 ArrayIndexOutOfBoundsException ...
  org.joda.time.TestPartial_Basics#testToString4 ArrayIndexOutOfBoundsException ...
  org.joda.time.TestPartial_Basics#testWith3c ArrayIndexOutOfBoundsException -1
  org.joda.time.TestPartial_Constructors#testConstructor_Partial ArrayIndexOutOfBoundsException
  org.joda.time.TestPeriod_Constructors#testConstructor_RP_RP1 ArrayIndexOutOfBoundsException
  org.joda.time.TestPeriod_Constructors#testConstructor_RP_RP2 ArrayIndexOutOfBoundsException
  org.joda.time.TestPeriod_Constructors#testConstructor_RP_RP3 ArrayIndexOutOfBoundsException
  org.joda.time.TestPeriod_Constructors#testConstructor_RP_RP4 ArrayIndexOutOfBoundsException
  org.joda.time.TestPeriod_Constructors#testConstructor_RP_RP6 ArrayIndexOutOfBoundsException
  org.joda.time.TestPeriod_Constructors#testConstructor_RP_RP_PeriodType1 ArrayIndexOutOfBoundsException
  org.joda.time.TestPeriod_Constructors#testConstructor_RP_RP_PeriodType2 ArrayIndexOutOfBoundsException
  org.joda.time.TestPeriod_Constructors#testConstructor_RP_RP_PeriodType3 ArrayIndexOutOfBoundsException
  org.joda.time.TestPeriod_Constructors#testConstructor_RP_RP_PeriodType4 ArrayIndexOutOfBoundsException
  org.joda.time.TestPeriod_Constructors#testConstructor_RP_RP_PeriodType6 ArrayIndexOutOfBoundsException
  org.joda.time.TestPeriod_Constructors#testFactoryFieldDifference1 ArrayIndexOutOfBoundsException
  org.joda.time.TestPeriod_Constructors#testFactoryFieldDifference2 ArrayIndexOutOfBoundsException
  org.joda.time.TestPeriod_Constructors#testFactoryFieldDifference3 ArrayIndexOutOfBoundsException
  org.joda.time.TestPeriod_Constructors#testFactoryFieldDifference4 ArrayIndexOutOfBoundsException
  org.joda.time.TestPeriod_Constructors#testFactoryFieldDifference5 ArrayIndexOutOfBoundsException
  org.joda.time.TestWeeks#testFactory_weeksBetween_RPartial ArrayIndexOutOfBoundsException
  org.joda.time.TestYearMonthDay_Basics#testCompareTo ArrayIndexOutOfBoundsException
  org.joda.time.TestYearMonthDay_Basics#testEqualsHashCode ArrayIndexOutOfBoundsException
  org.joda.time.TestYearMonthDay_Basics#testIsAfter_YMD ArrayIndexOutOfBoundsException
  org.joda.time.TestYearMonthDay_Basics#testIsBefore_YMD ArrayIndexOutOfBoundsException
  org.joda.time.TestYearMonthDay_Basics#testIsEqual_YMD ArrayIndexOutOfBoundsException
  org.joda.time.TestYearMonthDay_Basics#testProperty ArrayIndexOutOfBoundsException
  org.joda.time.TestYearMonthDay_Basics#testToDateTime_nullRI ArrayIndexOutOfBoundsException
  org.joda.time.TestYearMonthDay_Basics#testToString ArrayIndexOutOfBoundsException
  org.joda.time.TestYearMonthDay_Basics#testToString_DTFormatter ArrayIndexOutOfBoundsException
  org.joda.time.TestYearMonthDay_Basics#testToString_String ArrayIndexOutOfBoundsException
  org.joda.time.TestYearMonthDay_Basics#testToString_String_Locale ArrayIndexOutOfBoundsException
  org.joda.time.TestYearMonthDay_Basics#testWithChronologyRetainFields_invalidInNewChrono ArrayIndexOutOfBoundsException
  org.joda.time.TestYearMonthDay_Basics#testWithChronologyRetainFields_nullChrono ArrayIndexOutOfBoundsException
  org.joda.time.TestYearMonthDay_Basics#testWithField1 ArrayIndexOutOfBoundsException
  org.joda.time.TestYearMonthDay_Basics#testWithField2 ArrayIndexOutOfBoundsException
  org.joda.time.TestYearMonthDay_Basics#testWithField3 ArrayIndexOutOfBoundsException
  org.joda.time.TestYearMonthDay_Basics#testWithField4 ArrayIndexOutOfBoundsException
  org.joda.time.TestYearMonthDay_Basics#testWithFieldAdded1 ArrayIndexOutOfBoundsException
  org.joda.time.TestYearMonthDay_Basics#testWithFieldAdded2 ArrayIndexOutOfBoundsException
  org.joda.time.TestYearMonthDay_Basics#testWithFieldAdded3 ArrayIndexOutOfBoundsException
  org.joda.time.TestYearMonthDay_Basics#testWithFieldAdded4 ArrayIndexOutOfBoundsException
  org.joda.time.TestYearMonthDay_Basics#testWithFieldAdded5 ArrayIndexOutOfBoundsException
  org.joda.time.TestYearMonthDay_Basics#testWithers ArrayIndexOutOfBoundsException
  org.joda.time.TestYearMonthDay_Constructors#testConstructor_int_int_int ArrayIndexOutOfBoundsException
  org.joda.time.TestYearMonthDay_Constructors#testConstructor_int_int_int_Chronology ArrayIndexOutOfBoundsException
  org.joda.time.TestYearMonthDay_Constructors#testConstructor_int_int_int_nullChronology ArrayIndexOutOfBoundsException
  org.joda.time.TestYearMonthDay_Constructors#testFactory_FromCalendarFields ArrayIndexOutOfBoundsException
  org.joda.time.TestYearMonthDay_Constructors#testFactory_FromDateFields ArrayIndexOutOfBoundsException
  org.joda.time.TestYearMonthDay_Properties#testPropertyAddDay ArrayIndexOutOfBoundsException
  org.joda.time.TestYearMonthDay_Properties#testPropertyAddMonth ArrayIndexOutOfBoundsException
  org.joda.time.TestYearMonthDay_Properties#testPropertyAddWrapFieldDay ArrayIndexOutOfBoundsException
  org.joda.time.TestYearMonthDay_Properties#testPropertyAddWrapFieldMonth ArrayIndexOutOfBoundsException
  org.joda.time.TestYearMonthDay_Properties#testPropertyAddWrapFieldYear ArrayIndexOutOfBoundsException
  org.joda.time.TestYearMonthDay_Properties#testPropertyAddYear ArrayIndexOutOfBoundsException
  org.joda.time.TestYearMonthDay_Properties#testPropertyEquals ArrayIndexOutOfBoundsException
  org.joda.time.TestYearMonthDay_Properties#testPropertyGetDay ArrayIndexOutOfBoundsException
  org.joda.time.TestYearMonthDay_Properties#testPropertyGetMaxMinValuesDay ArrayIndexOutOfBoundsException
  org.joda.time.TestYearMonthDay_Properties#testPropertyGetMaxMinValuesMonth ArrayIndexOutOfBoundsException
  org.joda.time.TestYearMonthDay_Properties#testPropertyGetMaxMinValuesYear ArrayIndexOutOfBoundsException
  org.joda.time.TestYearMonthDay_Properties#testPropertyGetMonth ArrayIndexOutOfBoundsException
  org.joda.time.TestYearMonthDay_Properties#testPropertyGetYear ArrayIndexOutOfBoundsException
  org.joda.time.TestYearMonthDay_Properties#testPropertyHashCode ArrayIndexOutOfBoundsException
  org.joda.time.TestYearMonthDay_Properties#testPropertySetDay ArrayIndexOutOfBoundsException
  org.joda.time.TestYearMonthDay_Properties#testPropertySetMonth ArrayIndexOutOfBoundsException
  org.joda.time.TestYearMonthDay_Properties#testPropertySetTextDay ArrayIndexOutOfBoundsException
  org.joda.time.TestYearMonthDay_Properties#testPropertySetTextMonth ArrayIndexOutOfBoundsException
  org.joda.time.TestYearMonthDay_Properties#testPropertySetTextYear ArrayIndexOutOfBoundsException
  org.joda.time.TestYearMonthDay_Properties#testPropertySetYear ArrayIndexOutOfBoundsException
  org.joda.time.TestYearMonthDay_Properties#testPropertyWithMaximumValueDayOfMonth ArrayIndexOutOfBoundsException
  org.joda.time.TestYearMonthDay_Properties#testPropertyWithMinimumValueDayOfMonth ArrayIndexOutOfBoundsException
  org.joda.time.TestYearMonth_Basics#testCompareTo ArrayIndexOutOfBoundsException
  org.joda.time.TestYears#testFactory_yearsBetween_RPartial ArrayIndexOutOfBoundsException
  org.joda.time.chrono.TestGregorianChronology#testMaximumValue ArrayIndexOutOfBoundsException
  org.joda.time.chrono.TestISOChronology#testCutoverAddYears ArrayIndexOutOfBoundsException
  org.joda.time.convert.TestReadablePartialConverter#testGetPartialValues ArrayIndexOutOfBoundsException
  org.joda.time.format.TestISODateTimeFormat#testFormat_date_partial ArrayIndexOutOfBoundsException
  org.joda.time.format.TestISODateTimeFormat_Fields#testForFields_calBased_D ArrayIndexOutOfBoundsException
  org.joda.time.format.TestISODateTimeFormat_Fields#testForFields_calBased_YD ArrayIndexOutOfBoundsException
  org.joda.time.format.TestISODateTimeFormat_Fields#testForFields_calBased_YMD ArrayIndexOutOfBoundsException
  org.joda.time.format.TestISODateTimeFormat_Fields#testForFields_calBased_YMD_duplicates ArrayIndexOutOfBoundsException
  org.joda.time.format.TestISODateTimeFormat_Fields#testForFields_calBased_YMD_unmodifiable ArrayIndexOutOfBoundsException
  org.joda.time.format.TestISODateTimeFormat_Fields#testForFields_datetime_DH ArrayIndexOutOfBoundsException
  org.joda.time.format.TestISODateTimeFormat_Fields#testForFields_datetime_DM ArrayIndexOutOfBoundsException
  org.joda.time.format.TestISODateTimeFormat_Fields#testForFields_datetime_YMDH ArrayIndexOutOfBoundsException

Tests run: 4157, Failures: 0, Errors: 98, Skipped: 0

[INFO] ------------------------------------------------------------------------
[INFO] BUILD FAILURE
[INFO] ------------------------------------------------------------------------
[INFO] Total time: 15.594s
[INFO] Finished at: Wed Aug 05 22:29:30 BST 2015
[INFO] Final Memory: 8M/213M
[INFO] ------------------------------------------------------------------------
[ERROR] Failed to execute goal org.apache.maven.plugins:maven-surefire-plugin:2.18.1:test (default-test) on project joda-time: There are test failures.
[ERROR] 
[ERROR] Please refer to /home/perham/Study/LittleDarwin/Cases/joda-time-2.8.1/target/surefire-reports for the individual test results.
[ERROR] -> [Help 1]
[ERROR] 
[ERROR] To see the full stack trace of the errors, re-run Maven with the -e switch.
[ERROR] Re-run Maven using the -X switch to enable full debug logging.
[ERROR] 
[ERROR] For more information about the errors and possible solutions, please read the following articles:
[ERROR] [Help 1] http://cwiki.apache.org/confluence/display/MAVEN/MojoFailureException
