[INFO] Scanning for projects...
[INFO]                                                                         
[INFO] ------------------------------------------------------------------------
[INFO] Building Joda-Time 2.8.1
[INFO] ------------------------------------------------------------------------
[INFO] 
[INFO] --- maven-resources-plugin:2.7:resources (default-resources) @ joda-time ---
[INFO] Using 'UTF-8' encoding to copy filtered resources.
[INFO] Copying 2 resources to META-INF
[INFO] Copying 10 resources
[INFO] 
[INFO] --- maven-compiler-plugin:3.3:compile (default-compile) @ joda-time ---
[INFO] Changes detected - recompiling the module!
[INFO] Compiling 166 source files to /home/perham/Study/LittleDarwin/Cases/joda-time-2.8.1/target/classes
[INFO] 
[INFO] --- exec-maven-plugin:1.4.0:java (compile-tzdb) @ joda-time ---
Writing zoneinfo files
Writing ZoneInfoMap
[INFO] 
[INFO] --- maven-resources-plugin:2.7:testResources (default-testResources) @ joda-time ---
[INFO] Using 'UTF-8' encoding to copy filtered resources.
[INFO] Copying 34 resources
[INFO] 
[INFO] --- maven-compiler-plugin:3.3:testCompile (default-testCompile) @ joda-time ---
[INFO] Nothing to compile - all classes are up to date
[INFO] 
[INFO] --- maven-surefire-plugin:2.18.1:test (default-test) @ joda-time ---
[INFO] Surefire report directory: /home/perham/Study/LittleDarwin/Cases/joda-time-2.8.1/target/surefire-reports

-------------------------------------------------------
 T E S T S
-------------------------------------------------------
Running org.joda.time.TestAllPackages

TestBuddhistChronology.testCalendar

TestCopticChronology.testCalendar

TestEthiopicChronology.testCalendar

TestIslamicChronology.testCalendar

Testing Gregorian chronology over 1000 iterations
100% complete (i=1000)

Testing Julian chronology over 1000 iterations
100% complete (i=1000)
Writing zoneinfo files
Writing ZoneInfoMap
Tests run: 4157, Failures: 0, Errors: 77, Skipped: 0, Time elapsed: 5.523 sec <<< FAILURE! - in org.joda.time.TestAllPackages
testFactory_monthsBetween_RPartial_MonthDay(org.joda.time.TestMonths)  Time elapsed: 0.005 sec  <<< ERROR!
java.lang.ArrayIndexOutOfBoundsException: -1
	at org.joda.time.MonthDay.getFieldType(MonthDay.java:426)
	at org.joda.time.chrono.BasicDayOfMonthDateTimeField.getMaximumValue(BasicDayOfMonthDateTimeField.java:33)
	at org.joda.time.chrono.BaseChronology.validate(BaseChronology.java:207)
	at org.joda.time.base.BasePartial.<init>(BasePartial.java:183)
	at org.joda.time.MonthDay.<init>(MonthDay.java:352)
	at org.joda.time.MonthDay.<init>(MonthDay.java:334)
	at org.joda.time.TestMonths.testFactory_monthsBetween_RPartial_MonthDay(TestMonths.java:132)

testFactory_daysBetween_RPartial_MonthDay(org.joda.time.TestDays)  Time elapsed: 0.001 sec  <<< ERROR!
java.lang.ArrayIndexOutOfBoundsException: -1
	at org.joda.time.MonthDay.getFieldType(MonthDay.java:426)
	at org.joda.time.chrono.BasicDayOfMonthDateTimeField.getMaximumValue(BasicDayOfMonthDateTimeField.java:33)
	at org.joda.time.chrono.BaseChronology.validate(BaseChronology.java:207)
	at org.joda.time.base.BasePartial.<init>(BasePartial.java:183)
	at org.joda.time.MonthDay.<init>(MonthDay.java:352)
	at org.joda.time.MonthDay.<init>(MonthDay.java:334)
	at org.joda.time.TestDays.testFactory_daysBetween_RPartial_MonthDay(TestDays.java:125)

testToString(org.joda.time.TestMonthDay_Basics)  Time elapsed: 0.001 sec  <<< ERROR!
java.lang.ArrayIndexOutOfBoundsException: -1
	at org.joda.time.MonthDay.getFieldType(MonthDay.java:426)
	at org.joda.time.chrono.BasicDayOfMonthDateTimeField.getMaximumValue(BasicDayOfMonthDateTimeField.java:33)
	at org.joda.time.chrono.BaseChronology.validate(BaseChronology.java:207)
	at org.joda.time.base.BasePartial.<init>(BasePartial.java:183)
	at org.joda.time.MonthDay.<init>(MonthDay.java:352)
	at org.joda.time.MonthDay.<init>(MonthDay.java:334)
	at org.joda.time.TestMonthDay_Basics.testToString(TestMonthDay_Basics.java:788)

testWithers(org.joda.time.TestMonthDay_Basics)  Time elapsed: 0.001 sec  <<< ERROR!
java.lang.ArrayIndexOutOfBoundsException: -1
	at org.joda.time.MonthDay.getFieldType(MonthDay.java:426)
	at org.joda.time.chrono.BasicDayOfMonthDateTimeField.getMaximumValue(BasicDayOfMonthDateTimeField.java:33)
	at org.joda.time.chrono.BaseChronology.validate(BaseChronology.java:207)
	at org.joda.time.base.BasePartial.<init>(BasePartial.java:183)
	at org.joda.time.MonthDay.<init>(MonthDay.java:352)
	at org.joda.time.MonthDay.<init>(MonthDay.java:334)
	at org.joda.time.TestMonthDay_Basics.testWithers(TestMonthDay_Basics.java:737)

testToString_String(org.joda.time.TestMonthDay_Basics)  Time elapsed: 0 sec  <<< ERROR!
java.lang.ArrayIndexOutOfBoundsException: -1
	at org.joda.time.MonthDay.getFieldType(MonthDay.java:426)
	at org.joda.time.chrono.BasicDayOfMonthDateTimeField.getMaximumValue(BasicDayOfMonthDateTimeField.java:33)
	at org.joda.time.chrono.BaseChronology.validate(BaseChronology.java:207)
	at org.joda.time.base.BasePartial.<init>(BasePartial.java:183)
	at org.joda.time.MonthDay.<init>(MonthDay.java:352)
	at org.joda.time.MonthDay.<init>(MonthDay.java:334)
	at org.joda.time.TestMonthDay_Basics.testToString_String(TestMonthDay_Basics.java:794)

testToString_String_Locale(org.joda.time.TestMonthDay_Basics)  Time elapsed: 0 sec  <<< ERROR!
java.lang.ArrayIndexOutOfBoundsException: -1
	at org.joda.time.MonthDay.getFieldType(MonthDay.java:426)
	at org.joda.time.chrono.BasicDayOfMonthDateTimeField.getMaximumValue(BasicDayOfMonthDateTimeField.java:33)
	at org.joda.time.chrono.BaseChronology.validate(BaseChronology.java:207)
	at org.joda.time.base.BasePartial.<init>(BasePartial.java:183)
	at org.joda.time.MonthDay.<init>(MonthDay.java:352)
	at org.joda.time.MonthDay.<init>(MonthDay.java:334)
	at org.joda.time.TestMonthDay_Basics.testToString_String_Locale(TestMonthDay_Basics.java:801)

testToString_DTFormatter(org.joda.time.TestMonthDay_Basics)  Time elapsed: 0.001 sec  <<< ERROR!
java.lang.ArrayIndexOutOfBoundsException: -1
	at org.joda.time.MonthDay.getFieldType(MonthDay.java:426)
	at org.joda.time.chrono.BasicDayOfMonthDateTimeField.getMaximumValue(BasicDayOfMonthDateTimeField.java:33)
	at org.joda.time.chrono.BaseChronology.validate(BaseChronology.java:207)
	at org.joda.time.base.BasePartial.<init>(BasePartial.java:183)
	at org.joda.time.MonthDay.<init>(MonthDay.java:352)
	at org.joda.time.MonthDay.<init>(MonthDay.java:334)
	at org.joda.time.TestMonthDay_Basics.testToString_DTFormatter(TestMonthDay_Basics.java:811)

testProperty(org.joda.time.TestMonthDay_Basics)  Time elapsed: 0.001 sec  <<< ERROR!
java.lang.ArrayIndexOutOfBoundsException: -1
	at org.joda.time.MonthDay.getFieldType(MonthDay.java:426)
	at org.joda.time.chrono.BasicDayOfMonthDateTimeField.getMaximumValue(BasicDayOfMonthDateTimeField.java:33)
	at org.joda.time.chrono.BaseChronology.validate(BaseChronology.java:207)
	at org.joda.time.base.BasePartial.<init>(BasePartial.java:183)
	at org.joda.time.MonthDay.<init>(MonthDay.java:352)
	at org.joda.time.MonthDay.<init>(MonthDay.java:334)
	at org.joda.time.TestMonthDay_Basics.testProperty(TestMonthDay_Basics.java:752)

testCompareTo(org.joda.time.TestMonthDay_Basics)  Time elapsed: 0 sec  <<< ERROR!
java.lang.ArrayIndexOutOfBoundsException: -1
	at org.joda.time.MonthDay.getFieldType(MonthDay.java:426)
	at org.joda.time.chrono.BasicDayOfMonthDateTimeField.getMaximumValue(BasicDayOfMonthDateTimeField.java:33)
	at org.joda.time.chrono.BaseChronology.validate(BaseChronology.java:207)
	at org.joda.time.base.BasePartial.<init>(BasePartial.java:183)
	at org.joda.time.MonthDay.<init>(MonthDay.java:352)
	at org.joda.time.MonthDay.<init>(MonthDay.java:334)
	at org.joda.time.TestMonthDay_Basics.testCompareTo(TestMonthDay_Basics.java:224)

testEqualsHashCode(org.joda.time.TestMonthDay_Basics)  Time elapsed: 0.001 sec  <<< ERROR!
java.lang.ArrayIndexOutOfBoundsException: -1
	at org.joda.time.MonthDay.getFieldType(MonthDay.java:426)
	at org.joda.time.chrono.BasicDayOfMonthDateTimeField.getMaximumValue(BasicDayOfMonthDateTimeField.java:33)
	at org.joda.time.chrono.BaseChronology.validate(BaseChronology.java:207)
	at org.joda.time.base.BasePartial.<init>(BasePartial.java:183)
	at org.joda.time.MonthDay.<init>(MonthDay.java:352)
	at org.joda.time.MonthDay.<init>(MonthDay.java:334)
	at org.joda.time.TestMonthDay_Basics.testEqualsHashCode(TestMonthDay_Basics.java:188)

testToDateTime_nullRI(org.joda.time.TestMonthDay_Basics)  Time elapsed: 0 sec  <<< ERROR!
java.lang.ArrayIndexOutOfBoundsException: -1
	at org.joda.time.MonthDay.getFieldType(MonthDay.java:426)
	at org.joda.time.chrono.BasicDayOfMonthDateTimeField.getMaximumValue(BasicDayOfMonthDateTimeField.java:33)
	at org.joda.time.chrono.BaseChronology.validate(BaseChronology.java:207)
	at org.joda.time.base.BasePartial.<init>(BasePartial.java:183)
	at org.joda.time.MonthDay.<init>(MonthDay.java:352)
	at org.joda.time.MonthDay.<init>(MonthDay.java:334)
	at org.joda.time.TestMonthDay_Basics.testToDateTime_nullRI(TestMonthDay_Basics.java:723)

testWithField(org.joda.time.TestMonthDay_Basics)  Time elapsed: 0.001 sec  <<< ERROR!
java.lang.ArrayIndexOutOfBoundsException: -1
	at org.joda.time.MonthDay.getFieldType(MonthDay.java:426)
	at org.joda.time.chrono.BasicDayOfMonthDateTimeField.getMaximumValue(BasicDayOfMonthDateTimeField.java:33)
	at org.joda.time.chrono.BaseChronology.validate(BaseChronology.java:207)
	at org.joda.time.base.BasePartial.<init>(BasePartial.java:183)
	at org.joda.time.MonthDay.<init>(MonthDay.java:352)
	at org.joda.time.MonthDay.<init>(MonthDay.java:334)
	at org.joda.time.TestMonthDay_Basics.testWithField(TestMonthDay_Basics.java:364)

testWithField_nullField(org.joda.time.TestMonthDay_Basics)  Time elapsed: 0.001 sec  <<< ERROR!
java.lang.ArrayIndexOutOfBoundsException: -1
	at org.joda.time.MonthDay.getFieldType(MonthDay.java:426)
	at org.joda.time.chrono.BasicDayOfMonthDateTimeField.getMaximumValue(BasicDayOfMonthDateTimeField.java:33)
	at org.joda.time.chrono.BaseChronology.validate(BaseChronology.java:207)
	at org.joda.time.base.BasePartial.<init>(BasePartial.java:183)
	at org.joda.time.MonthDay.<init>(MonthDay.java:352)
	at org.joda.time.MonthDay.<init>(MonthDay.java:334)
	at org.joda.time.TestMonthDay_Basics.testWithField_nullField(TestMonthDay_Basics.java:372)

testWithField_unknownField(org.joda.time.TestMonthDay_Basics)  Time elapsed: 0 sec  <<< ERROR!
java.lang.ArrayIndexOutOfBoundsException: -1
	at org.joda.time.MonthDay.getFieldType(MonthDay.java:426)
	at org.joda.time.chrono.BasicDayOfMonthDateTimeField.getMaximumValue(BasicDayOfMonthDateTimeField.java:33)
	at org.joda.time.chrono.BaseChronology.validate(BaseChronology.java:207)
	at org.joda.time.base.BasePartial.<init>(BasePartial.java:183)
	at org.joda.time.MonthDay.<init>(MonthDay.java:352)
	at org.joda.time.MonthDay.<init>(MonthDay.java:334)
	at org.joda.time.TestMonthDay_Basics.testWithField_unknownField(TestMonthDay_Basics.java:380)

testWithField_same(org.joda.time.TestMonthDay_Basics)  Time elapsed: 0.001 sec  <<< ERROR!
java.lang.ArrayIndexOutOfBoundsException: -1
	at org.joda.time.MonthDay.getFieldType(MonthDay.java:426)
	at org.joda.time.chrono.BasicDayOfMonthDateTimeField.getMaximumValue(BasicDayOfMonthDateTimeField.java:33)
	at org.joda.time.chrono.BaseChronology.validate(BaseChronology.java:207)
	at org.joda.time.base.BasePartial.<init>(BasePartial.java:183)
	at org.joda.time.MonthDay.<init>(MonthDay.java:352)
	at org.joda.time.MonthDay.<init>(MonthDay.java:334)
	at org.joda.time.TestMonthDay_Basics.testWithField_same(TestMonthDay_Basics.java:388)

testIsEqual_MD(org.joda.time.TestMonthDay_Basics)  Time elapsed: 0.001 sec  <<< ERROR!
java.lang.ArrayIndexOutOfBoundsException: -1
	at org.joda.time.MonthDay.getFieldType(MonthDay.java:426)
	at org.joda.time.chrono.BasicDayOfMonthDateTimeField.getMaximumValue(BasicDayOfMonthDateTimeField.java:33)
	at org.joda.time.chrono.BaseChronology.validate(BaseChronology.java:207)
	at org.joda.time.base.BasePartial.<init>(BasePartial.java:183)
	at org.joda.time.MonthDay.<init>(MonthDay.java:352)
	at org.joda.time.MonthDay.<init>(MonthDay.java:334)
	at org.joda.time.TestMonthDay_Basics.testIsEqual_MD(TestMonthDay_Basics.java:267)

testIsBefore_MD(org.joda.time.TestMonthDay_Basics)  Time elapsed: 0.001 sec  <<< ERROR!
java.lang.ArrayIndexOutOfBoundsException: -1
	at org.joda.time.MonthDay.getFieldType(MonthDay.java:426)
	at org.joda.time.chrono.BasicDayOfMonthDateTimeField.getMaximumValue(BasicDayOfMonthDateTimeField.java:33)
	at org.joda.time.chrono.BaseChronology.validate(BaseChronology.java:207)
	at org.joda.time.base.BasePartial.<init>(BasePartial.java:183)
	at org.joda.time.MonthDay.<init>(MonthDay.java:352)
	at org.joda.time.MonthDay.<init>(MonthDay.java:334)
	at org.joda.time.TestMonthDay_Basics.testIsBefore_MD(TestMonthDay_Basics.java:291)

testIsAfter_MD(org.joda.time.TestMonthDay_Basics)  Time elapsed: 0 sec  <<< ERROR!
java.lang.ArrayIndexOutOfBoundsException: -1
	at org.joda.time.MonthDay.getFieldType(MonthDay.java:426)
	at org.joda.time.chrono.BasicDayOfMonthDateTimeField.getMaximumValue(BasicDayOfMonthDateTimeField.java:33)
	at org.joda.time.chrono.BaseChronology.validate(BaseChronology.java:207)
	at org.joda.time.base.BasePartial.<init>(BasePartial.java:183)
	at org.joda.time.MonthDay.<init>(MonthDay.java:352)
	at org.joda.time.MonthDay.<init>(MonthDay.java:334)
	at org.joda.time.TestMonthDay_Basics.testIsAfter_MD(TestMonthDay_Basics.java:315)

testPlusMonths_int_fromLeap(org.joda.time.TestMonthDay_Basics)  Time elapsed: 0.001 sec  <<< ERROR!
java.lang.ArrayIndexOutOfBoundsException: -1
	at org.joda.time.MonthDay.getFieldType(MonthDay.java:426)
	at org.joda.time.chrono.BasicDayOfMonthDateTimeField.getMaximumValue(BasicDayOfMonthDateTimeField.java:33)
	at org.joda.time.chrono.BaseChronology.validate(BaseChronology.java:207)
	at org.joda.time.base.BasePartial.<init>(BasePartial.java:183)
	at org.joda.time.MonthDay.<init>(MonthDay.java:352)
	at org.joda.time.TestMonthDay_Basics.testPlusMonths_int_fromLeap(TestMonthDay_Basics.java:452)

testPlusMonths_int_negativeFromLeap(org.joda.time.TestMonthDay_Basics)  Time elapsed: 0.001 sec  <<< ERROR!
java.lang.ArrayIndexOutOfBoundsException: -1
	at org.joda.time.MonthDay.getFieldType(MonthDay.java:426)
	at org.joda.time.chrono.BasicDayOfMonthDateTimeField.getMaximumValue(BasicDayOfMonthDateTimeField.java:33)
	at org.joda.time.chrono.BaseChronology.validate(BaseChronology.java:207)
	at org.joda.time.base.BasePartial.<init>(BasePartial.java:183)
	at org.joda.time.MonthDay.<init>(MonthDay.java:352)
	at org.joda.time.TestMonthDay_Basics.testPlusMonths_int_negativeFromLeap(TestMonthDay_Basics.java:459)

testPlusMonths_int_endOfMonthAdjust(org.joda.time.TestMonthDay_Basics)  Time elapsed: 0 sec  <<< ERROR!
java.lang.ArrayIndexOutOfBoundsException: -1
	at org.joda.time.MonthDay.getFieldType(MonthDay.java:426)
	at org.joda.time.chrono.BasicDayOfMonthDateTimeField.getMaximumValue(BasicDayOfMonthDateTimeField.java:33)
	at org.joda.time.chrono.BaseChronology.validate(BaseChronology.java:207)
	at org.joda.time.base.BasePartial.<init>(BasePartial.java:183)
	at org.joda.time.MonthDay.<init>(MonthDay.java:352)
	at org.joda.time.TestMonthDay_Basics.testPlusMonths_int_endOfMonthAdjust(TestMonthDay_Basics.java:466)

testPlusMonths_int_negativeEndOfMonthAdjust(org.joda.time.TestMonthDay_Basics)  Time elapsed: 0.001 sec  <<< ERROR!
java.lang.ArrayIndexOutOfBoundsException: -1
	at org.joda.time.MonthDay.getFieldType(MonthDay.java:426)
	at org.joda.time.chrono.BasicDayOfMonthDateTimeField.getMaximumValue(BasicDayOfMonthDateTimeField.java:33)
	at org.joda.time.chrono.BaseChronology.validate(BaseChronology.java:207)
	at org.joda.time.base.BasePartial.<init>(BasePartial.java:183)
	at org.joda.time.MonthDay.<init>(MonthDay.java:352)
	at org.joda.time.TestMonthDay_Basics.testPlusMonths_int_negativeEndOfMonthAdjust(TestMonthDay_Basics.java:473)

testWithFieldAdded(org.joda.time.TestMonthDay_Basics)  Time elapsed: 0 sec  <<< ERROR!
java.lang.ArrayIndexOutOfBoundsException: -1
	at org.joda.time.MonthDay.getFieldType(MonthDay.java:426)
	at org.joda.time.chrono.BasicDayOfMonthDateTimeField.getMaximumValue(BasicDayOfMonthDateTimeField.java:33)
	at org.joda.time.chrono.BaseChronology.validate(BaseChronology.java:207)
	at org.joda.time.base.BasePartial.<init>(BasePartial.java:183)
	at org.joda.time.MonthDay.<init>(MonthDay.java:352)
	at org.joda.time.MonthDay.<init>(MonthDay.java:334)
	at org.joda.time.TestMonthDay_Basics.testWithFieldAdded(TestMonthDay_Basics.java:396)

testWithFieldAdded_nullField_zero(org.joda.time.TestMonthDay_Basics)  Time elapsed: 0.001 sec  <<< ERROR!
java.lang.ArrayIndexOutOfBoundsException: -1
	at org.joda.time.MonthDay.getFieldType(MonthDay.java:426)
	at org.joda.time.chrono.BasicDayOfMonthDateTimeField.getMaximumValue(BasicDayOfMonthDateTimeField.java:33)
	at org.joda.time.chrono.BaseChronology.validate(BaseChronology.java:207)
	at org.joda.time.base.BasePartial.<init>(BasePartial.java:183)
	at org.joda.time.MonthDay.<init>(MonthDay.java:352)
	at org.joda.time.MonthDay.<init>(MonthDay.java:334)
	at org.joda.time.TestMonthDay_Basics.testWithFieldAdded_nullField_zero(TestMonthDay_Basics.java:404)

testWithFieldAdded_nullField_nonZero(org.joda.time.TestMonthDay_Basics)  Time elapsed: 0.001 sec  <<< ERROR!
java.lang.ArrayIndexOutOfBoundsException: -1
	at org.joda.time.MonthDay.getFieldType(MonthDay.java:426)
	at org.joda.time.chrono.BasicDayOfMonthDateTimeField.getMaximumValue(BasicDayOfMonthDateTimeField.java:33)
	at org.joda.time.chrono.BaseChronology.validate(BaseChronology.java:207)
	at org.joda.time.base.BasePartial.<init>(BasePartial.java:183)
	at org.joda.time.MonthDay.<init>(MonthDay.java:352)
	at org.joda.time.MonthDay.<init>(MonthDay.java:334)
	at org.joda.time.TestMonthDay_Basics.testWithFieldAdded_nullField_nonZero(TestMonthDay_Basics.java:412)

testWithFieldAdded_zero(org.joda.time.TestMonthDay_Basics)  Time elapsed: 0 sec  <<< ERROR!
java.lang.ArrayIndexOutOfBoundsException: -1
	at org.joda.time.MonthDay.getFieldType(MonthDay.java:426)
	at org.joda.time.chrono.BasicDayOfMonthDateTimeField.getMaximumValue(BasicDayOfMonthDateTimeField.java:33)
	at org.joda.time.chrono.BaseChronology.validate(BaseChronology.java:207)
	at org.joda.time.base.BasePartial.<init>(BasePartial.java:183)
	at org.joda.time.MonthDay.<init>(MonthDay.java:352)
	at org.joda.time.MonthDay.<init>(MonthDay.java:334)
	at org.joda.time.TestMonthDay_Basics.testWithFieldAdded_zero(TestMonthDay_Basics.java:420)

testWithFieldAdded_unknownField(org.joda.time.TestMonthDay_Basics)  Time elapsed: 0.001 sec  <<< ERROR!
java.lang.ArrayIndexOutOfBoundsException: -1
	at org.joda.time.MonthDay.getFieldType(MonthDay.java:426)
	at org.joda.time.chrono.BasicDayOfMonthDateTimeField.getMaximumValue(BasicDayOfMonthDateTimeField.java:33)
	at org.joda.time.chrono.BaseChronology.validate(BaseChronology.java:207)
	at org.joda.time.base.BasePartial.<init>(BasePartial.java:183)
	at org.joda.time.MonthDay.<init>(MonthDay.java:352)
	at org.joda.time.MonthDay.<init>(MonthDay.java:334)
	at org.joda.time.TestMonthDay_Basics.testWithFieldAdded_unknownField(TestMonthDay_Basics.java:426)

testPlusMonths_int_same(org.joda.time.TestMonthDay_Basics)  Time elapsed: 0.001 sec  <<< ERROR!
java.lang.ArrayIndexOutOfBoundsException: -1
	at org.joda.time.MonthDay.getFieldType(MonthDay.java:426)
	at org.joda.time.chrono.BasicDayOfMonthDateTimeField.getMaximumValue(BasicDayOfMonthDateTimeField.java:33)
	at org.joda.time.chrono.BaseChronology.validate(BaseChronology.java:207)
	at org.joda.time.base.BasePartial.<init>(BasePartial.java:183)
	at org.joda.time.MonthDay.<init>(MonthDay.java:352)
	at org.joda.time.TestMonthDay_Basics.testPlusMonths_int_same(TestMonthDay_Basics.java:480)

testPlusMonths_int_wrap(org.joda.time.TestMonthDay_Basics)  Time elapsed: 0 sec  <<< ERROR!
java.lang.ArrayIndexOutOfBoundsException: -1
	at org.joda.time.MonthDay.getFieldType(MonthDay.java:426)
	at org.joda.time.chrono.BasicDayOfMonthDateTimeField.getMaximumValue(BasicDayOfMonthDateTimeField.java:33)
	at org.joda.time.chrono.BaseChronology.validate(BaseChronology.java:207)
	at org.joda.time.base.BasePartial.<init>(BasePartial.java:183)
	at org.joda.time.MonthDay.<init>(MonthDay.java:352)
	at org.joda.time.TestMonthDay_Basics.testPlusMonths_int_wrap(TestMonthDay_Basics.java:486)

testPlusMonths_int_adjust(org.joda.time.TestMonthDay_Basics)  Time elapsed: 0.001 sec  <<< ERROR!
java.lang.ArrayIndexOutOfBoundsException: -1
	at org.joda.time.MonthDay.getFieldType(MonthDay.java:426)
	at org.joda.time.chrono.BasicDayOfMonthDateTimeField.getMaximumValue(BasicDayOfMonthDateTimeField.java:33)
	at org.joda.time.chrono.BaseChronology.validate(BaseChronology.java:207)
	at org.joda.time.base.BasePartial.<init>(BasePartial.java:183)
	at org.joda.time.MonthDay.<init>(MonthDay.java:352)
	at org.joda.time.TestMonthDay_Basics.testPlusMonths_int_adjust(TestMonthDay_Basics.java:493)

testPlusDays_int_wrapMonth(org.joda.time.TestMonthDay_Basics)  Time elapsed: 0.001 sec  <<< ERROR!
java.lang.ArrayIndexOutOfBoundsException: -1
	at org.joda.time.MonthDay.getFieldType(MonthDay.java:426)
	at org.joda.time.chrono.BasicDayOfMonthDateTimeField.getMaximumValue(BasicDayOfMonthDateTimeField.java:33)
	at org.joda.time.chrono.BaseChronology.validate(BaseChronology.java:207)
	at org.joda.time.base.BasePartial.<init>(BasePartial.java:183)
	at org.joda.time.MonthDay.<init>(MonthDay.java:352)
	at org.joda.time.TestMonthDay_Basics.testPlusDays_int_wrapMonth(TestMonthDay_Basics.java:508)

testPlusDays_int_wrapMonthTwice(org.joda.time.TestMonthDay_Basics)  Time elapsed: 0 sec  <<< ERROR!
java.lang.ArrayIndexOutOfBoundsException: -1
	at org.joda.time.MonthDay.getFieldType(MonthDay.java:426)
	at org.joda.time.chrono.BasicDayOfMonthDateTimeField.getMaximumValue(BasicDayOfMonthDateTimeField.java:33)
	at org.joda.time.chrono.BaseChronology.validate(BaseChronology.java:207)
	at org.joda.time.base.BasePartial.<init>(BasePartial.java:183)
	at org.joda.time.MonthDay.<init>(MonthDay.java:352)
	at org.joda.time.TestMonthDay_Basics.testPlusDays_int_wrapMonthTwice(TestMonthDay_Basics.java:515)

testPlusDays_int_wrapMonthIntoNextYear(org.joda.time.TestMonthDay_Basics)  Time elapsed: 0.001 sec  <<< ERROR!
java.lang.ArrayIndexOutOfBoundsException: -1
	at org.joda.time.MonthDay.getFieldType(MonthDay.java:426)
	at org.joda.time.chrono.BasicDayOfMonthDateTimeField.getMaximumValue(BasicDayOfMonthDateTimeField.java:33)
	at org.joda.time.chrono.BaseChronology.validate(BaseChronology.java:207)
	at org.joda.time.base.BasePartial.<init>(BasePartial.java:183)
	at org.joda.time.MonthDay.<init>(MonthDay.java:352)
	at org.joda.time.TestMonthDay_Basics.testPlusDays_int_wrapMonthIntoNextYear(TestMonthDay_Basics.java:522)

testPlusDays_int_wrapMonthTwiceIntoNextYear(org.joda.time.TestMonthDay_Basics)  Time elapsed: 0 sec  <<< ERROR!
java.lang.ArrayIndexOutOfBoundsException: -1
	at org.joda.time.MonthDay.getFieldType(MonthDay.java:426)
	at org.joda.time.chrono.BasicDayOfMonthDateTimeField.getMaximumValue(BasicDayOfMonthDateTimeField.java:33)
	at org.joda.time.chrono.BaseChronology.validate(BaseChronology.java:207)
	at org.joda.time.base.BasePartial.<init>(BasePartial.java:183)
	at org.joda.time.MonthDay.<init>(MonthDay.java:352)
	at org.joda.time.TestMonthDay_Basics.testPlusDays_int_wrapMonthTwiceIntoNextYear(TestMonthDay_Basics.java:529)

testPlusDays_int_wrap50(org.joda.time.TestMonthDay_Basics)  Time elapsed: 0 sec  <<< ERROR!
java.lang.ArrayIndexOutOfBoundsException: -1
	at org.joda.time.MonthDay.getFieldType(MonthDay.java:426)
	at org.joda.time.chrono.BasicDayOfMonthDateTimeField.getMaximumValue(BasicDayOfMonthDateTimeField.java:33)
	at org.joda.time.chrono.BaseChronology.validate(BaseChronology.java:207)
	at org.joda.time.base.BasePartial.<init>(BasePartial.java:183)
	at org.joda.time.MonthDay.<init>(MonthDay.java:352)
	at org.joda.time.TestMonthDay_Basics.testPlusDays_int_wrap50(TestMonthDay_Basics.java:536)

testPlusDays_int_toLeap(org.joda.time.TestMonthDay_Basics)  Time elapsed: 0.001 sec  <<< ERROR!
java.lang.ArrayIndexOutOfBoundsException: -1
	at org.joda.time.MonthDay.getFieldType(MonthDay.java:426)
	at org.joda.time.chrono.BasicDayOfMonthDateTimeField.getMaximumValue(BasicDayOfMonthDateTimeField.java:33)
	at org.joda.time.chrono.BaseChronology.validate(BaseChronology.java:207)
	at org.joda.time.base.BasePartial.<init>(BasePartial.java:183)
	at org.joda.time.MonthDay.<init>(MonthDay.java:352)
	at org.joda.time.TestMonthDay_Basics.testPlusDays_int_toLeap(TestMonthDay_Basics.java:543)

testPlusDays_int_fromLeap(org.joda.time.TestMonthDay_Basics)  Time elapsed: 0 sec  <<< ERROR!
java.lang.ArrayIndexOutOfBoundsException: -1
	at org.joda.time.MonthDay.getFieldType(MonthDay.java:426)
	at org.joda.time.chrono.BasicDayOfMonthDateTimeField.getMaximumValue(BasicDayOfMonthDateTimeField.java:33)
	at org.joda.time.chrono.BaseChronology.validate(BaseChronology.java:207)
	at org.joda.time.base.BasePartial.<init>(BasePartial.java:183)
	at org.joda.time.MonthDay.<init>(MonthDay.java:352)
	at org.joda.time.TestMonthDay_Basics.testPlusDays_int_fromLeap(TestMonthDay_Basics.java:550)

testPlusDays_int_negativeFromLeap(org.joda.time.TestMonthDay_Basics)  Time elapsed: 0.001 sec  <<< ERROR!
java.lang.ArrayIndexOutOfBoundsException: -1
	at org.joda.time.MonthDay.getFieldType(MonthDay.java:426)
	at org.joda.time.chrono.BasicDayOfMonthDateTimeField.getMaximumValue(BasicDayOfMonthDateTimeField.java:33)
	at org.joda.time.chrono.BaseChronology.validate(BaseChronology.java:207)
	at org.joda.time.base.BasePartial.<init>(BasePartial.java:183)
	at org.joda.time.MonthDay.<init>(MonthDay.java:352)
	at org.joda.time.TestMonthDay_Basics.testPlusDays_int_negativeFromLeap(TestMonthDay_Basics.java:557)

testMinusMonths_int_fromLeap(org.joda.time.TestMonthDay_Basics)  Time elapsed: 0.001 sec  <<< ERROR!
java.lang.ArrayIndexOutOfBoundsException: -1
	at org.joda.time.MonthDay.getFieldType(MonthDay.java:426)
	at org.joda.time.chrono.BasicDayOfMonthDateTimeField.getMaximumValue(BasicDayOfMonthDateTimeField.java:33)
	at org.joda.time.chrono.BaseChronology.validate(BaseChronology.java:207)
	at org.joda.time.base.BasePartial.<init>(BasePartial.java:183)
	at org.joda.time.MonthDay.<init>(MonthDay.java:352)
	at org.joda.time.TestMonthDay_Basics.testMinusMonths_int_fromLeap(TestMonthDay_Basics.java:588)

testMinusMonths_int_negativeFromLeap(org.joda.time.TestMonthDay_Basics)  Time elapsed: 0 sec  <<< ERROR!
java.lang.ArrayIndexOutOfBoundsException: -1
	at org.joda.time.MonthDay.getFieldType(MonthDay.java:426)
	at org.joda.time.chrono.BasicDayOfMonthDateTimeField.getMaximumValue(BasicDayOfMonthDateTimeField.java:33)
	at org.joda.time.chrono.BaseChronology.validate(BaseChronology.java:207)
	at org.joda.time.base.BasePartial.<init>(BasePartial.java:183)
	at org.joda.time.MonthDay.<init>(MonthDay.java:352)
	at org.joda.time.TestMonthDay_Basics.testMinusMonths_int_negativeFromLeap(TestMonthDay_Basics.java:595)

testMinusMonths_int_endOfMonthAdjust(org.joda.time.TestMonthDay_Basics)  Time elapsed: 0.001 sec  <<< ERROR!
java.lang.ArrayIndexOutOfBoundsException: -1
	at org.joda.time.MonthDay.getFieldType(MonthDay.java:426)
	at org.joda.time.chrono.BasicDayOfMonthDateTimeField.getMaximumValue(BasicDayOfMonthDateTimeField.java:33)
	at org.joda.time.chrono.BaseChronology.validate(BaseChronology.java:207)
	at org.joda.time.base.BasePartial.<init>(BasePartial.java:183)
	at org.joda.time.MonthDay.<init>(MonthDay.java:352)
	at org.joda.time.TestMonthDay_Basics.testMinusMonths_int_endOfMonthAdjust(TestMonthDay_Basics.java:602)

testMinusMonths_int_negativeEndOfMonthAdjust(org.joda.time.TestMonthDay_Basics)  Time elapsed: 0 sec  <<< ERROR!
java.lang.ArrayIndexOutOfBoundsException: -1
	at org.joda.time.MonthDay.getFieldType(MonthDay.java:426)
	at org.joda.time.chrono.BasicDayOfMonthDateTimeField.getMaximumValue(BasicDayOfMonthDateTimeField.java:33)
	at org.joda.time.chrono.BaseChronology.validate(BaseChronology.java:207)
	at org.joda.time.base.BasePartial.<init>(BasePartial.java:183)
	at org.joda.time.MonthDay.<init>(MonthDay.java:352)
	at org.joda.time.TestMonthDay_Basics.testMinusMonths_int_negativeEndOfMonthAdjust(TestMonthDay_Basics.java:609)

testMinusMonths_int_same(org.joda.time.TestMonthDay_Basics)  Time elapsed: 0 sec  <<< ERROR!
java.lang.ArrayIndexOutOfBoundsException: -1
	at org.joda.time.MonthDay.getFieldType(MonthDay.java:426)
	at org.joda.time.chrono.BasicDayOfMonthDateTimeField.getMaximumValue(BasicDayOfMonthDateTimeField.java:33)
	at org.joda.time.chrono.BaseChronology.validate(BaseChronology.java:207)
	at org.joda.time.base.BasePartial.<init>(BasePartial.java:183)
	at org.joda.time.MonthDay.<init>(MonthDay.java:352)
	at org.joda.time.TestMonthDay_Basics.testMinusMonths_int_same(TestMonthDay_Basics.java:616)

testMinusMonths_int_wrap(org.joda.time.TestMonthDay_Basics)  Time elapsed: 0.001 sec  <<< ERROR!
java.lang.ArrayIndexOutOfBoundsException: -1
	at org.joda.time.MonthDay.getFieldType(MonthDay.java:426)
	at org.joda.time.chrono.BasicDayOfMonthDateTimeField.getMaximumValue(BasicDayOfMonthDateTimeField.java:33)
	at org.joda.time.chrono.BaseChronology.validate(BaseChronology.java:207)
	at org.joda.time.base.BasePartial.<init>(BasePartial.java:183)
	at org.joda.time.MonthDay.<init>(MonthDay.java:352)
	at org.joda.time.TestMonthDay_Basics.testMinusMonths_int_wrap(TestMonthDay_Basics.java:622)

testMinusMonths_int_adjust(org.joda.time.TestMonthDay_Basics)  Time elapsed: 0 sec  <<< ERROR!
java.lang.ArrayIndexOutOfBoundsException: -1
	at org.joda.time.MonthDay.getFieldType(MonthDay.java:426)
	at org.joda.time.chrono.BasicDayOfMonthDateTimeField.getMaximumValue(BasicDayOfMonthDateTimeField.java:33)
	at org.joda.time.chrono.BaseChronology.validate(BaseChronology.java:207)
	at org.joda.time.base.BasePartial.<init>(BasePartial.java:183)
	at org.joda.time.MonthDay.<init>(MonthDay.java:352)
	at org.joda.time.TestMonthDay_Basics.testMinusMonths_int_adjust(TestMonthDay_Basics.java:629)

testMinusDays_int_wrapMonth(org.joda.time.TestMonthDay_Basics)  Time elapsed: 0 sec  <<< ERROR!
java.lang.ArrayIndexOutOfBoundsException: -1
	at org.joda.time.MonthDay.getFieldType(MonthDay.java:426)
	at org.joda.time.chrono.BasicDayOfMonthDateTimeField.getMaximumValue(BasicDayOfMonthDateTimeField.java:33)
	at org.joda.time.chrono.BaseChronology.validate(BaseChronology.java:207)
	at org.joda.time.base.BasePartial.<init>(BasePartial.java:183)
	at org.joda.time.MonthDay.<init>(MonthDay.java:352)
	at org.joda.time.TestMonthDay_Basics.testMinusDays_int_wrapMonth(TestMonthDay_Basics.java:644)

testMinusDays_int_wrapMonthTwice(org.joda.time.TestMonthDay_Basics)  Time elapsed: 0.001 sec  <<< ERROR!
java.lang.ArrayIndexOutOfBoundsException: -1
	at org.joda.time.MonthDay.getFieldType(MonthDay.java:426)
	at org.joda.time.chrono.BasicDayOfMonthDateTimeField.getMaximumValue(BasicDayOfMonthDateTimeField.java:33)
	at org.joda.time.chrono.BaseChronology.validate(BaseChronology.java:207)
	at org.joda.time.base.BasePartial.<init>(BasePartial.java:183)
	at org.joda.time.MonthDay.<init>(MonthDay.java:352)
	at org.joda.time.TestMonthDay_Basics.testMinusDays_int_wrapMonthTwice(TestMonthDay_Basics.java:651)

testMinusDays_int_wrapMonthIntoLastYear(org.joda.time.TestMonthDay_Basics)  Time elapsed: 0 sec  <<< ERROR!
java.lang.ArrayIndexOutOfBoundsException: -1
	at org.joda.time.MonthDay.getFieldType(MonthDay.java:426)
	at org.joda.time.chrono.BasicDayOfMonthDateTimeField.getMaximumValue(BasicDayOfMonthDateTimeField.java:33)
	at org.joda.time.chrono.BaseChronology.validate(BaseChronology.java:207)
	at org.joda.time.base.BasePartial.<init>(BasePartial.java:183)
	at org.joda.time.MonthDay.<init>(MonthDay.java:352)
	at org.joda.time.TestMonthDay_Basics.testMinusDays_int_wrapMonthIntoLastYear(TestMonthDay_Basics.java:658)

testMinusDays_int_wrapMonthTwiceIntoLastYear(org.joda.time.TestMonthDay_Basics)  Time elapsed: 0.001 sec  <<< ERROR!
java.lang.ArrayIndexOutOfBoundsException: -1
	at org.joda.time.MonthDay.getFieldType(MonthDay.java:426)
	at org.joda.time.chrono.BasicDayOfMonthDateTimeField.getMaximumValue(BasicDayOfMonthDateTimeField.java:33)
	at org.joda.time.chrono.BaseChronology.validate(BaseChronology.java:207)
	at org.joda.time.base.BasePartial.<init>(BasePartial.java:183)
	at org.joda.time.MonthDay.<init>(MonthDay.java:352)
	at org.joda.time.TestMonthDay_Basics.testMinusDays_int_wrapMonthTwiceIntoLastYear(TestMonthDay_Basics.java:665)

testMinusDays_int_toLeap(org.joda.time.TestMonthDay_Basics)  Time elapsed: 0.001 sec  <<< ERROR!
java.lang.ArrayIndexOutOfBoundsException: -1
	at org.joda.time.MonthDay.getFieldType(MonthDay.java:426)
	at org.joda.time.chrono.BasicDayOfMonthDateTimeField.getMaximumValue(BasicDayOfMonthDateTimeField.java:33)
	at org.joda.time.chrono.BaseChronology.validate(BaseChronology.java:207)
	at org.joda.time.base.BasePartial.<init>(BasePartial.java:183)
	at org.joda.time.MonthDay.<init>(MonthDay.java:352)
	at org.joda.time.TestMonthDay_Basics.testMinusDays_int_toLeap(TestMonthDay_Basics.java:672)

testWithChronologyRetainFields_nullChrono(org.joda.time.TestMonthDay_Basics)  Time elapsed: 0.001 sec  <<< ERROR!
java.lang.ArrayIndexOutOfBoundsException: -1
	at org.joda.time.MonthDay.getFieldType(MonthDay.java:426)
	at org.joda.time.chrono.BasicDayOfMonthDateTimeField.getMaximumValue(BasicDayOfMonthDateTimeField.java:33)
	at org.joda.time.chrono.BaseChronology.validate(BaseChronology.java:207)
	at org.joda.time.MonthDay.withChronologyRetainFields(MonthDay.java:462)
	at org.joda.time.TestMonthDay_Basics.testWithChronologyRetainFields_nullChrono(TestMonthDay_Basics.java:355)

testMinusDays_int_fromLeap(org.joda.time.TestMonthDay_Basics)  Time elapsed: 0.001 sec  <<< ERROR!
java.lang.ArrayIndexOutOfBoundsException: -1
	at org.joda.time.MonthDay.getFieldType(MonthDay.java:426)
	at org.joda.time.chrono.BasicDayOfMonthDateTimeField.getMaximumValue(BasicDayOfMonthDateTimeField.java:33)
	at org.joda.time.chrono.BaseChronology.validate(BaseChronology.java:207)
	at org.joda.time.base.BasePartial.<init>(BasePartial.java:183)
	at org.joda.time.MonthDay.<init>(MonthDay.java:352)
	at org.joda.time.TestMonthDay_Basics.testMinusDays_int_fromLeap(TestMonthDay_Basics.java:679)

testMinusDays_int_negativeFromLeap(org.joda.time.TestMonthDay_Basics)  Time elapsed: 0.001 sec  <<< ERROR!
java.lang.ArrayIndexOutOfBoundsException: -1
	at org.joda.time.MonthDay.getFieldType(MonthDay.java:426)
	at org.joda.time.chrono.BasicDayOfMonthDateTimeField.getMaximumValue(BasicDayOfMonthDateTimeField.java:33)
	at org.joda.time.chrono.BaseChronology.validate(BaseChronology.java:207)
	at org.joda.time.base.BasePartial.<init>(BasePartial.java:183)
	at org.joda.time.MonthDay.<init>(MonthDay.java:352)
	at org.joda.time.TestMonthDay_Basics.testMinusDays_int_negativeFromLeap(TestMonthDay_Basics.java:686)

testParse_noFormatter(org.joda.time.TestMonthDay_Constructors)  Time elapsed: 0.001 sec  <<< ERROR!
java.lang.ArrayIndexOutOfBoundsException: -1
	at org.joda.time.MonthDay.getFieldType(MonthDay.java:426)
	at org.joda.time.chrono.BasicDayOfMonthDateTimeField.getMaximumValue(BasicDayOfMonthDateTimeField.java:33)
	at org.joda.time.chrono.BaseChronology.validate(BaseChronology.java:207)
	at org.joda.time.base.BasePartial.<init>(BasePartial.java:183)
	at org.joda.time.MonthDay.<init>(MonthDay.java:352)
	at org.joda.time.MonthDay.<init>(MonthDay.java:334)
	at org.joda.time.TestMonthDay_Constructors.testParse_noFormatter(TestMonthDay_Constructors.java:82)

testParse_formatter(org.joda.time.TestMonthDay_Constructors)  Time elapsed: 0 sec  <<< ERROR!
java.lang.ArrayIndexOutOfBoundsException: -1
	at org.joda.time.MonthDay.getFieldType(MonthDay.java:426)
	at org.joda.time.chrono.BasicDayOfMonthDateTimeField.getMaximumValue(BasicDayOfMonthDateTimeField.java:33)
	at org.joda.time.chrono.BaseChronology.validate(BaseChronology.java:207)
	at org.joda.time.base.BasePartial.<init>(BasePartial.java:183)
	at org.joda.time.MonthDay.<init>(MonthDay.java:352)
	at org.joda.time.MonthDay.<init>(MonthDay.java:334)
	at org.joda.time.TestMonthDay_Constructors.testParse_formatter(TestMonthDay_Constructors.java:90)

testFactory_FromDateFields(org.joda.time.TestMonthDay_Constructors)  Time elapsed: 0.001 sec  <<< ERROR!
java.lang.ArrayIndexOutOfBoundsException: -1
	at org.joda.time.MonthDay.getFieldType(MonthDay.java:426)
	at org.joda.time.chrono.BasicDayOfMonthDateTimeField.getMaximumValue(BasicDayOfMonthDateTimeField.java:33)
	at org.joda.time.chrono.BaseChronology.validate(BaseChronology.java:207)
	at org.joda.time.base.BasePartial.<init>(BasePartial.java:183)
	at org.joda.time.MonthDay.<init>(MonthDay.java:352)
	at org.joda.time.MonthDay.<init>(MonthDay.java:334)
	at org.joda.time.TestMonthDay_Constructors.testFactory_FromDateFields(TestMonthDay_Constructors.java:109)

testConstructor_int_int_Chronology(org.joda.time.TestMonthDay_Constructors)  Time elapsed: 0.001 sec  <<< ERROR!
java.lang.ArrayIndexOutOfBoundsException: -1
	at org.joda.time.MonthDay.getFieldType(MonthDay.java:426)
	at org.joda.time.chrono.BasicDayOfMonthDateTimeField.getMaximumValue(BasicDayOfMonthDateTimeField.java:33)
	at org.joda.time.chrono.BaseChronology.validate(BaseChronology.java:207)
	at org.joda.time.base.BasePartial.<init>(BasePartial.java:183)
	at org.joda.time.MonthDay.<init>(MonthDay.java:352)
	at org.joda.time.TestMonthDay_Constructors.testConstructor_int_int_Chronology(TestMonthDay_Constructors.java:376)

testConstructor_int_int_nullChronology(org.joda.time.TestMonthDay_Constructors)  Time elapsed: 0 sec  <<< ERROR!
java.lang.ArrayIndexOutOfBoundsException: -1
	at org.joda.time.MonthDay.getFieldType(MonthDay.java:426)
	at org.joda.time.chrono.BasicDayOfMonthDateTimeField.getMaximumValue(BasicDayOfMonthDateTimeField.java:33)
	at org.joda.time.chrono.BaseChronology.validate(BaseChronology.java:207)
	at org.joda.time.base.BasePartial.<init>(BasePartial.java:183)
	at org.joda.time.MonthDay.<init>(MonthDay.java:352)
	at org.joda.time.TestMonthDay_Constructors.testConstructor_int_int_nullChronology(TestMonthDay_Constructors.java:402)

testFactory_FromCalendarFields(org.joda.time.TestMonthDay_Constructors)  Time elapsed: 0 sec  <<< ERROR!
java.lang.ArrayIndexOutOfBoundsException: -1
	at org.joda.time.MonthDay.getFieldType(MonthDay.java:426)
	at org.joda.time.chrono.BasicDayOfMonthDateTimeField.getMaximumValue(BasicDayOfMonthDateTimeField.java:33)
	at org.joda.time.chrono.BaseChronology.validate(BaseChronology.java:207)
	at org.joda.time.base.BasePartial.<init>(BasePartial.java:183)
	at org.joda.time.MonthDay.<init>(MonthDay.java:352)
	at org.joda.time.MonthDay.<init>(MonthDay.java:334)
	at org.joda.time.TestMonthDay_Constructors.testFactory_FromCalendarFields(TestMonthDay_Constructors.java:97)

testConstructor_int_int(org.joda.time.TestMonthDay_Constructors)  Time elapsed: 0 sec  <<< ERROR!
java.lang.ArrayIndexOutOfBoundsException: -1
	at org.joda.time.MonthDay.getFieldType(MonthDay.java:426)
	at org.joda.time.chrono.BasicDayOfMonthDateTimeField.getMaximumValue(BasicDayOfMonthDateTimeField.java:33)
	at org.joda.time.chrono.BaseChronology.validate(BaseChronology.java:207)
	at org.joda.time.base.BasePartial.<init>(BasePartial.java:183)
	at org.joda.time.MonthDay.<init>(MonthDay.java:352)
	at org.joda.time.MonthDay.<init>(MonthDay.java:334)
	at org.joda.time.TestMonthDay_Constructors.testConstructor_int_int(TestMonthDay_Constructors.java:350)

testPropertyGetMonthOfYear(org.joda.time.TestMonthDay_Properties)  Time elapsed: 0.001 sec  <<< ERROR!
java.lang.ArrayIndexOutOfBoundsException: -1
	at org.joda.time.MonthDay.getFieldType(MonthDay.java:426)
	at org.joda.time.chrono.BasicDayOfMonthDateTimeField.getMaximumValue(BasicDayOfMonthDateTimeField.java:33)
	at org.joda.time.chrono.BaseChronology.validate(BaseChronology.java:207)
	at org.joda.time.base.BasePartial.<init>(BasePartial.java:183)
	at org.joda.time.MonthDay.<init>(MonthDay.java:352)
	at org.joda.time.MonthDay.<init>(MonthDay.java:334)
	at org.joda.time.TestMonthDay_Properties.testPropertyGetMonthOfYear(TestMonthDay_Properties.java:81)

testPropertyAddWrapFieldDayOfMonth(org.joda.time.TestMonthDay_Properties)  Time elapsed: 0.001 sec  <<< ERROR!
java.lang.ArrayIndexOutOfBoundsException: -1
	at org.joda.time.MonthDay.getFieldType(MonthDay.java:426)
	at org.joda.time.chrono.BasicDayOfMonthDateTimeField.getMaximumValue(BasicDayOfMonthDateTimeField.java:33)
	at org.joda.time.chrono.BaseChronology.validate(BaseChronology.java:207)
	at org.joda.time.base.BasePartial.<init>(BasePartial.java:183)
	at org.joda.time.MonthDay.<init>(MonthDay.java:352)
	at org.joda.time.MonthDay.<init>(MonthDay.java:334)
	at org.joda.time.TestMonthDay_Properties.testPropertyAddWrapFieldDayOfMonth(TestMonthDay_Properties.java:223)

testPropertySetDayOfMonth(org.joda.time.TestMonthDay_Properties)  Time elapsed: 0 sec  <<< ERROR!
java.lang.ArrayIndexOutOfBoundsException: -1
	at org.joda.time.MonthDay.getFieldType(MonthDay.java:426)
	at org.joda.time.chrono.BasicDayOfMonthDateTimeField.getMaximumValue(BasicDayOfMonthDateTimeField.java:33)
	at org.joda.time.chrono.BaseChronology.validate(BaseChronology.java:207)
	at org.joda.time.base.BasePartial.<init>(BasePartial.java:183)
	at org.joda.time.MonthDay.<init>(MonthDay.java:352)
	at org.joda.time.MonthDay.<init>(MonthDay.java:334)
	at org.joda.time.TestMonthDay_Properties.testPropertySetDayOfMonth(TestMonthDay_Properties.java:236)

testPropertySetTextDayOfMonth(org.joda.time.TestMonthDay_Properties)  Time elapsed: 0.001 sec  <<< ERROR!
java.lang.ArrayIndexOutOfBoundsException: -1
	at org.joda.time.MonthDay.getFieldType(MonthDay.java:426)
	at org.joda.time.chrono.BasicDayOfMonthDateTimeField.getMaximumValue(BasicDayOfMonthDateTimeField.java:33)
	at org.joda.time.chrono.BaseChronology.validate(BaseChronology.java:207)
	at org.joda.time.base.BasePartial.<init>(BasePartial.java:183)
	at org.joda.time.MonthDay.<init>(MonthDay.java:352)
	at org.joda.time.MonthDay.<init>(MonthDay.java:334)
	at org.joda.time.TestMonthDay_Properties.testPropertySetTextDayOfMonth(TestMonthDay_Properties.java:252)

testPropertyAddMonthOfYear(org.joda.time.TestMonthDay_Properties)  Time elapsed: 0.001 sec  <<< ERROR!
java.lang.ArrayIndexOutOfBoundsException: -1
	at org.joda.time.MonthDay.getFieldType(MonthDay.java:426)
	at org.joda.time.chrono.BasicDayOfMonthDateTimeField.getMaximumValue(BasicDayOfMonthDateTimeField.java:33)
	at org.joda.time.chrono.BaseChronology.validate(BaseChronology.java:207)
	at org.joda.time.base.BasePartial.<init>(BasePartial.java:183)
	at org.joda.time.MonthDay.<init>(MonthDay.java:352)
	at org.joda.time.MonthDay.<init>(MonthDay.java:334)
	at org.joda.time.TestMonthDay_Properties.testPropertyAddMonthOfYear(TestMonthDay_Properties.java:108)

testPropertyAddWrapFieldMonthOfYear(org.joda.time.TestMonthDay_Properties)  Time elapsed: 0.001 sec  <<< ERROR!
java.lang.ArrayIndexOutOfBoundsException: -1
	at org.joda.time.MonthDay.getFieldType(MonthDay.java:426)
	at org.joda.time.chrono.BasicDayOfMonthDateTimeField.getMaximumValue(BasicDayOfMonthDateTimeField.java:33)
	at org.joda.time.chrono.BaseChronology.validate(BaseChronology.java:207)
	at org.joda.time.base.BasePartial.<init>(BasePartial.java:183)
	at org.joda.time.MonthDay.<init>(MonthDay.java:352)
	at org.joda.time.MonthDay.<init>(MonthDay.java:334)
	at org.joda.time.TestMonthDay_Properties.testPropertyAddWrapFieldMonthOfYear(TestMonthDay_Properties.java:124)

testPropertySetMonthOfYear(org.joda.time.TestMonthDay_Properties)  Time elapsed: 0 sec  <<< ERROR!
java.lang.ArrayIndexOutOfBoundsException: -1
	at org.joda.time.MonthDay.getFieldType(MonthDay.java:426)
	at org.joda.time.chrono.BasicDayOfMonthDateTimeField.getMaximumValue(BasicDayOfMonthDateTimeField.java:33)
	at org.joda.time.chrono.BaseChronology.validate(BaseChronology.java:207)
	at org.joda.time.base.BasePartial.<init>(BasePartial.java:183)
	at org.joda.time.MonthDay.<init>(MonthDay.java:352)
	at org.joda.time.MonthDay.<init>(MonthDay.java:334)
	at org.joda.time.TestMonthDay_Properties.testPropertySetMonthOfYear(TestMonthDay_Properties.java:140)

testPropertySetTextMonthOfYear(org.joda.time.TestMonthDay_Properties)  Time elapsed: 0.001 sec  <<< ERROR!
java.lang.ArrayIndexOutOfBoundsException: -1
	at org.joda.time.MonthDay.getFieldType(MonthDay.java:426)
	at org.joda.time.chrono.BasicDayOfMonthDateTimeField.getMaximumValue(BasicDayOfMonthDateTimeField.java:33)
	at org.joda.time.chrono.BaseChronology.validate(BaseChronology.java:207)
	at org.joda.time.base.BasePartial.<init>(BasePartial.java:183)
	at org.joda.time.MonthDay.<init>(MonthDay.java:352)
	at org.joda.time.MonthDay.<init>(MonthDay.java:334)
	at org.joda.time.TestMonthDay_Properties.testPropertySetTextMonthOfYear(TestMonthDay_Properties.java:147)

testPropertyGetDayOfMonth(org.joda.time.TestMonthDay_Properties)  Time elapsed: 0 sec  <<< ERROR!
java.lang.ArrayIndexOutOfBoundsException: -1
	at org.joda.time.MonthDay.getFieldType(MonthDay.java:426)
	at org.joda.time.chrono.BasicDayOfMonthDateTimeField.getMaximumValue(BasicDayOfMonthDateTimeField.java:33)
	at org.joda.time.chrono.BaseChronology.validate(BaseChronology.java:207)
	at org.joda.time.base.BasePartial.<init>(BasePartial.java:183)
	at org.joda.time.MonthDay.<init>(MonthDay.java:352)
	at org.joda.time.MonthDay.<init>(MonthDay.java:334)
	at org.joda.time.TestMonthDay_Properties.testPropertyGetDayOfMonth(TestMonthDay_Properties.java:177)

testPropertyGetMaxMinValuesDayOfMonth(org.joda.time.TestMonthDay_Properties)  Time elapsed: 0 sec  <<< ERROR!
java.lang.ArrayIndexOutOfBoundsException: -1
	at org.joda.time.MonthDay.getFieldType(MonthDay.java:426)
	at org.joda.time.chrono.BasicDayOfMonthDateTimeField.getMaximumValue(BasicDayOfMonthDateTimeField.java:33)
	at org.joda.time.chrono.BaseChronology.validate(BaseChronology.java:207)
	at org.joda.time.base.BasePartial.<init>(BasePartial.java:183)
	at org.joda.time.MonthDay.<init>(MonthDay.java:352)
	at org.joda.time.MonthDay.<init>(MonthDay.java:334)
	at org.joda.time.TestMonthDay_Properties.testPropertyGetMaxMinValuesDayOfMonth(TestMonthDay_Properties.java:199)

testPropertyAddDayOfMonth(org.joda.time.TestMonthDay_Properties)  Time elapsed: 0.001 sec  <<< ERROR!
java.lang.ArrayIndexOutOfBoundsException: -1
	at org.joda.time.MonthDay.getFieldType(MonthDay.java:426)
	at org.joda.time.chrono.BasicDayOfMonthDateTimeField.getMaximumValue(BasicDayOfMonthDateTimeField.java:33)
	at org.joda.time.chrono.BaseChronology.validate(BaseChronology.java:207)
	at org.joda.time.base.BasePartial.<init>(BasePartial.java:183)
	at org.joda.time.MonthDay.<init>(MonthDay.java:352)
	at org.joda.time.MonthDay.<init>(MonthDay.java:334)
	at org.joda.time.TestMonthDay_Properties.testPropertyAddDayOfMonth(TestMonthDay_Properties.java:207)

testPropertyGetMaxMinValuesMonthOfYear(org.joda.time.TestMonthDay_Properties)  Time elapsed: 0 sec  <<< ERROR!
java.lang.ArrayIndexOutOfBoundsException: -1
	at org.joda.time.MonthDay.getFieldType(MonthDay.java:426)
	at org.joda.time.chrono.BasicDayOfMonthDateTimeField.getMaximumValue(BasicDayOfMonthDateTimeField.java:33)
	at org.joda.time.chrono.BaseChronology.validate(BaseChronology.java:207)
	at org.joda.time.base.BasePartial.<init>(BasePartial.java:183)
	at org.joda.time.MonthDay.<init>(MonthDay.java:352)
	at org.joda.time.MonthDay.<init>(MonthDay.java:334)
	at org.joda.time.TestMonthDay_Properties.testPropertyGetMaxMinValuesMonthOfYear(TestMonthDay_Properties.java:100)

testPropertyEquals(org.joda.time.TestMonthDay_Properties)  Time elapsed: 0.001 sec  <<< ERROR!
java.lang.ArrayIndexOutOfBoundsException: -1
	at org.joda.time.MonthDay.getFieldType(MonthDay.java:426)
	at org.joda.time.chrono.BasicDayOfMonthDateTimeField.getMaximumValue(BasicDayOfMonthDateTimeField.java:33)
	at org.joda.time.chrono.BaseChronology.validate(BaseChronology.java:207)
	at org.joda.time.base.BasePartial.<init>(BasePartial.java:183)
	at org.joda.time.MonthDay.<init>(MonthDay.java:352)
	at org.joda.time.MonthDay.<init>(MonthDay.java:334)
	at org.joda.time.TestMonthDay_Properties.testPropertyEquals(TestMonthDay_Properties.java:290)

testPropertyHashCode(org.joda.time.TestMonthDay_Properties)  Time elapsed: 0 sec  <<< ERROR!
java.lang.ArrayIndexOutOfBoundsException: -1
	at org.joda.time.MonthDay.getFieldType(MonthDay.java:426)
	at org.joda.time.chrono.BasicDayOfMonthDateTimeField.getMaximumValue(BasicDayOfMonthDateTimeField.java:33)
	at org.joda.time.chrono.BaseChronology.validate(BaseChronology.java:207)
	at org.joda.time.base.BasePartial.<init>(BasePartial.java:183)
	at org.joda.time.MonthDay.<init>(MonthDay.java:352)
	at org.joda.time.MonthDay.<init>(MonthDay.java:334)
	at org.joda.time.TestMonthDay_Properties.testPropertyHashCode(TestMonthDay_Properties.java:311)

testMonthDay(org.joda.time.TestStringConvert)  Time elapsed: 0 sec  <<< ERROR!
java.lang.ArrayIndexOutOfBoundsException: -1
	at org.joda.time.MonthDay.getFieldType(MonthDay.java:426)
	at org.joda.time.chrono.BasicDayOfMonthDateTimeField.getMaximumValue(BasicDayOfMonthDateTimeField.java:33)
	at org.joda.time.chrono.BaseChronology.validate(BaseChronology.java:207)
	at org.joda.time.base.BasePartial.<init>(BasePartial.java:183)
	at org.joda.time.MonthDay.<init>(MonthDay.java:352)
	at org.joda.time.MonthDay.<init>(MonthDay.java:334)
	at org.joda.time.TestStringConvert.testMonthDay(TestStringConvert.java:103)

testMonthDay_leapDay(org.joda.time.TestStringConvert)  Time elapsed: 0.001 sec  <<< ERROR!
java.lang.ArrayIndexOutOfBoundsException: -1
	at org.joda.time.MonthDay.getFieldType(MonthDay.java:426)
	at org.joda.time.chrono.BasicDayOfMonthDateTimeField.getMaximumValue(BasicDayOfMonthDateTimeField.java:33)
	at org.joda.time.chrono.BaseChronology.validate(BaseChronology.java:207)
	at org.joda.time.base.BasePartial.<init>(BasePartial.java:183)
	at org.joda.time.MonthDay.<init>(MonthDay.java:352)
	at org.joda.time.MonthDay.<init>(MonthDay.java:334)
	at org.joda.time.TestStringConvert.testMonthDay_leapDay(TestStringConvert.java:110)

testForFields_calBased_MD(org.joda.time.format.TestISODateTimeFormat_Fields)  Time elapsed: 0.001 sec  <<< ERROR!
java.lang.ArrayIndexOutOfBoundsException: -1
	at org.joda.time.Partial.getFieldType(Partial.java:369)
	at org.joda.time.chrono.BasicDayOfMonthDateTimeField.getMaximumValue(BasicDayOfMonthDateTimeField.java:33)
	at org.joda.time.chrono.BaseChronology.validate(BaseChronology.java:207)
	at org.joda.time.Partial.<init>(Partial.java:272)
	at org.joda.time.Partial.<init>(Partial.java:177)
	at org.joda.time.format.TestISODateTimeFormat_Fields.testForFields_calBased_MD(TestISODateTimeFormat_Fields.java:264)


Results :

Tests in error: 
  org.joda.time.TestDays#testFactory_daysBetween_RPartial_MonthDay ArrayIndexOutOfBoundsException
  org.joda.time.TestMonthDay_Basics#testCompareTo ArrayIndexOutOfBoundsException
  org.joda.time.TestMonthDay_Basics#testEqualsHashCode ArrayIndexOutOfBoundsException
  org.joda.time.TestMonthDay_Basics#testIsAfter_MD ArrayIndexOutOfBoundsException
  org.joda.time.TestMonthDay_Basics#testIsBefore_MD ArrayIndexOutOfBoundsException
  org.joda.time.TestMonthDay_Basics#testIsEqual_MD ArrayIndexOutOfBoundsException
  org.joda.time.TestMonthDay_Basics#testMinusDays_int_fromLeap ArrayIndexOutOfBoundsException
  org.joda.time.TestMonthDay_Basics#testMinusDays_int_negativeFromLeap ArrayIndexOutOfBoundsException
  org.joda.time.TestMonthDay_Basics#testMinusDays_int_toLeap ArrayIndexOutOfBoundsException
  org.joda.time.TestMonthDay_Basics#testMinusDays_int_wrapMonth ArrayIndexOutOfBoundsException
  org.joda.time.TestMonthDay_Basics#testMinusDays_int_wrapMonthIntoLastYear ArrayIndexOutOfBoundsException
  org.joda.time.TestMonthDay_Basics#testMinusDays_int_wrapMonthTwice ArrayIndexOutOfBoundsException
  org.joda.time.TestMonthDay_Basics#testMinusDays_int_wrapMonthTwiceIntoLastYear ArrayIndexOutOfBoundsException
  org.joda.time.TestMonthDay_Basics#testMinusMonths_int_adjust ArrayIndexOutOfBoundsException
  org.joda.time.TestMonthDay_Basics#testMinusMonths_int_endOfMonthAdjust ArrayIndexOutOfBoundsException
  org.joda.time.TestMonthDay_Basics#testMinusMonths_int_fromLeap ArrayIndexOutOfBoundsException
  org.joda.time.TestMonthDay_Basics#testMinusMonths_int_negativeEndOfMonthAdjust ArrayIndexOutOfBoundsException
  org.joda.time.TestMonthDay_Basics#testMinusMonths_int_negativeFromLeap ArrayIndexOutOfBoundsException
  org.joda.time.TestMonthDay_Basics#testMinusMonths_int_same ArrayIndexOutOfBoundsException
  org.joda.time.TestMonthDay_Basics#testMinusMonths_int_wrap ArrayIndexOutOfBoundsException
  org.joda.time.TestMonthDay_Basics#testPlusDays_int_fromLeap ArrayIndexOutOfBoundsException
  org.joda.time.TestMonthDay_Basics#testPlusDays_int_negativeFromLeap ArrayIndexOutOfBoundsException
  org.joda.time.TestMonthDay_Basics#testPlusDays_int_toLeap ArrayIndexOutOfBoundsException
  org.joda.time.TestMonthDay_Basics#testPlusDays_int_wrap50 ArrayIndexOutOfBoundsException
  org.joda.time.TestMonthDay_Basics#testPlusDays_int_wrapMonth ArrayIndexOutOfBoundsException
  org.joda.time.TestMonthDay_Basics#testPlusDays_int_wrapMonthIntoNextYear ArrayIndexOutOfBoundsException
  org.joda.time.TestMonthDay_Basics#testPlusDays_int_wrapMonthTwice ArrayIndexOutOfBoundsException
  org.joda.time.TestMonthDay_Basics#testPlusDays_int_wrapMonthTwiceIntoNextYear ArrayIndexOutOfBoundsException
  org.joda.time.TestMonthDay_Basics#testPlusMonths_int_adjust ArrayIndexOutOfBoundsException
  org.joda.time.TestMonthDay_Basics#testPlusMonths_int_endOfMonthAdjust ArrayIndexOutOfBoundsException
  org.joda.time.TestMonthDay_Basics#testPlusMonths_int_fromLeap ArrayIndexOutOfBoundsException
  org.joda.time.TestMonthDay_Basics#testPlusMonths_int_negativeEndOfMonthAdjust ArrayIndexOutOfBoundsException
  org.joda.time.TestMonthDay_Basics#testPlusMonths_int_negativeFromLeap ArrayIndexOutOfBoundsException
  org.joda.time.TestMonthDay_Basics#testPlusMonths_int_same ArrayIndexOutOfBoundsException
  org.joda.time.TestMonthDay_Basics#testPlusMonths_int_wrap ArrayIndexOutOfBoundsException
  org.joda.time.TestMonthDay_Basics#testProperty ArrayIndexOutOfBoundsException ...
  org.joda.time.TestMonthDay_Basics#testToDateTime_nullRI ArrayIndexOutOfBoundsException
  org.joda.time.TestMonthDay_Basics#testToString ArrayIndexOutOfBoundsException ...
  org.joda.time.TestMonthDay_Basics#testToString_DTFormatter ArrayIndexOutOfBoundsException
  org.joda.time.TestMonthDay_Basics#testToString_String ArrayIndexOutOfBoundsException
  org.joda.time.TestMonthDay_Basics#testToString_String_Locale ArrayIndexOutOfBoundsException
  org.joda.time.TestMonthDay_Basics#testWithChronologyRetainFields_nullChrono ArrayIndexOutOfBoundsException
  org.joda.time.TestMonthDay_Basics#testWithField ArrayIndexOutOfBoundsException
  org.joda.time.TestMonthDay_Basics#testWithFieldAdded ArrayIndexOutOfBoundsException
  org.joda.time.TestMonthDay_Basics#testWithFieldAdded_nullField_nonZero ArrayIndexOutOfBoundsException
  org.joda.time.TestMonthDay_Basics#testWithFieldAdded_nullField_zero ArrayIndexOutOfBoundsException
  org.joda.time.TestMonthDay_Basics#testWithFieldAdded_unknownField ArrayIndexOutOfBoundsException
  org.joda.time.TestMonthDay_Basics#testWithFieldAdded_zero ArrayIndexOutOfBoundsException
  org.joda.time.TestMonthDay_Basics#testWithField_nullField ArrayIndexOutOfBoundsException
  org.joda.time.TestMonthDay_Basics#testWithField_same ArrayIndexOutOfBoundsException
  org.joda.time.TestMonthDay_Basics#testWithField_unknownField ArrayIndexOutOfBoundsException
  org.joda.time.TestMonthDay_Basics#testWithers ArrayIndexOutOfBoundsException -...
  org.joda.time.TestMonthDay_Constructors#testConstructor_int_int ArrayIndexOutOfBoundsException
  org.joda.time.TestMonthDay_Constructors#testConstructor_int_int_Chronology ArrayIndexOutOfBoundsException
  org.joda.time.TestMonthDay_Constructors#testConstructor_int_int_nullChronology ArrayIndexOutOfBoundsException
  org.joda.time.TestMonthDay_Constructors#testFactory_FromCalendarFields ArrayIndexOutOfBoundsException
  org.joda.time.TestMonthDay_Constructors#testFactory_FromDateFields ArrayIndexOutOfBoundsException
  org.joda.time.TestMonthDay_Constructors#testParse_formatter ArrayIndexOutOfBoundsException
  org.joda.time.TestMonthDay_Constructors#testParse_noFormatter ArrayIndexOutOfBoundsException
  org.joda.time.TestMonthDay_Properties#testPropertyAddDayOfMonth ArrayIndexOutOfBoundsException
  org.joda.time.TestMonthDay_Properties#testPropertyAddMonthOfYear ArrayIndexOutOfBoundsException
  org.joda.time.TestMonthDay_Properties#testPropertyAddWrapFieldDayOfMonth ArrayIndexOutOfBoundsException
  org.joda.time.TestMonthDay_Properties#testPropertyAddWrapFieldMonthOfYear ArrayIndexOutOfBoundsException
  org.joda.time.TestMonthDay_Properties#testPropertyEquals ArrayIndexOutOfBoundsException
  org.joda.time.TestMonthDay_Properties#testPropertyGetDayOfMonth ArrayIndexOutOfBoundsException
  org.joda.time.TestMonthDay_Properties#testPropertyGetMaxMinValuesDayOfMonth ArrayIndexOutOfBoundsException
  org.joda.time.TestMonthDay_Properties#testPropertyGetMaxMinValuesMonthOfYear ArrayIndexOutOfBoundsException
  org.joda.time.TestMonthDay_Properties#testPropertyGetMonthOfYear ArrayIndexOutOfBoundsException
  org.joda.time.TestMonthDay_Properties#testPropertyHashCode ArrayIndexOutOfBoundsException
  org.joda.time.TestMonthDay_Properties#testPropertySetDayOfMonth ArrayIndexOutOfBoundsException
  org.joda.time.TestMonthDay_Properties#testPropertySetMonthOfYear ArrayIndexOutOfBoundsException
  org.joda.time.TestMonthDay_Properties#testPropertySetTextDayOfMonth ArrayIndexOutOfBoundsException
  org.joda.time.TestMonthDay_Properties#testPropertySetTextMonthOfYear ArrayIndexOutOfBoundsException
  org.joda.time.TestMonths#testFactory_monthsBetween_RPartial_MonthDay ArrayIndexOutOfBoundsException
  org.joda.time.TestStringConvert#testMonthDay ArrayIndexOutOfBoundsException -1
  org.joda.time.TestStringConvert#testMonthDay_leapDay ArrayIndexOutOfBoundsException
  org.joda.time.format.TestISODateTimeFormat_Fields#testForFields_calBased_MD ArrayIndexOutOfBoundsException

Tests run: 4157, Failures: 0, Errors: 77, Skipped: 0

[INFO] ------------------------------------------------------------------------
[INFO] BUILD FAILURE
[INFO] ------------------------------------------------------------------------
[INFO] Total time: 15.349s
[INFO] Finished at: Wed Aug 05 22:29:12 BST 2015
[INFO] Final Memory: 9M/213M
[INFO] ------------------------------------------------------------------------
[ERROR] Failed to execute goal org.apache.maven.plugins:maven-surefire-plugin:2.18.1:test (default-test) on project joda-time: There are test failures.
[ERROR] 
[ERROR] Please refer to /home/perham/Study/LittleDarwin/Cases/joda-time-2.8.1/target/surefire-reports for the individual test results.
[ERROR] -> [Help 1]
[ERROR] 
[ERROR] To see the full stack trace of the errors, re-run Maven with the -e switch.
[ERROR] Re-run Maven using the -X switch to enable full debug logging.
[ERROR] 
[ERROR] For more information about the errors and possible solutions, please read the following articles:
[ERROR] [Help 1] http://cwiki.apache.org/confluence/display/MAVEN/MojoFailureException
