[INFO] Scanning for projects...
[INFO]                                                                         
[INFO] ------------------------------------------------------------------------
[INFO] Building Joda-Time 2.8.1
[INFO] ------------------------------------------------------------------------
[INFO] 
[INFO] --- maven-resources-plugin:2.7:resources (default-resources) @ joda-time ---
[INFO] Using 'UTF-8' encoding to copy filtered resources.
[INFO] Copying 2 resources to META-INF
[INFO] Copying 10 resources
[INFO] 
[INFO] --- maven-compiler-plugin:3.3:compile (default-compile) @ joda-time ---
[INFO] Changes detected - recompiling the module!
[INFO] Compiling 166 source files to /home/perham/Study/LittleDarwin/Cases/joda-time-2.8.1/target/classes
[INFO] 
[INFO] --- exec-maven-plugin:1.4.0:java (compile-tzdb) @ joda-time ---
Writing zoneinfo files
Writing ZoneInfoMap
[INFO] 
[INFO] --- maven-resources-plugin:2.7:testResources (default-testResources) @ joda-time ---
[INFO] Using 'UTF-8' encoding to copy filtered resources.
[INFO] Copying 34 resources
[INFO] 
[INFO] --- maven-compiler-plugin:3.3:testCompile (default-testCompile) @ joda-time ---
[INFO] Nothing to compile - all classes are up to date
[INFO] 
[INFO] --- maven-surefire-plugin:2.18.1:test (default-test) @ joda-time ---
[INFO] Surefire report directory: /home/perham/Study/LittleDarwin/Cases/joda-time-2.8.1/target/surefire-reports

-------------------------------------------------------
 T E S T S
-------------------------------------------------------
Running org.joda.time.TestAllPackages

TestBuddhistChronology.testCalendar

TestCopticChronology.testCalendar

TestEthiopicChronology.testCalendar

TestIslamicChronology.testCalendar

Testing Gregorian chronology over 1000 iterations
Failure index: 0
Test millis: -308262625532
Test value: -49
Test millis2: -46922557997542

Testing Julian chronology over 1000 iterations
Failure index: 0
Test millis: -308262625532
Test value: -49
Test millis2: -46922557997542
Writing zoneinfo files
Writing ZoneInfoMap
Tests run: 4157, Failures: 93, Errors: 4, Skipped: 0, Time elapsed: 3.276 sec <<< FAILURE! - in org.joda.time.TestAllPackages
testGet_DateTimeFieldType(org.joda.time.TestInstant_Basics)  Time elapsed: 0.004 sec  <<< FAILURE!
junit.framework.AssertionFailedError: expected:<7> but was:<6>
	at junit.framework.Assert.fail(Assert.java:47)
	at junit.framework.Assert.failNotEquals(Assert.java:280)
	at junit.framework.Assert.assertEquals(Assert.java:64)
	at junit.framework.Assert.assertEquals(Assert.java:198)
	at junit.framework.Assert.assertEquals(Assert.java:204)
	at org.joda.time.TestInstant_Basics.testGet_DateTimeFieldType(TestInstant_Basics.java:126)

testGet_DateTimeField(org.joda.time.TestInstant_Basics)  Time elapsed: 0.001 sec  <<< FAILURE!
junit.framework.AssertionFailedError: expected:<7> but was:<6>
	at junit.framework.Assert.fail(Assert.java:47)
	at junit.framework.Assert.failNotEquals(Assert.java:280)
	at junit.framework.Assert.assertEquals(Assert.java:64)
	at junit.framework.Assert.assertEquals(Assert.java:198)
	at junit.framework.Assert.assertEquals(Assert.java:204)
	at org.joda.time.TestInstant_Basics.testGet_DateTimeField(TestInstant_Basics.java:156)

testGet_DateTimeFieldType(org.joda.time.TestDateTime_Basics)  Time elapsed: 0.001 sec  <<< FAILURE!
junit.framework.AssertionFailedError: expected:<7> but was:<6>
	at junit.framework.Assert.fail(Assert.java:47)
	at junit.framework.Assert.failNotEquals(Assert.java:280)
	at junit.framework.Assert.assertEquals(Assert.java:64)
	at junit.framework.Assert.assertEquals(Assert.java:198)
	at junit.framework.Assert.assertEquals(Assert.java:204)
	at org.joda.time.TestDateTime_Basics.testGet_DateTimeFieldType(TestDateTime_Basics.java:178)

testGet_DateTimeField(org.joda.time.TestDateTime_Basics)  Time elapsed: 0.001 sec  <<< FAILURE!
junit.framework.AssertionFailedError: expected:<7> but was:<6>
	at junit.framework.Assert.fail(Assert.java:47)
	at junit.framework.Assert.failNotEquals(Assert.java:280)
	at junit.framework.Assert.assertEquals(Assert.java:64)
	at junit.framework.Assert.assertEquals(Assert.java:198)
	at junit.framework.Assert.assertEquals(Assert.java:204)
	at org.joda.time.TestDateTime_Basics.testGet_DateTimeField(TestDateTime_Basics.java:148)

testGetters(org.joda.time.TestDateTime_Basics)  Time elapsed: 0.001 sec  <<< FAILURE!
junit.framework.AssertionFailedError: expected:<7> but was:<6>
	at junit.framework.Assert.fail(Assert.java:47)
	at junit.framework.Assert.failNotEquals(Assert.java:280)
	at junit.framework.Assert.assertEquals(Assert.java:64)
	at junit.framework.Assert.assertEquals(Assert.java:198)
	at junit.framework.Assert.assertEquals(Assert.java:204)
	at org.joda.time.TestDateTime_Basics.testGetters(TestDateTime_Basics.java:241)

testWithers(org.joda.time.TestDateTime_Basics)  Time elapsed: 0.001 sec  <<< FAILURE!
junit.framework.AssertionFailedError: expected:<13> but was:<14>
	at junit.framework.Assert.fail(Assert.java:47)
	at junit.framework.Assert.failNotEquals(Assert.java:280)
	at junit.framework.Assert.assertEquals(Assert.java:64)
	at junit.framework.Assert.assertEquals(Assert.java:198)
	at junit.framework.Assert.assertEquals(Assert.java:204)
	at org.joda.time.TestDateTime_Basics.check(TestDateTime_Basics.java:1286)
	at org.joda.time.TestDateTime_Basics.testWithers(TestDateTime_Basics.java:258)

testToString_String_Locale(org.joda.time.TestDateTime_Basics)  Time elapsed: 0.011 sec  <<< FAILURE!
junit.framework.ComparisonFailure: expected:<S[un] 9/6> but was:<S[at] 9/6>
	at junit.framework.Assert.assertEquals(Assert.java:81)
	at junit.framework.Assert.assertEquals(Assert.java:87)
	at org.joda.time.TestDateTime_Basics.testToString_String_Locale(TestDateTime_Basics.java:518)

testPropertyAddWrapFieldWeekOfWeekyear(org.joda.time.TestDateTime_Properties)  Time elapsed: 0 sec  <<< FAILURE!
junit.framework.ComparisonFailure: expected:<200[3-12-29]T00:00:00.000Z> but was:<200[5-01-03]T00:00:00.000Z>
	at junit.framework.Assert.assertEquals(Assert.java:81)
	at junit.framework.Assert.assertEquals(Assert.java:87)
	at org.joda.time.TestDateTime_Properties.testPropertyAddWrapFieldWeekOfWeekyear(TestDateTime_Properties.java:900)

testPropertySetWeekOfWeekyear(org.joda.time.TestDateTime_Properties)  Time elapsed: 0.001 sec  <<< FAILURE!
junit.framework.ComparisonFailure: expected:<2004-01-[19]T00:00:00.000Z> but was:<2004-01-[26]T00:00:00.000Z>
	at junit.framework.Assert.assertEquals(Assert.java:81)
	at junit.framework.Assert.assertEquals(Assert.java:87)
	at org.joda.time.TestDateTime_Properties.testPropertySetWeekOfWeekyear(TestDateTime_Properties.java:910)

testPropertySetTextWeekOfWeekyear(org.joda.time.TestDateTime_Properties)  Time elapsed: 0.001 sec  <<< FAILURE!
junit.framework.ComparisonFailure: expected:<2004-01-[19]T00:00:00.000Z> but was:<2004-01-[26]T00:00:00.000Z>
	at junit.framework.Assert.assertEquals(Assert.java:81)
	at junit.framework.Assert.assertEquals(Assert.java:87)
	at org.joda.time.TestDateTime_Properties.testPropertySetTextWeekOfWeekyear(TestDateTime_Properties.java:926)

testPropertyGetDayOfWeek(org.joda.time.TestDateTime_Properties)  Time elapsed: 0 sec  <<< FAILURE!
junit.framework.AssertionFailedError: expected:<3> but was:<2>
	at junit.framework.Assert.fail(Assert.java:47)
	at junit.framework.Assert.failNotEquals(Assert.java:280)
	at junit.framework.Assert.assertEquals(Assert.java:64)
	at junit.framework.Assert.assertEquals(Assert.java:198)
	at junit.framework.Assert.assertEquals(Assert.java:204)
	at org.joda.time.TestDateTime_Properties.testPropertyGetDayOfWeek(TestDateTime_Properties.java:958)

testPropertyAddWrapFieldDayOfWeek(org.joda.time.TestDateTime_Properties)  Time elapsed: 0.001 sec  <<< FAILURE!
junit.framework.ComparisonFailure: expected:<2004-06-[07]T00:00:00.000+01:00> but was:<2004-06-[14]T00:00:00.000+01:00>
	at junit.framework.Assert.assertEquals(Assert.java:81)
	at junit.framework.Assert.assertEquals(Assert.java:87)
	at org.joda.time.TestDateTime_Properties.testPropertyAddWrapFieldDayOfWeek(TestDateTime_Properties.java:1028)

testPropertySetDayOfWeek(org.joda.time.TestDateTime_Properties)  Time elapsed: 0 sec  <<< FAILURE!
junit.framework.ComparisonFailure: expected:<2004-06-1[0]T00:00:00.000+01:00> but was:<2004-06-1[1]T00:00:00.000+01:00>
	at junit.framework.Assert.assertEquals(Assert.java:81)
	at junit.framework.Assert.assertEquals(Assert.java:87)
	at org.joda.time.TestDateTime_Properties.testPropertySetDayOfWeek(TestDateTime_Properties.java:1043)

testPropertySetTextDayOfWeek(org.joda.time.TestDateTime_Properties)  Time elapsed: 0.001 sec  <<< FAILURE!
junit.framework.ComparisonFailure: expected:<2004-06-1[0]T00:00:00.000+01:00> but was:<2004-06-1[1]T00:00:00.000+01:00>
	at junit.framework.Assert.assertEquals(Assert.java:81)
	at junit.framework.Assert.assertEquals(Assert.java:87)
	at org.joda.time.TestDateTime_Properties.testPropertySetTextDayOfWeek(TestDateTime_Properties.java:1059)

testGet_DateTimeFieldType(org.joda.time.TestMutableDateTime_Basics)  Time elapsed: 0.001 sec  <<< FAILURE!
junit.framework.AssertionFailedError: expected:<7> but was:<6>
	at junit.framework.Assert.fail(Assert.java:47)
	at junit.framework.Assert.failNotEquals(Assert.java:280)
	at junit.framework.Assert.assertEquals(Assert.java:64)
	at junit.framework.Assert.assertEquals(Assert.java:198)
	at junit.framework.Assert.assertEquals(Assert.java:204)
	at org.joda.time.TestMutableDateTime_Basics.testGet_DateTimeFieldType(TestMutableDateTime_Basics.java:162)

testGet_DateTimeField(org.joda.time.TestMutableDateTime_Basics)  Time elapsed: 0.001 sec  <<< FAILURE!
junit.framework.AssertionFailedError: expected:<7> but was:<6>
	at junit.framework.Assert.fail(Assert.java:47)
	at junit.framework.Assert.failNotEquals(Assert.java:280)
	at junit.framework.Assert.assertEquals(Assert.java:64)
	at junit.framework.Assert.assertEquals(Assert.java:198)
	at junit.framework.Assert.assertEquals(Assert.java:204)
	at org.joda.time.TestMutableDateTime_Basics.testGet_DateTimeField(TestMutableDateTime_Basics.java:132)

testGetMethods(org.joda.time.TestMutableDateTime_Basics)  Time elapsed: 0 sec  <<< FAILURE!
junit.framework.AssertionFailedError: expected:<7> but was:<6>
	at junit.framework.Assert.fail(Assert.java:47)
	at junit.framework.Assert.failNotEquals(Assert.java:280)
	at junit.framework.Assert.assertEquals(Assert.java:64)
	at junit.framework.Assert.assertEquals(Assert.java:198)
	at junit.framework.Assert.assertEquals(Assert.java:204)
	at org.joda.time.TestMutableDateTime_Basics.testGetMethods(TestMutableDateTime_Basics.java:197)

testToString_String_String(org.joda.time.TestMutableDateTime_Basics)  Time elapsed: 0 sec  <<< FAILURE!
junit.framework.ComparisonFailure: expected:<S[un] 9/6> but was:<S[at] 9/6>
	at junit.framework.Assert.assertEquals(Assert.java:81)
	at junit.framework.Assert.assertEquals(Assert.java:87)
	at org.joda.time.TestMutableDateTime_Basics.testToString_String_String(TestMutableDateTime_Basics.java:422)

testSetDayOfWeek_int1(org.joda.time.TestMutableDateTime_Sets)  Time elapsed: 0 sec  <<< FAILURE!
junit.framework.ComparisonFailure: expected:<2002-06-0[7]T05:06:07.008+01:00> but was:<2002-06-0[8]T05:06:07.008+01:00>
	at junit.framework.Assert.assertEquals(Assert.java:81)
	at junit.framework.Assert.assertEquals(Assert.java:87)
	at org.joda.time.TestMutableDateTime_Sets.testSetDayOfWeek_int1(TestMutableDateTime_Sets.java:543)

testPropertyAddWrapFieldWeekOfWeekyear(org.joda.time.TestMutableDateTime_Properties)  Time elapsed: 0 sec  <<< FAILURE!
junit.framework.ComparisonFailure: expected:<200[3-12-29]T00:00:00.000Z> but was:<200[5-01-03]T00:00:00.000Z>
	at junit.framework.Assert.assertEquals(Assert.java:81)
	at junit.framework.Assert.assertEquals(Assert.java:87)
	at org.joda.time.TestMutableDateTime_Properties.testPropertyAddWrapFieldWeekOfWeekyear(TestMutableDateTime_Properties.java:426)

testPropertySetWeekOfWeekyear(org.joda.time.TestMutableDateTime_Properties)  Time elapsed: 0 sec  <<< FAILURE!
junit.framework.ComparisonFailure: expected:<2004-01-[19]T00:00:00.000Z> but was:<2004-01-[26]T00:00:00.000Z>
	at junit.framework.Assert.assertEquals(Assert.java:81)
	at junit.framework.Assert.assertEquals(Assert.java:87)
	at org.joda.time.TestMutableDateTime_Properties.testPropertySetWeekOfWeekyear(TestMutableDateTime_Properties.java:432)

testPropertySetTextWeekOfWeekyear(org.joda.time.TestMutableDateTime_Properties)  Time elapsed: 0.001 sec  <<< FAILURE!
junit.framework.ComparisonFailure: expected:<2004-01-[19]T00:00:00.000Z> but was:<2004-01-[26]T00:00:00.000Z>
	at junit.framework.Assert.assertEquals(Assert.java:81)
	at junit.framework.Assert.assertEquals(Assert.java:87)
	at org.joda.time.TestMutableDateTime_Properties.testPropertySetTextWeekOfWeekyear(TestMutableDateTime_Properties.java:438)

testPropertyGetDayOfWeek(org.joda.time.TestMutableDateTime_Properties)  Time elapsed: 0.001 sec  <<< FAILURE!
junit.framework.AssertionFailedError: expected:<3> but was:<2>
	at junit.framework.Assert.fail(Assert.java:47)
	at junit.framework.Assert.failNotEquals(Assert.java:280)
	at junit.framework.Assert.assertEquals(Assert.java:64)
	at junit.framework.Assert.assertEquals(Assert.java:198)
	at junit.framework.Assert.assertEquals(Assert.java:204)
	at org.joda.time.TestMutableDateTime_Properties.testPropertyGetDayOfWeek(TestMutableDateTime_Properties.java:447)

testPropertyAddWrapFieldDayOfWeek(org.joda.time.TestMutableDateTime_Properties)  Time elapsed: 0.001 sec  <<< FAILURE!
junit.framework.ComparisonFailure: expected:<2004-06-[07]T00:00:00.000+01:00> but was:<2004-06-[14]T00:00:00.000+01:00>
	at junit.framework.Assert.assertEquals(Assert.java:81)
	at junit.framework.Assert.assertEquals(Assert.java:87)
	at org.joda.time.TestMutableDateTime_Properties.testPropertyAddWrapFieldDayOfWeek(TestMutableDateTime_Properties.java:482)

testPropertySetDayOfWeek(org.joda.time.TestMutableDateTime_Properties)  Time elapsed: 0 sec  <<< FAILURE!
junit.framework.ComparisonFailure: expected:<2004-06-1[0]T00:00:00.000+01:00> but was:<2004-06-1[1]T00:00:00.000+01:00>
	at junit.framework.Assert.assertEquals(Assert.java:81)
	at junit.framework.Assert.assertEquals(Assert.java:87)
	at org.joda.time.TestMutableDateTime_Properties.testPropertySetDayOfWeek(TestMutableDateTime_Properties.java:488)

testPropertySetTextDayOfWeek(org.joda.time.TestMutableDateTime_Properties)  Time elapsed: 0.001 sec  <<< FAILURE!
junit.framework.ComparisonFailure: expected:<2004-06-1[0]T00:00:00.000+01:00> but was:<2004-06-1[1]T00:00:00.000+01:00>
	at junit.framework.Assert.assertEquals(Assert.java:81)
	at junit.framework.Assert.assertEquals(Assert.java:87)
	at org.joda.time.TestMutableDateTime_Properties.testPropertySetTextDayOfWeek(TestMutableDateTime_Properties.java:494)

testGet_DateTimeFieldType(org.joda.time.TestDateMidnight_Basics)  Time elapsed: 0 sec  <<< FAILURE!
junit.framework.AssertionFailedError: expected:<7> but was:<6>
	at junit.framework.Assert.fail(Assert.java:47)
	at junit.framework.Assert.failNotEquals(Assert.java:280)
	at junit.framework.Assert.assertEquals(Assert.java:64)
	at junit.framework.Assert.assertEquals(Assert.java:198)
	at junit.framework.Assert.assertEquals(Assert.java:204)
	at org.joda.time.TestDateMidnight_Basics.testGet_DateTimeFieldType(TestDateMidnight_Basics.java:193)

testGet_DateTimeField(org.joda.time.TestDateMidnight_Basics)  Time elapsed: 0 sec  <<< FAILURE!
junit.framework.AssertionFailedError: expected:<7> but was:<6>
	at junit.framework.Assert.fail(Assert.java:47)
	at junit.framework.Assert.failNotEquals(Assert.java:280)
	at junit.framework.Assert.assertEquals(Assert.java:64)
	at junit.framework.Assert.assertEquals(Assert.java:198)
	at junit.framework.Assert.assertEquals(Assert.java:204)
	at org.joda.time.TestDateMidnight_Basics.testGet_DateTimeField(TestDateMidnight_Basics.java:163)

testGetters(org.joda.time.TestDateMidnight_Basics)  Time elapsed: 0.001 sec  <<< FAILURE!
junit.framework.AssertionFailedError: expected:<7> but was:<6>
	at junit.framework.Assert.fail(Assert.java:47)
	at junit.framework.Assert.failNotEquals(Assert.java:280)
	at junit.framework.Assert.assertEquals(Assert.java:64)
	at junit.framework.Assert.assertEquals(Assert.java:198)
	at junit.framework.Assert.assertEquals(Assert.java:204)
	at org.joda.time.TestDateMidnight_Basics.testGetters(TestDateMidnight_Basics.java:229)

testWithers(org.joda.time.TestDateMidnight_Basics)  Time elapsed: 0 sec  <<< FAILURE!
junit.framework.AssertionFailedError: expected:<13> but was:<14>
	at junit.framework.Assert.fail(Assert.java:47)
	at junit.framework.Assert.failNotEquals(Assert.java:280)
	at junit.framework.Assert.assertEquals(Assert.java:64)
	at junit.framework.Assert.assertEquals(Assert.java:198)
	at junit.framework.Assert.assertEquals(Assert.java:204)
	at org.joda.time.TestDateMidnight_Basics.check(TestDateMidnight_Basics.java:1019)
	at org.joda.time.TestDateMidnight_Basics.testWithers(TestDateMidnight_Basics.java:246)

testToString_String_String(org.joda.time.TestDateMidnight_Basics)  Time elapsed: 0.001 sec  <<< FAILURE!
junit.framework.ComparisonFailure: expected:<S[un] 9/6> but was:<S[at] 9/6>
	at junit.framework.Assert.assertEquals(Assert.java:81)
	at junit.framework.Assert.assertEquals(Assert.java:87)
	at org.joda.time.TestDateMidnight_Basics.testToString_String_String(TestDateMidnight_Basics.java:456)

testPropertyGetDayOfWeek(org.joda.time.TestDateMidnight_Properties)  Time elapsed: 0 sec  <<< FAILURE!
junit.framework.AssertionFailedError: expected:<3> but was:<2>
	at junit.framework.Assert.fail(Assert.java:47)
	at junit.framework.Assert.failNotEquals(Assert.java:280)
	at junit.framework.Assert.assertEquals(Assert.java:64)
	at junit.framework.Assert.assertEquals(Assert.java:198)
	at junit.framework.Assert.assertEquals(Assert.java:204)
	at org.joda.time.TestDateMidnight_Properties.testPropertyGetDayOfWeek(TestDateMidnight_Properties.java:459)

testGet_DateTimeFieldType(org.joda.time.TestLocalDateTime_Basics)  Time elapsed: 0.001 sec  <<< FAILURE!
junit.framework.AssertionFailedError: expected:<2> but was:<1>
	at junit.framework.Assert.fail(Assert.java:47)
	at junit.framework.Assert.failNotEquals(Assert.java:280)
	at junit.framework.Assert.assertEquals(Assert.java:64)
	at junit.framework.Assert.assertEquals(Assert.java:198)
	at junit.framework.Assert.assertEquals(Assert.java:204)
	at org.joda.time.TestLocalDateTime_Basics.testGet_DateTimeFieldType(TestLocalDateTime_Basics.java:121)

testGetters(org.joda.time.TestLocalDateTime_Basics)  Time elapsed: 0 sec  <<< FAILURE!
junit.framework.AssertionFailedError: expected:<2> but was:<1>
	at junit.framework.Assert.fail(Assert.java:47)
	at junit.framework.Assert.failNotEquals(Assert.java:280)
	at junit.framework.Assert.assertEquals(Assert.java:64)
	at junit.framework.Assert.assertEquals(Assert.java:198)
	at junit.framework.Assert.assertEquals(Assert.java:204)
	at org.joda.time.TestLocalDateTime_Basics.testGetters(TestLocalDateTime_Basics.java:722)

testWithers(org.joda.time.TestLocalDateTime_Basics)  Time elapsed: 0.001 sec  <<< FAILURE!
junit.framework.AssertionFailedError: expected:<13> but was:<14>
	at junit.framework.Assert.fail(Assert.java:47)
	at junit.framework.Assert.failNotEquals(Assert.java:280)
	at junit.framework.Assert.assertEquals(Assert.java:64)
	at junit.framework.Assert.assertEquals(Assert.java:198)
	at junit.framework.Assert.assertEquals(Assert.java:204)
	at org.joda.time.TestLocalDateTime_Basics.check(TestLocalDateTime_Basics.java:1103)
	at org.joda.time.TestLocalDateTime_Basics.testWithers(TestLocalDateTime_Basics.java:743)

testToString_String_Locale(org.joda.time.TestLocalDateTime_Basics)  Time elapsed: 0.001 sec  <<< FAILURE!
junit.framework.ComparisonFailure: expected:<[Tue] 9/6> but was:<[Mon] 9/6>
	at junit.framework.Assert.assertEquals(Assert.java:81)
	at junit.framework.Assert.assertEquals(Assert.java:87)
	at org.joda.time.TestLocalDateTime_Basics.testToString_String_Locale(TestLocalDateTime_Basics.java:1085)

testGet_DateTimeFieldType(org.joda.time.TestLocalDate_Basics)  Time elapsed: 0.001 sec  <<< FAILURE!
junit.framework.AssertionFailedError: expected:<2> but was:<1>
	at junit.framework.Assert.fail(Assert.java:47)
	at junit.framework.Assert.failNotEquals(Assert.java:280)
	at junit.framework.Assert.assertEquals(Assert.java:64)
	at junit.framework.Assert.assertEquals(Assert.java:198)
	at junit.framework.Assert.assertEquals(Assert.java:204)
	at org.joda.time.TestLocalDate_Basics.testGet_DateTimeFieldType(TestLocalDate_Basics.java:126)

testGetters(org.joda.time.TestLocalDate_Basics)  Time elapsed: 0.001 sec  <<< FAILURE!
junit.framework.AssertionFailedError: expected:<2> but was:<1>
	at junit.framework.Assert.fail(Assert.java:47)
	at junit.framework.Assert.failNotEquals(Assert.java:280)
	at junit.framework.Assert.assertEquals(Assert.java:64)
	at junit.framework.Assert.assertEquals(Assert.java:198)
	at junit.framework.Assert.assertEquals(Assert.java:204)
	at org.joda.time.TestLocalDate_Basics.testGetters(TestLocalDate_Basics.java:629)

testWithers(org.joda.time.TestLocalDate_Basics)  Time elapsed: 0 sec  <<< FAILURE!
junit.framework.AssertionFailedError: expected:<13> but was:<14>
	at junit.framework.Assert.fail(Assert.java:47)
	at junit.framework.Assert.failNotEquals(Assert.java:280)
	at junit.framework.Assert.assertEquals(Assert.java:64)
	at junit.framework.Assert.assertEquals(Assert.java:198)
	at junit.framework.Assert.assertEquals(Assert.java:204)
	at org.joda.time.TestLocalDate_Basics.check(TestLocalDate_Basics.java:1157)
	at org.joda.time.TestLocalDate_Basics.testWithers(TestLocalDate_Basics.java:645)

testToString_String_Locale(org.joda.time.TestLocalDate_Basics)  Time elapsed: 0 sec  <<< FAILURE!
junit.framework.ComparisonFailure: expected:<[Tue] 9/6> but was:<[Mon] 9/6>
	at junit.framework.Assert.assertEquals(Assert.java:81)
	at junit.framework.Assert.assertEquals(Assert.java:87)
	at org.joda.time.TestLocalDate_Basics.testToString_String_Locale(TestLocalDate_Basics.java:1139)

testIsMatch_Instant(org.joda.time.TestPartial_Match)  Time elapsed: 0.001 sec  <<< FAILURE!
junit.framework.AssertionFailedError: expected:<true> but was:<false>
	at junit.framework.Assert.fail(Assert.java:47)
	at junit.framework.Assert.failNotEquals(Assert.java:280)
	at junit.framework.Assert.assertEquals(Assert.java:64)
	at junit.framework.Assert.assertEquals(Assert.java:146)
	at junit.framework.Assert.assertEquals(Assert.java:152)
	at org.joda.time.TestPartial_Match.testIsMatch_Instant(TestPartial_Match.java:99)

testIsMatch_Partial(org.joda.time.TestPartial_Match)  Time elapsed: 0.001 sec  <<< FAILURE!
junit.framework.AssertionFailedError: expected:<true> but was:<false>
	at junit.framework.Assert.fail(Assert.java:47)
	at junit.framework.Assert.failNotEquals(Assert.java:280)
	at junit.framework.Assert.assertEquals(Assert.java:64)
	at junit.framework.Assert.assertEquals(Assert.java:146)
	at junit.framework.Assert.assertEquals(Assert.java:152)
	at org.joda.time.TestPartial_Match.testIsMatch_Partial(TestPartial_Match.java:131)

testWOW(org.joda.time.TestDateTimeComparator)  Time elapsed: 0 sec  <<< FAILURE!
junit.framework.AssertionFailedError: WOWM1a expected:<-1> but was:<1>
	at junit.framework.Assert.fail(Assert.java:47)
	at junit.framework.Assert.failNotEquals(Assert.java:280)
	at junit.framework.Assert.assertEquals(Assert.java:64)
	at junit.framework.Assert.assertEquals(Assert.java:198)
	at org.joda.time.TestDateTimeComparator.testWOW(TestDateTimeComparator.java:525)

testListWOW(org.joda.time.TestDateTimeComparator)  Time elapsed: 0.002 sec  <<< FAILURE!
junit.framework.AssertionFailedError: ListWOW expected:<true> but was:<false>
	at junit.framework.Assert.fail(Assert.java:47)
	at junit.framework.Assert.failNotEquals(Assert.java:280)
	at junit.framework.Assert.assertEquals(Assert.java:64)
	at junit.framework.Assert.assertEquals(Assert.java:146)
	at org.joda.time.TestDateTimeComparator.testListWOW(TestDateTimeComparator.java:771)

testCalendar(org.joda.time.chrono.TestCopticChronology)  Time elapsed: 0.001 sec  <<< FAILURE!
junit.framework.AssertionFailedError: expected:<2> but was:<-5>
	at junit.framework.Assert.fail(Assert.java:47)
	at junit.framework.Assert.failNotEquals(Assert.java:280)
	at junit.framework.Assert.assertEquals(Assert.java:64)
	at junit.framework.Assert.assertEquals(Assert.java:198)
	at junit.framework.Assert.assertEquals(Assert.java:204)
	at org.joda.time.chrono.TestCopticChronology.testCalendar(TestCopticChronology.java:358)

testSampleDate(org.joda.time.chrono.TestCopticChronology)  Time elapsed: 0 sec  <<< FAILURE!
junit.framework.AssertionFailedError: expected:<3> but was:<2>
	at junit.framework.Assert.fail(Assert.java:47)
	at junit.framework.Assert.failNotEquals(Assert.java:280)
	at junit.framework.Assert.assertEquals(Assert.java:64)
	at junit.framework.Assert.assertEquals(Assert.java:198)
	at junit.framework.Assert.assertEquals(Assert.java:204)
	at org.joda.time.chrono.TestCopticChronology.testSampleDate(TestCopticChronology.java:437)

testCalendar(org.joda.time.chrono.TestEthiopicChronology)  Time elapsed: 0 sec  <<< FAILURE!
junit.framework.AssertionFailedError: expected:<2> but was:<-5>
	at junit.framework.Assert.fail(Assert.java:47)
	at junit.framework.Assert.failNotEquals(Assert.java:280)
	at junit.framework.Assert.assertEquals(Assert.java:64)
	at junit.framework.Assert.assertEquals(Assert.java:198)
	at junit.framework.Assert.assertEquals(Assert.java:204)
	at org.joda.time.chrono.TestEthiopicChronology.testCalendar(TestEthiopicChronology.java:358)

testSampleDate(org.joda.time.chrono.TestEthiopicChronology)  Time elapsed: 0.001 sec  <<< FAILURE!
junit.framework.AssertionFailedError: expected:<3> but was:<2>
	at junit.framework.Assert.fail(Assert.java:47)
	at junit.framework.Assert.failNotEquals(Assert.java:280)
	at junit.framework.Assert.assertEquals(Assert.java:64)
	at junit.framework.Assert.assertEquals(Assert.java:198)
	at junit.framework.Assert.assertEquals(Assert.java:204)
	at org.joda.time.chrono.TestEthiopicChronology.testSampleDate(TestEthiopicChronology.java:437)

testCutoverAddWeekyears(org.joda.time.chrono.TestGJChronology)  Time elapsed: 0.001 sec  <<< ERROR!
org.joda.time.IllegalFieldValueException: Cannot parse "1582-W01-1": Value -3 for dayOfWeek must be in the range [1,7]
	at org.joda.time.field.FieldUtils.verifyValueBounds(FieldUtils.java:234)
	at org.joda.time.field.PreciseDurationDateTimeField.set(PreciseDurationDateTimeField.java:79)
	at org.joda.time.chrono.GJChronology.convertByWeekyear(GJChronology.java:96)
	at org.joda.time.chrono.GJChronology.gregorianToJulianByWeekyear(GJChronology.java:589)
	at org.joda.time.chrono.GJChronology$CutoverField.gregorianToJulian(GJChronology.java:929)
	at org.joda.time.chrono.GJChronology$CutoverField.set(GJChronology.java:731)
	at org.joda.time.format.DateTimeParserBucket$SavedField.set(DateTimeParserBucket.java:568)
	at org.joda.time.format.DateTimeParserBucket.computeMillis(DateTimeParserBucket.java:447)
	at org.joda.time.format.DateTimeParserBucket.doParseMillis(DateTimeParserBucket.java:182)
	at org.joda.time.format.DateTimeFormatter.parseMillis(DateTimeFormatter.java:780)
	at org.joda.time.convert.StringConverter.getInstantMillis(StringConverter.java:65)
	at org.joda.time.base.BaseDateTime.<init>(BaseDateTime.java:175)
	at org.joda.time.DateTime.<init>(DateTime.java:302)
	at org.joda.time.chrono.TestGJChronology.testAdd(TestGJChronology.java:482)
	at org.joda.time.chrono.TestGJChronology.testCutoverAddWeekyears(TestGJChronology.java:401)

testCutoverAddWeeks(org.joda.time.chrono.TestGJChronology)  Time elapsed: 0.001 sec  <<< ERROR!
org.joda.time.IllegalFieldValueException: Cannot parse "1582-W01-1": Value -3 for dayOfWeek must be in the range [1,7]
	at org.joda.time.field.FieldUtils.verifyValueBounds(FieldUtils.java:234)
	at org.joda.time.field.PreciseDurationDateTimeField.set(PreciseDurationDateTimeField.java:79)
	at org.joda.time.chrono.GJChronology.convertByWeekyear(GJChronology.java:96)
	at org.joda.time.chrono.GJChronology.gregorianToJulianByWeekyear(GJChronology.java:589)
	at org.joda.time.chrono.GJChronology$CutoverField.gregorianToJulian(GJChronology.java:929)
	at org.joda.time.chrono.GJChronology$CutoverField.set(GJChronology.java:731)
	at org.joda.time.format.DateTimeParserBucket$SavedField.set(DateTimeParserBucket.java:568)
	at org.joda.time.format.DateTimeParserBucket.computeMillis(DateTimeParserBucket.java:447)
	at org.joda.time.format.DateTimeParserBucket.doParseMillis(DateTimeParserBucket.java:182)
	at org.joda.time.format.DateTimeFormatter.parseMillis(DateTimeFormatter.java:780)
	at org.joda.time.convert.StringConverter.getInstantMillis(StringConverter.java:65)
	at org.joda.time.base.BaseDateTime.<init>(BaseDateTime.java:175)
	at org.joda.time.DateTime.<init>(DateTime.java:302)
	at org.joda.time.chrono.TestGJChronology.testAdd(TestGJChronology.java:482)
	at org.joda.time.chrono.TestGJChronology.testCutoverAddWeeks(TestGJChronology.java:448)

testSampleDate2(org.joda.time.chrono.TestIslamicChronology)  Time elapsed: 0.001 sec  <<< FAILURE!
junit.framework.AssertionFailedError: expected:<6> but was:<5>
	at junit.framework.Assert.fail(Assert.java:47)
	at junit.framework.Assert.failNotEquals(Assert.java:280)
	at junit.framework.Assert.assertEquals(Assert.java:64)
	at junit.framework.Assert.assertEquals(Assert.java:198)
	at junit.framework.Assert.assertEquals(Assert.java:204)
	at org.joda.time.chrono.TestIslamicChronology.testSampleDate2(TestIslamicChronology.java:513)

testSampleDate3(org.joda.time.chrono.TestIslamicChronology)  Time elapsed: 0 sec  <<< FAILURE!
junit.framework.AssertionFailedError: expected:<2> but was:<1>
	at junit.framework.Assert.fail(Assert.java:47)
	at junit.framework.Assert.failNotEquals(Assert.java:280)
	at junit.framework.Assert.assertEquals(Assert.java:64)
	at junit.framework.Assert.assertEquals(Assert.java:198)
	at junit.framework.Assert.assertEquals(Assert.java:204)
	at org.joda.time.chrono.TestIslamicChronology.testSampleDate3(TestIslamicChronology.java:569)

testCalendar(org.joda.time.chrono.TestIslamicChronology)  Time elapsed: 0.001 sec  <<< FAILURE!
junit.framework.AssertionFailedError: expected:<2> but was:<-5>
	at junit.framework.Assert.fail(Assert.java:47)
	at junit.framework.Assert.failNotEquals(Assert.java:280)
	at junit.framework.Assert.assertEquals(Assert.java:64)
	at junit.framework.Assert.assertEquals(Assert.java:198)
	at junit.framework.Assert.assertEquals(Assert.java:204)
	at org.joda.time.chrono.TestIslamicChronology.testCalendar(TestIslamicChronology.java:363)

test_plusWeekyears_positiveToZero_crossCutover(org.joda.time.chrono.TestGJDate)  Time elapsed: 0 sec  <<< ERROR!
org.joda.time.IllegalFieldValueException: Value 0 for dayOfWeek must be in the range [1,7]
	at org.joda.time.field.FieldUtils.verifyValueBounds(FieldUtils.java:234)
	at org.joda.time.field.PreciseDurationDateTimeField.set(PreciseDurationDateTimeField.java:79)
	at org.joda.time.chrono.BasicWeekyearDateTimeField.set(BasicWeekyearDateTimeField.java:201)
	at org.joda.time.chrono.BasicWeekyearDateTimeField.add(BasicWeekyearDateTimeField.java:76)
	at org.joda.time.chrono.GJChronology$ImpreciseCutoverField.add(GJChronology.java:1002)
	at org.joda.time.LocalDate$Property.addToCopy(LocalDate.java:1978)
	at org.joda.time.chrono.TestGJDate.test_plusWeekyears_positiveToZero_crossCutover(TestGJDate.java:118)

test_plusWeekyears_positiveToNegative_crossCutover(org.joda.time.chrono.TestGJDate)  Time elapsed: 0.001 sec  <<< ERROR!
org.joda.time.IllegalFieldValueException: Value 0 for dayOfWeek must be in the range [1,7]
	at org.joda.time.field.FieldUtils.verifyValueBounds(FieldUtils.java:234)
	at org.joda.time.field.PreciseDurationDateTimeField.set(PreciseDurationDateTimeField.java:79)
	at org.joda.time.chrono.BasicWeekyearDateTimeField.set(BasicWeekyearDateTimeField.java:201)
	at org.joda.time.chrono.BasicWeekyearDateTimeField.add(BasicWeekyearDateTimeField.java:76)
	at org.joda.time.chrono.GJChronology$ImpreciseCutoverField.add(GJChronology.java:1002)
	at org.joda.time.LocalDate$Property.addToCopy(LocalDate.java:1978)
	at org.joda.time.chrono.TestGJDate.test_plusWeekyears_positiveToNegative_crossCutover(TestGJDate.java:124)

testChronology(org.joda.time.chrono.gj.MainTest)  Time elapsed: 0.002 sec  <<< FAILURE!
junit.framework.AssertionFailedError: Value 0 for dayOfWeek must be in the range [1,7]
	at junit.framework.Assert.fail(Assert.java:47)
	at org.joda.time.chrono.gj.MainTest.testChronology(MainTest.java:158)

testChronology(org.joda.time.chrono.gj.MainTest)  Time elapsed: 0.002 sec  <<< FAILURE!
junit.framework.AssertionFailedError: Value 0 for dayOfWeek must be in the range [1,7]
	at junit.framework.Assert.fail(Assert.java:47)
	at org.joda.time.chrono.gj.MainTest.testChronology(MainTest.java:158)

testGetInstantMillis_Object(org.joda.time.convert.TestStringConverter)  Time elapsed: 0.001 sec  <<< FAILURE!
junit.framework.AssertionFailedError: expected:<1086710400000> but was:<1086796800000>
	at junit.framework.Assert.fail(Assert.java:47)
	at junit.framework.Assert.failNotEquals(Assert.java:280)
	at junit.framework.Assert.assertEquals(Assert.java:64)
	at junit.framework.Assert.assertEquals(Assert.java:133)
	at junit.framework.Assert.assertEquals(Assert.java:139)
	at org.joda.time.convert.TestStringConverter.testGetInstantMillis_Object(TestStringConverter.java:129)

testPrint_simple(org.joda.time.format.TestDateTimeFormatter)  Time elapsed: 0 sec  <<< FAILURE!
junit.framework.ComparisonFailure: expected:<[Wed] 2004-06-09T10:20:30...> but was:<[Tue] 2004-06-09T10:20:30...>
	at junit.framework.Assert.assertEquals(Assert.java:81)
	at junit.framework.Assert.assertEquals(Assert.java:87)
	at org.joda.time.format.TestDateTimeFormatter.testPrint_simple(TestDateTimeFormatter.java:112)

testPrint_locale(org.joda.time.format.TestDateTimeFormatter)  Time elapsed: 0 sec  <<< FAILURE!
junit.framework.ComparisonFailure: expected:<m[e]r. 2004-06-09T10:20:...> but was:<m[a]r. 2004-06-09T10:20:...>
	at junit.framework.Assert.assertEquals(Assert.java:81)
	at junit.framework.Assert.assertEquals(Assert.java:87)
	at org.joda.time.format.TestDateTimeFormatter.testPrint_locale(TestDateTimeFormatter.java:127)

testPrint_zone(org.joda.time.format.TestDateTimeFormatter)  Time elapsed: 0 sec  <<< FAILURE!
junit.framework.ComparisonFailure: expected:<[Wed] 2004-06-09T06:20:30...> but was:<[Tue] 2004-06-09T06:20:30...>
	at junit.framework.Assert.assertEquals(Assert.java:81)
	at junit.framework.Assert.assertEquals(Assert.java:87)
	at org.joda.time.format.TestDateTimeFormatter.testPrint_zone(TestDateTimeFormatter.java:134)

testPrint_chrono(org.joda.time.format.TestDateTimeFormatter)  Time elapsed: 0 sec  <<< FAILURE!
junit.framework.ComparisonFailure: expected:<[Wed] 2004-06-09T12:20:30...> but was:<[Tue] 2004-06-09T12:20:30...>
	at junit.framework.Assert.assertEquals(Assert.java:81)
	at junit.framework.Assert.assertEquals(Assert.java:87)
	at org.joda.time.format.TestDateTimeFormatter.testPrint_chrono(TestDateTimeFormatter.java:148)

testPrint_bufferMethods(org.joda.time.format.TestDateTimeFormatter)  Time elapsed: 0 sec  <<< FAILURE!
junit.framework.ComparisonFailure: expected:<[Wed] 2004-06-09T10:20:30...> but was:<[Tue] 2004-06-09T10:20:30...>
	at junit.framework.Assert.assertEquals(Assert.java:81)
	at junit.framework.Assert.assertEquals(Assert.java:87)
	at org.joda.time.format.TestDateTimeFormatter.testPrint_bufferMethods(TestDateTimeFormatter.java:164)

testPrint_writerMethods(org.joda.time.format.TestDateTimeFormatter)  Time elapsed: 0.001 sec  <<< FAILURE!
junit.framework.ComparisonFailure: expected:<[Wed] 2004-06-09T10:20:30...> but was:<[Tue] 2004-06-09T10:20:30...>
	at junit.framework.Assert.assertEquals(Assert.java:81)
	at junit.framework.Assert.assertEquals(Assert.java:87)
	at org.joda.time.format.TestDateTimeFormatter.testPrint_writerMethods(TestDateTimeFormatter.java:186)

testPrint_appendableMethods(org.joda.time.format.TestDateTimeFormatter)  Time elapsed: 0 sec  <<< FAILURE!
junit.framework.ComparisonFailure: expected:<[Wed] 2004-06-09T10:20:30...> but was:<[Tue] 2004-06-09T10:20:30...>
	at junit.framework.Assert.assertEquals(Assert.java:81)
	at junit.framework.Assert.assertEquals(Assert.java:87)
	at org.joda.time.format.TestDateTimeFormatter.testPrint_appendableMethods(TestDateTimeFormatter.java:208)

testPrint_chrono_and_zone(org.joda.time.format.TestDateTimeFormatter)  Time elapsed: 0.001 sec  <<< FAILURE!
junit.framework.ComparisonFailure: expected:<[Wed] 2004-06-09T10:20:30...> but was:<[Tue] 2004-06-09T10:20:30...>
	at junit.framework.Assert.assertEquals(Assert.java:81)
	at junit.framework.Assert.assertEquals(Assert.java:87)
	at org.joda.time.format.TestDateTimeFormatter.testPrint_chrono_and_zone(TestDateTimeFormatter.java:228)

testParseLocalDate_weekyear_month_week_2010(org.joda.time.format.TestDateTimeFormatter)  Time elapsed: 0.001 sec  <<< FAILURE!
junit.framework.AssertionFailedError: expected:<2010-01-04> but was:<2009-12-28>
	at junit.framework.Assert.fail(Assert.java:47)
	at junit.framework.Assert.failNotEquals(Assert.java:280)
	at junit.framework.Assert.assertEquals(Assert.java:64)
	at junit.framework.Assert.assertEquals(Assert.java:71)
	at org.joda.time.format.TestDateTimeFormatter.testParseLocalDate_weekyear_month_week_2010(TestDateTimeFormatter.java:428)

testParseLocalDate_weekyear_month_week_2011(org.joda.time.format.TestDateTimeFormatter)  Time elapsed: 0.001 sec  <<< FAILURE!
junit.framework.AssertionFailedError: expected:<2011-01-03> but was:<2011-01-10>
	at junit.framework.Assert.fail(Assert.java:47)
	at junit.framework.Assert.failNotEquals(Assert.java:280)
	at junit.framework.Assert.assertEquals(Assert.java:64)
	at junit.framework.Assert.assertEquals(Assert.java:71)
	at org.joda.time.format.TestDateTimeFormatter.testParseLocalDate_weekyear_month_week_2011(TestDateTimeFormatter.java:434)

testParseLocalDate_year_month_week_2010(org.joda.time.format.TestDateTimeFormatter)  Time elapsed: 0.001 sec  <<< FAILURE!
junit.framework.AssertionFailedError: expected:<2010-01-04> but was:<2009-12-28>
	at junit.framework.Assert.fail(Assert.java:47)
	at junit.framework.Assert.failNotEquals(Assert.java:280)
	at junit.framework.Assert.assertEquals(Assert.java:64)
	at junit.framework.Assert.assertEquals(Assert.java:71)
	at org.joda.time.format.TestDateTimeFormatter.testParseLocalDate_year_month_week_2010(TestDateTimeFormatter.java:454)

testParseLocalDate_year_month_week_2016(org.joda.time.format.TestDateTimeFormatter)  Time elapsed: 0.001 sec  <<< FAILURE!
junit.framework.AssertionFailedError: expected:<2016-01-04> but was:<2015-12-28>
	at junit.framework.Assert.fail(Assert.java:47)
	at junit.framework.Assert.failNotEquals(Assert.java:280)
	at junit.framework.Assert.assertEquals(Assert.java:64)
	at junit.framework.Assert.assertEquals(Assert.java:71)
	at org.joda.time.format.TestDateTimeFormatter.testParseLocalDate_year_month_week_2016(TestDateTimeFormatter.java:490)

testParseDateTime_simple_precedence(org.joda.time.format.TestDateTimeFormatter)  Time elapsed: 0.001 sec  <<< FAILURE!
junit.framework.AssertionFailedError: expected:<2004-06-09T11:20:30.000+01:00> but was:<2004-06-10T11:20:30.000+01:00>
	at junit.framework.Assert.fail(Assert.java:47)
	at junit.framework.Assert.failNotEquals(Assert.java:280)
	at junit.framework.Assert.assertEquals(Assert.java:64)
	at junit.framework.Assert.assertEquals(Assert.java:71)
	at org.joda.time.format.TestDateTimeFormatter.testParseDateTime_simple_precedence(TestDateTimeFormatter.java:598)

testParseMutableDateTime_simple_precedence(org.joda.time.format.TestDateTimeFormatter)  Time elapsed: 0.001 sec  <<< FAILURE!
junit.framework.AssertionFailedError: expected:<2004-06-09T11:20:30.000+01:00> but was:<2004-06-10T11:20:30.000+01:00>
	at junit.framework.Assert.fail(Assert.java:47)
	at junit.framework.Assert.failNotEquals(Assert.java:280)
	at junit.framework.Assert.assertEquals(Assert.java:64)
	at junit.framework.Assert.assertEquals(Assert.java:71)
	at org.joda.time.format.TestDateTimeFormatter.testParseMutableDateTime_simple_precedence(TestDateTimeFormatter.java:693)

testParseInto_simple_precedence(org.joda.time.format.TestDateTimeFormatter)  Time elapsed: 0.012 sec  <<< FAILURE!
junit.framework.AssertionFailedError: expected:<2004-06-07T11:20:30.000+01:00> but was:<2004-06-08T11:20:30.000+01:00>
	at junit.framework.Assert.fail(Assert.java:47)
	at junit.framework.Assert.failNotEquals(Assert.java:280)
	at junit.framework.Assert.assertEquals(Assert.java:64)
	at junit.framework.Assert.assertEquals(Assert.java:71)
	at org.joda.time.format.TestDateTimeFormatter.testParseInto_simple_precedence(TestDateTimeFormatter.java:816)

testFormat_weekyearOfEra_twoDigit(org.joda.time.format.TestDateTimeFormat)  Time elapsed: 0 sec  <<< FAILURE!
junit.framework.AssertionFailedError: expected:<2003-12-29T00:00:00.000Z> but was:<2004-01-05T00:00:00.000Z>
	at junit.framework.Assert.fail(Assert.java:47)
	at junit.framework.Assert.failNotEquals(Assert.java:280)
	at junit.framework.Assert.assertEquals(Assert.java:64)
	at junit.framework.Assert.assertEquals(Assert.java:71)
	at org.joda.time.format.TestDateTimeFormat.testFormat_weekyearOfEra_twoDigit(TestDateTimeFormat.java:392)

testFormat_dayOfWeek(org.joda.time.format.TestDateTimeFormat)  Time elapsed: 0.001 sec  <<< FAILURE!
junit.framework.ComparisonFailure: 2004-06-09T10:20:30.040Z expected:<[3]> but was:<[2]>
	at junit.framework.Assert.assertEquals(Assert.java:81)
	at org.joda.time.format.TestDateTimeFormat.testFormat_dayOfWeek(TestDateTimeFormat.java:512)

testFormat_dayOfWeekShortText(org.joda.time.format.TestDateTimeFormat)  Time elapsed: 0 sec  <<< FAILURE!
junit.framework.ComparisonFailure: 2004-06-09T10:20:30.040Z expected:<[Wed]> but was:<[Tue]>
	at junit.framework.Assert.assertEquals(Assert.java:81)
	at org.joda.time.format.TestDateTimeFormat.testFormat_dayOfWeekShortText(TestDateTimeFormat.java:525)

testFormat_dayOfWeekText(org.joda.time.format.TestDateTimeFormat)  Time elapsed: 0.001 sec  <<< FAILURE!
junit.framework.ComparisonFailure: 2004-06-09T10:20:30.040Z expected:<[Wedn]esday> but was:<[Tu]esday>
	at junit.framework.Assert.assertEquals(Assert.java:81)
	at org.joda.time.format.TestDateTimeFormat.testFormat_dayOfWeekText(TestDateTimeFormat.java:541)

testFormatParse_textAdjoiningMonthDOW_UK(org.joda.time.format.TestDateTimeFormat)  Time elapsed: 0 sec  <<< FAILURE!
junit.framework.ComparisonFailure: expected:<$23Jun[Sat]> but was:<$23Jun[Fri]>
	at junit.framework.Assert.assertEquals(Assert.java:81)
	at junit.framework.Assert.assertEquals(Assert.java:87)
	at org.joda.time.format.TestDateTimeFormat.testFormatParse_textAdjoiningMonthDOW_UK(TestDateTimeFormat.java:1134)

testForStyle_fullDate(org.joda.time.format.TestDateTimeFormatStyle)  Time elapsed: 0.001 sec  <<< FAILURE!
junit.framework.ComparisonFailure: expected:<[Wedn]esday, 9 June 2004> but was:<[Tu]esday, 9 June 2004>
	at junit.framework.Assert.assertEquals(Assert.java:81)
	at junit.framework.Assert.assertEquals(Assert.java:87)
	at org.joda.time.format.TestDateTimeFormatStyle.testForStyle_fullDate(TestDateTimeFormatStyle.java:269)

testForStyle_fullDateTime(org.joda.time.format.TestDateTimeFormatStyle)  Time elapsed: 0.001 sec  <<< FAILURE!
junit.framework.ComparisonFailure: expected:<[Wedn]esday, 9 June 2004 1...> but was:<[Tu]esday, 9 June 2004 1...>
	at junit.framework.Assert.assertEquals(Assert.java:81)
	at junit.framework.Assert.assertEquals(Assert.java:87)
	at org.joda.time.format.TestDateTimeFormatStyle.testForStyle_fullDateTime(TestDateTimeFormatStyle.java:295)

testFormat_basicWeekDate(org.joda.time.format.TestISODateTimeFormat)  Time elapsed: 0.001 sec  <<< FAILURE!
junit.framework.ComparisonFailure: expected:<2004W24[3]> but was:<2004W24[2]>
	at junit.framework.Assert.assertEquals(Assert.java:81)
	at junit.framework.Assert.assertEquals(Assert.java:87)
	at org.joda.time.format.TestISODateTimeFormat.testFormat_basicWeekDate(TestISODateTimeFormat.java:387)

testFormat_basicWeekDateTime(org.joda.time.format.TestISODateTimeFormat)  Time elapsed: 0 sec  <<< FAILURE!
junit.framework.ComparisonFailure: expected:<2004W24[3]T102030.040Z> but was:<2004W24[2]T102030.040Z>
	at junit.framework.Assert.assertEquals(Assert.java:81)
	at junit.framework.Assert.assertEquals(Assert.java:87)
	at org.joda.time.format.TestISODateTimeFormat.testFormat_basicWeekDateTime(TestISODateTimeFormat.java:398)

testFormat_basicWeekDateTimeNoMillis(org.joda.time.format.TestISODateTimeFormat)  Time elapsed: 0.001 sec  <<< FAILURE!
junit.framework.ComparisonFailure: expected:<2004W24[3]T102030Z> but was:<2004W24[2]T102030Z>
	at junit.framework.Assert.assertEquals(Assert.java:81)
	at junit.framework.Assert.assertEquals(Assert.java:87)
	at org.joda.time.format.TestISODateTimeFormat.testFormat_basicWeekDateTimeNoMillis(TestISODateTimeFormat.java:409)

testFormat_weekyearWeekDay(org.joda.time.format.TestISODateTimeFormat)  Time elapsed: 0.001 sec  <<< FAILURE!
junit.framework.ComparisonFailure: expected:<2004-W24-[3]> but was:<2004-W24-[2]>
	at junit.framework.Assert.assertEquals(Assert.java:81)
	at junit.framework.Assert.assertEquals(Assert.java:87)
	at org.joda.time.format.TestISODateTimeFormat.testFormat_weekyearWeekDay(TestISODateTimeFormat.java:476)

testFormat_weekDate(org.joda.time.format.TestISODateTimeFormat)  Time elapsed: 0 sec  <<< FAILURE!
junit.framework.ComparisonFailure: expected:<2004-W24-[3]> but was:<2004-W24-[2]>
	at junit.framework.Assert.assertEquals(Assert.java:81)
	at junit.framework.Assert.assertEquals(Assert.java:87)
	at org.joda.time.format.TestISODateTimeFormat.testFormat_weekDate(TestISODateTimeFormat.java:243)

testFormat_weekDateTime(org.joda.time.format.TestISODateTimeFormat)  Time elapsed: 0.001 sec  <<< FAILURE!
junit.framework.ComparisonFailure: expected:<2004-W24-[3]T10:20:30.040Z> but was:<2004-W24-[2]T10:20:30.040Z>
	at junit.framework.Assert.assertEquals(Assert.java:81)
	at junit.framework.Assert.assertEquals(Assert.java:87)
	at org.joda.time.format.TestISODateTimeFormat.testFormat_weekDateTime(TestISODateTimeFormat.java:254)

testFormat_weekDateTimeNoMillis(org.joda.time.format.TestISODateTimeFormat)  Time elapsed: 0.001 sec  <<< FAILURE!
junit.framework.ComparisonFailure: expected:<2004-W24-[3]T10:20:30Z> but was:<2004-W24-[2]T10:20:30Z>
	at junit.framework.Assert.assertEquals(Assert.java:81)
	at junit.framework.Assert.assertEquals(Assert.java:87)
	at org.joda.time.format.TestISODateTimeFormat.testFormat_weekDateTimeNoMillis(TestISODateTimeFormat.java:265)

testSerialization(org.joda.time.tz.TestBuilder)  Time elapsed: 0.009 sec  <<< FAILURE!
junit.framework.AssertionFailedError: expected:<-1633269600000> but was:<-1633356000000>
	at junit.framework.Assert.fail(Assert.java:47)
	at junit.framework.Assert.failNotEquals(Assert.java:280)
	at junit.framework.Assert.assertEquals(Assert.java:64)
	at junit.framework.Assert.assertEquals(Assert.java:133)
	at junit.framework.Assert.assertEquals(Assert.java:139)
	at org.joda.time.tz.TestBuilder.testForwardTransitions(TestBuilder.java:234)
	at org.joda.time.tz.TestBuilder.testSerialization(TestBuilder.java:282)

testForwardTransitions(org.joda.time.tz.TestBuilder)  Time elapsed: 0.008 sec  <<< FAILURE!
junit.framework.AssertionFailedError: expected:<-1633269600000> but was:<-1633356000000>
	at junit.framework.Assert.fail(Assert.java:47)
	at junit.framework.Assert.failNotEquals(Assert.java:280)
	at junit.framework.Assert.assertEquals(Assert.java:64)
	at junit.framework.Assert.assertEquals(Assert.java:133)
	at junit.framework.Assert.assertEquals(Assert.java:139)
	at org.joda.time.tz.TestBuilder.testForwardTransitions(TestBuilder.java:234)
	at org.joda.time.tz.TestBuilder.testForwardTransitions(TestBuilder.java:217)

testReverseTransitions(org.joda.time.tz.TestBuilder)  Time elapsed: 0.007 sec  <<< FAILURE!
junit.framework.AssertionFailedError: expected:<972809999999> but was:<954755999999>
	at junit.framework.Assert.fail(Assert.java:47)
	at junit.framework.Assert.failNotEquals(Assert.java:280)
	at junit.framework.Assert.assertEquals(Assert.java:64)
	at junit.framework.Assert.assertEquals(Assert.java:133)
	at junit.framework.Assert.assertEquals(Assert.java:139)
	at org.joda.time.tz.TestBuilder.testReverseTransitions(TestBuilder.java:270)
	at org.joda.time.tz.TestBuilder.testReverseTransitions(TestBuilder.java:255)

testCompile(org.joda.time.tz.TestCompiler)  Time elapsed: 0.027 sec  <<< FAILURE!
junit.framework.AssertionFailedError: expected:<-1633269600000> but was:<-1633442400000>
	at junit.framework.Assert.fail(Assert.java:47)
	at junit.framework.Assert.failNotEquals(Assert.java:280)
	at junit.framework.Assert.assertEquals(Assert.java:64)
	at junit.framework.Assert.assertEquals(Assert.java:133)
	at junit.framework.Assert.assertEquals(Assert.java:139)
	at org.joda.time.tz.TestBuilder.testForwardTransitions(TestBuilder.java:234)
	at org.joda.time.tz.TestCompiler.testCompile(TestCompiler.java:117)

test_2400_fromDay(org.joda.time.tz.TestCompiler)  Time elapsed: 0.001 sec  <<< FAILURE!
junit.framework.AssertionFailedError: expected:<1> but was:<7>
	at junit.framework.Assert.fail(Assert.java:47)
	at junit.framework.Assert.failNotEquals(Assert.java:280)
	at junit.framework.Assert.assertEquals(Assert.java:64)
	at junit.framework.Assert.assertEquals(Assert.java:198)
	at junit.framework.Assert.assertEquals(Assert.java:204)
	at org.joda.time.tz.TestCompiler.test_2400_fromDay(TestCompiler.java:181)

test_2400_last(org.joda.time.tz.TestCompiler)  Time elapsed: 0 sec  <<< FAILURE!
junit.framework.AssertionFailedError: expected:<1> but was:<7>
	at junit.framework.Assert.fail(Assert.java:47)
	at junit.framework.Assert.failNotEquals(Assert.java:280)
	at junit.framework.Assert.assertEquals(Assert.java:64)
	at junit.framework.Assert.assertEquals(Assert.java:198)
	at junit.framework.Assert.assertEquals(Assert.java:204)
	at org.joda.time.tz.TestCompiler.test_2400_last(TestCompiler.java:191)

test_Amman_2003(org.joda.time.tz.TestCompiler)  Time elapsed: 0.001 sec  <<< FAILURE!
junit.framework.AssertionFailedError: expected:<1048888800000> but was:<1048802400000>
	at junit.framework.Assert.fail(Assert.java:47)
	at junit.framework.Assert.failNotEquals(Assert.java:280)
	at junit.framework.Assert.assertEquals(Assert.java:64)
	at junit.framework.Assert.assertEquals(Assert.java:133)
	at junit.framework.Assert.assertEquals(Assert.java:139)
	at org.joda.time.tz.TestCompiler.test_Amman_2003(TestCompiler.java:210)

test_Amman_2004(org.joda.time.tz.TestCompiler)  Time elapsed: 0 sec  <<< FAILURE!
junit.framework.AssertionFailedError: expected:<1080338400000> but was:<1080252000000>
	at junit.framework.Assert.fail(Assert.java:47)
	at junit.framework.Assert.failNotEquals(Assert.java:280)
	at junit.framework.Assert.assertEquals(Assert.java:64)
	at junit.framework.Assert.assertEquals(Assert.java:133)
	at junit.framework.Assert.assertEquals(Assert.java:139)
	at org.joda.time.tz.TestCompiler.test_Amman_2004(TestCompiler.java:217)

test_Amman_2005(org.joda.time.tz.TestCompiler)  Time elapsed: 0.001 sec  <<< FAILURE!
junit.framework.AssertionFailedError: expected:<1111788000000> but was:<1112306400000>
	at junit.framework.Assert.fail(Assert.java:47)
	at junit.framework.Assert.failNotEquals(Assert.java:280)
	at junit.framework.Assert.assertEquals(Assert.java:64)
	at junit.framework.Assert.assertEquals(Assert.java:133)
	at junit.framework.Assert.assertEquals(Assert.java:139)
	at org.joda.time.tz.TestCompiler.test_Amman_2005(TestCompiler.java:224)

test_Amman_2006(org.joda.time.tz.TestCompiler)  Time elapsed: 0 sec  <<< FAILURE!
junit.framework.AssertionFailedError: expected:<1143842400000> but was:<1143756000000>
	at junit.framework.Assert.fail(Assert.java:47)
	at junit.framework.Assert.failNotEquals(Assert.java:280)
	at junit.framework.Assert.assertEquals(Assert.java:64)
	at junit.framework.Assert.assertEquals(Assert.java:133)
	at junit.framework.Assert.assertEquals(Assert.java:139)
	at org.joda.time.tz.TestCompiler.test_Amman_2006(TestCompiler.java:231)


Results :

Failed tests: 
  org.joda.time.TestDateMidnight_Basics#testGet_DateTimeField AssertionFailedError
  org.joda.time.TestDateMidnight_Basics#testGet_DateTimeFieldType AssertionFailedError
  org.joda.time.TestDateMidnight_Basics#testGetters AssertionFailedError expecte...
  org.joda.time.TestDateMidnight_Basics#testToString_String_String ComparisonFailure
  org.joda.time.TestDateMidnight_Basics#testWithers AssertionFailedError expecte...
  org.joda.time.TestDateMidnight_Properties#testPropertyGetDayOfWeek AssertionFailedError
  org.joda.time.TestDateTimeComparator#testListWOW AssertionFailedError ListWOW ...
  org.joda.time.TestDateTimeComparator#testWOW AssertionFailedError WOWM1a expec...
  org.joda.time.TestDateTime_Basics#testGet_DateTimeField AssertionFailedError e...
  org.joda.time.TestDateTime_Basics#testGet_DateTimeFieldType AssertionFailedError
  org.joda.time.TestDateTime_Basics#testGetters AssertionFailedError expected:<7...
  org.joda.time.TestDateTime_Basics#testToString_String_Locale ComparisonFailure
  org.joda.time.TestDateTime_Basics#testWithers AssertionFailedError expected:<1...
  org.joda.time.TestDateTime_Properties#testPropertyAddWrapFieldDayOfWeek ComparisonFailure
  org.joda.time.TestDateTime_Properties#testPropertyAddWrapFieldWeekOfWeekyear ComparisonFailure
  org.joda.time.TestDateTime_Properties#testPropertyGetDayOfWeek AssertionFailedError
  org.joda.time.TestDateTime_Properties#testPropertySetDayOfWeek ComparisonFailure
  org.joda.time.TestDateTime_Properties#testPropertySetTextDayOfWeek ComparisonFailure
  org.joda.time.TestDateTime_Properties#testPropertySetTextWeekOfWeekyear ComparisonFailure
  org.joda.time.TestDateTime_Properties#testPropertySetWeekOfWeekyear ComparisonFailure
  org.joda.time.TestInstant_Basics#testGet_DateTimeField AssertionFailedError ex...
  org.joda.time.TestInstant_Basics#testGet_DateTimeFieldType AssertionFailedError
  org.joda.time.TestLocalDateTime_Basics#testGet_DateTimeFieldType AssertionFailedError
  org.joda.time.TestLocalDateTime_Basics#testGetters AssertionFailedError expect...
  org.joda.time.TestLocalDateTime_Basics#testToString_String_Locale ComparisonFailure
  org.joda.time.TestLocalDateTime_Basics#testWithers AssertionFailedError expect...
  org.joda.time.TestLocalDate_Basics#testGet_DateTimeFieldType AssertionFailedError
  org.joda.time.TestLocalDate_Basics#testGetters AssertionFailedError expected:<...
  org.joda.time.TestLocalDate_Basics#testToString_String_Locale ComparisonFailure
  org.joda.time.TestLocalDate_Basics#testWithers AssertionFailedError expected:<...
  org.joda.time.TestMutableDateTime_Basics#testGetMethods AssertionFailedError e...
  org.joda.time.TestMutableDateTime_Basics#testGet_DateTimeField AssertionFailedError
  org.joda.time.TestMutableDateTime_Basics#testGet_DateTimeFieldType AssertionFailedError
  org.joda.time.TestMutableDateTime_Basics#testToString_String_String ComparisonFailure
  org.joda.time.TestMutableDateTime_Properties#testPropertyAddWrapFieldDayOfWeek ComparisonFailure
  org.joda.time.TestMutableDateTime_Properties#testPropertyAddWrapFieldWeekOfWeekyear ComparisonFailure
  org.joda.time.TestMutableDateTime_Properties#testPropertyGetDayOfWeek AssertionFailedError
  org.joda.time.TestMutableDateTime_Properties#testPropertySetDayOfWeek ComparisonFailure
  org.joda.time.TestMutableDateTime_Properties#testPropertySetTextDayOfWeek ComparisonFailure
  org.joda.time.TestMutableDateTime_Properties#testPropertySetTextWeekOfWeekyear ComparisonFailure
  org.joda.time.TestMutableDateTime_Properties#testPropertySetWeekOfWeekyear ComparisonFailure
  org.joda.time.TestMutableDateTime_Sets#testSetDayOfWeek_int1 ComparisonFailure
  org.joda.time.TestPartial_Match#testIsMatch_Instant AssertionFailedError expec...
  org.joda.time.TestPartial_Match#testIsMatch_Partial AssertionFailedError expec...
  org.joda.time.chrono.TestCopticChronology#testCalendar AssertionFailedError ex...
  org.joda.time.chrono.TestCopticChronology#testSampleDate AssertionFailedError ...
  org.joda.time.chrono.TestEthiopicChronology#testCalendar AssertionFailedError ...
  org.joda.time.chrono.TestEthiopicChronology#testSampleDate AssertionFailedError
  org.joda.time.chrono.TestIslamicChronology#testCalendar AssertionFailedError e...
  org.joda.time.chrono.TestIslamicChronology#testSampleDate2 AssertionFailedError
  org.joda.time.chrono.TestIslamicChronology#testSampleDate3 AssertionFailedError
org.joda.time.chrono.gj.MainTest.testChronology(org.joda.time.chrono.gj.MainTest)
  Run 1: org.joda.time.chrono.gj.MainTest#testChronology AssertionFailedError Value 0 f...
  Run 2: org.joda.time.chrono.gj.MainTest#testChronology AssertionFailedError Value 0 f...

  org.joda.time.convert.TestStringConverter#testGetInstantMillis_Object AssertionFailedError
  org.joda.time.format.TestDateTimeFormat#testFormatParse_textAdjoiningMonthDOW_UK ComparisonFailure
  org.joda.time.format.TestDateTimeFormat#testFormat_dayOfWeek ComparisonFailure
  org.joda.time.format.TestDateTimeFormat#testFormat_dayOfWeekShortText ComparisonFailure
  org.joda.time.format.TestDateTimeFormat#testFormat_dayOfWeekText ComparisonFailure
  org.joda.time.format.TestDateTimeFormat#testFormat_weekyearOfEra_twoDigit AssertionFailedError
  org.joda.time.format.TestDateTimeFormatStyle#testForStyle_fullDate ComparisonFailure
  org.joda.time.format.TestDateTimeFormatStyle#testForStyle_fullDateTime ComparisonFailure
  org.joda.time.format.TestDateTimeFormatter#testParseDateTime_simple_precedence AssertionFailedError
  org.joda.time.format.TestDateTimeFormatter#testParseInto_simple_precedence AssertionFailedError
  org.joda.time.format.TestDateTimeFormatter#testParseLocalDate_weekyear_month_week_2010 AssertionFailedError
  org.joda.time.format.TestDateTimeFormatter#testParseLocalDate_weekyear_month_week_2011 AssertionFailedError
  org.joda.time.format.TestDateTimeFormatter#testParseLocalDate_year_month_week_2010 AssertionFailedError
  org.joda.time.format.TestDateTimeFormatter#testParseLocalDate_year_month_week_2016 AssertionFailedError
  org.joda.time.format.TestDateTimeFormatter#testParseMutableDateTime_simple_precedence AssertionFailedError
  org.joda.time.format.TestDateTimeFormatter#testPrint_appendableMethods ComparisonFailure
  org.joda.time.format.TestDateTimeFormatter#testPrint_bufferMethods ComparisonFailure
  org.joda.time.format.TestDateTimeFormatter#testPrint_chrono ComparisonFailure ...
  org.joda.time.format.TestDateTimeFormatter#testPrint_chrono_and_zone ComparisonFailure
  org.joda.time.format.TestDateTimeFormatter#testPrint_locale ComparisonFailure ...
  org.joda.time.format.TestDateTimeFormatter#testPrint_simple ComparisonFailure ...
  org.joda.time.format.TestDateTimeFormatter#testPrint_writerMethods ComparisonFailure
  org.joda.time.format.TestDateTimeFormatter#testPrint_zone ComparisonFailure ex...
  org.joda.time.format.TestISODateTimeFormat#testFormat_basicWeekDate ComparisonFailure
  org.joda.time.format.TestISODateTimeFormat#testFormat_basicWeekDateTime ComparisonFailure
  org.joda.time.format.TestISODateTimeFormat#testFormat_basicWeekDateTimeNoMillis ComparisonFailure
  org.joda.time.format.TestISODateTimeFormat#testFormat_weekDate ComparisonFailure
  org.joda.time.format.TestISODateTimeFormat#testFormat_weekDateTime ComparisonFailure
  org.joda.time.format.TestISODateTimeFormat#testFormat_weekDateTimeNoMillis ComparisonFailure
  org.joda.time.format.TestISODateTimeFormat#testFormat_weekyearWeekDay ComparisonFailure
  org.joda.time.tz.TestBuilder#testForwardTransitions AssertionFailedError expec...
  org.joda.time.tz.TestBuilder#testReverseTransitions AssertionFailedError expec...
  org.joda.time.tz.TestBuilder#testSerialization AssertionFailedError expected:<...
  org.joda.time.tz.TestCompiler#testCompile AssertionFailedError expected:<-1633...
  org.joda.time.tz.TestCompiler#test_2400_fromDay AssertionFailedError expected:...
  org.joda.time.tz.TestCompiler#test_2400_last AssertionFailedError expected:<1>...
  org.joda.time.tz.TestCompiler#test_Amman_2003 AssertionFailedError expected:<1...
  org.joda.time.tz.TestCompiler#test_Amman_2004 AssertionFailedError expected:<1...
  org.joda.time.tz.TestCompiler#test_Amman_2005 AssertionFailedError expected:<1...
  org.joda.time.tz.TestCompiler#test_Amman_2006 AssertionFailedError expected:<1...
Tests in error: 
  org.joda.time.chrono.TestGJChronology#testCutoverAddWeeks IllegalFieldValueException
  org.joda.time.chrono.TestGJChronology#testCutoverAddWeekyears IllegalFieldValueException
  org.joda.time.chrono.TestGJDate#test_plusWeekyears_positiveToNegative_crossCutover IllegalFieldValueException
  org.joda.time.chrono.TestGJDate#test_plusWeekyears_positiveToZero_crossCutover IllegalFieldValueException

Tests run: 4156, Failures: 92, Errors: 4, Skipped: 0

[INFO] ------------------------------------------------------------------------
[INFO] BUILD FAILURE
[INFO] ------------------------------------------------------------------------
[INFO] Total time: 13.899s
[INFO] Finished at: Wed Aug 05 22:22:11 BST 2015
[INFO] Final Memory: 9M/213M
[INFO] ------------------------------------------------------------------------
[ERROR] Failed to execute goal org.apache.maven.plugins:maven-surefire-plugin:2.18.1:test (default-test) on project joda-time: There are test failures.
[ERROR] 
[ERROR] Please refer to /home/perham/Study/LittleDarwin/Cases/joda-time-2.8.1/target/surefire-reports for the individual test results.
[ERROR] -> [Help 1]
[ERROR] 
[ERROR] To see the full stack trace of the errors, re-run Maven with the -e switch.
[ERROR] Re-run Maven using the -X switch to enable full debug logging.
[ERROR] 
[ERROR] For more information about the errors and possible solutions, please read the following articles:
[ERROR] [Help 1] http://cwiki.apache.org/confluence/display/MAVEN/MojoFailureException
