[INFO] Scanning for projects...
[INFO]                                                                         
[INFO] ------------------------------------------------------------------------
[INFO] Building Joda-Time 2.8.1
[INFO] ------------------------------------------------------------------------
[INFO] 
[INFO] --- maven-resources-plugin:2.7:resources (default-resources) @ joda-time ---
[INFO] Using 'UTF-8' encoding to copy filtered resources.
[INFO] Copying 2 resources to META-INF
[INFO] Copying 10 resources
[INFO] 
[INFO] --- maven-compiler-plugin:3.3:compile (default-compile) @ joda-time ---
[INFO] Changes detected - recompiling the module!
[INFO] Compiling 166 source files to /home/perham/Study/LittleDarwin/Cases/joda-time-2.8.1/target/classes
[INFO] 
[INFO] --- exec-maven-plugin:1.4.0:java (compile-tzdb) @ joda-time ---
Writing zoneinfo files
Writing ZoneInfoMap
[INFO] 
[INFO] --- maven-resources-plugin:2.7:testResources (default-testResources) @ joda-time ---
[INFO] Using 'UTF-8' encoding to copy filtered resources.
[INFO] Copying 34 resources
[INFO] 
[INFO] --- maven-compiler-plugin:3.3:testCompile (default-testCompile) @ joda-time ---
[INFO] Nothing to compile - all classes are up to date
[INFO] 
[INFO] --- maven-surefire-plugin:2.18.1:test (default-test) @ joda-time ---
[INFO] Surefire report directory: /home/perham/Study/LittleDarwin/Cases/joda-time-2.8.1/target/surefire-reports

-------------------------------------------------------
 T E S T S
-------------------------------------------------------
Running org.joda.time.TestAllPackages

TestBuddhistChronology.testCalendar

TestCopticChronology.testCalendar

TestEthiopicChronology.testCalendar

TestIslamicChronology.testCalendar

Testing Gregorian chronology over 1000 iterations
100% complete (i=1000)

Testing Julian chronology over 1000 iterations
100% complete (i=1000)
Writing zoneinfo files
Writing ZoneInfoMap
Tests run: 4157, Failures: 3, Errors: 13, Skipped: 0, Time elapsed: 4.808 sec <<< FAILURE! - in org.joda.time.TestAllPackages
testSerializedGJChronologyChangedInternals(org.joda.time.TestSerialization)  Time elapsed: 0.004 sec  <<< ERROR!
org.joda.time.IllegalFieldValueException: Value 8 for dayOfWeek must be in the range [1,7]
	at org.joda.time.field.FieldUtils.verifyValueBounds(FieldUtils.java:234)
	at org.joda.time.field.PreciseDurationDateTimeField.set(PreciseDurationDateTimeField.java:79)
	at org.joda.time.chrono.BasicWeekyearDateTimeField.set(BasicWeekyearDateTimeField.java:201)
	at org.joda.time.chrono.BasicWeekyearDateTimeField.add(BasicWeekyearDateTimeField.java:76)
	at org.joda.time.field.BaseDateTimeField.roundCeiling(BaseDateTimeField.java:888)
	at org.joda.time.chrono.GJChronology.assemble(GJChronology.java:561)
	at org.joda.time.chrono.AssembledChronology.setFields(AssembledChronology.java:323)
	at org.joda.time.chrono.AssembledChronology.<init>(AssembledChronology.java:102)
	at org.joda.time.chrono.GJChronology.<init>(GJChronology.java:262)
	at org.joda.time.chrono.GJChronology.getInstance(GJChronology.java:204)
	at org.joda.time.chrono.GJChronology.getInstance(GJChronology.java:209)
	at org.joda.time.chrono.GJChronology.getInstance(GJChronology.java:243)
	at org.joda.time.TestSerialization.testSerializedGJChronologyChangedInternals(TestSerialization.java:249)

testCalendar(org.joda.time.chrono.TestCopticChronology)  Time elapsed: 0.308 sec  <<< FAILURE!
junit.framework.AssertionFailedError: expected:<1> but was:<8>
	at junit.framework.Assert.fail(Assert.java:47)
	at junit.framework.Assert.failNotEquals(Assert.java:280)
	at junit.framework.Assert.assertEquals(Assert.java:64)
	at junit.framework.Assert.assertEquals(Assert.java:198)
	at junit.framework.Assert.assertEquals(Assert.java:204)
	at org.joda.time.chrono.TestCopticChronology.testCalendar(TestCopticChronology.java:358)

testCalendar(org.joda.time.chrono.TestEthiopicChronology)  Time elapsed: 0.277 sec  <<< FAILURE!
junit.framework.AssertionFailedError: expected:<1> but was:<8>
	at junit.framework.Assert.fail(Assert.java:47)
	at junit.framework.Assert.failNotEquals(Assert.java:280)
	at junit.framework.Assert.assertEquals(Assert.java:64)
	at junit.framework.Assert.assertEquals(Assert.java:198)
	at junit.framework.Assert.assertEquals(Assert.java:204)
	at org.joda.time.chrono.TestEthiopicChronology.testCalendar(TestEthiopicChronology.java:358)

testToString(org.joda.time.chrono.TestGJChronology)  Time elapsed: 0.001 sec  <<< ERROR!
org.joda.time.IllegalFieldValueException: Value 8 for dayOfWeek must be in the range [1,7]
	at org.joda.time.field.FieldUtils.verifyValueBounds(FieldUtils.java:234)
	at org.joda.time.field.PreciseDurationDateTimeField.set(PreciseDurationDateTimeField.java:79)
	at org.joda.time.chrono.BasicWeekyearDateTimeField.set(BasicWeekyearDateTimeField.java:201)
	at org.joda.time.chrono.BasicWeekyearDateTimeField.add(BasicWeekyearDateTimeField.java:76)
	at org.joda.time.field.BaseDateTimeField.roundCeiling(BaseDateTimeField.java:888)
	at org.joda.time.chrono.GJChronology.assemble(GJChronology.java:561)
	at org.joda.time.chrono.AssembledChronology.setFields(AssembledChronology.java:323)
	at org.joda.time.chrono.AssembledChronology.<init>(AssembledChronology.java:102)
	at org.joda.time.chrono.GJChronology.<init>(GJChronology.java:262)
	at org.joda.time.chrono.GJChronology.getInstance(GJChronology.java:204)
	at org.joda.time.chrono.GJChronology.getInstance(GJChronology.java:243)
	at org.joda.time.chrono.TestGJChronology.testToString(TestGJChronology.java:194)

testFactory_Zone_long_int(org.joda.time.chrono.TestGJChronology)  Time elapsed: 0.001 sec  <<< ERROR!
org.joda.time.IllegalFieldValueException: Value 8 for dayOfWeek must be in the range [1,7]
	at org.joda.time.field.FieldUtils.verifyValueBounds(FieldUtils.java:234)
	at org.joda.time.field.PreciseDurationDateTimeField.set(PreciseDurationDateTimeField.java:79)
	at org.joda.time.chrono.BasicWeekyearDateTimeField.set(BasicWeekyearDateTimeField.java:201)
	at org.joda.time.chrono.BasicWeekyearDateTimeField.add(BasicWeekyearDateTimeField.java:76)
	at org.joda.time.field.BaseDateTimeField.roundCeiling(BaseDateTimeField.java:888)
	at org.joda.time.chrono.GJChronology.assemble(GJChronology.java:561)
	at org.joda.time.chrono.AssembledChronology.setFields(AssembledChronology.java:323)
	at org.joda.time.chrono.AssembledChronology.<init>(AssembledChronology.java:102)
	at org.joda.time.chrono.GJChronology.<init>(GJChronology.java:262)
	at org.joda.time.chrono.GJChronology.getInstance(GJChronology.java:204)
	at org.joda.time.chrono.GJChronology.getInstance(GJChronology.java:209)
	at org.joda.time.chrono.GJChronology.getInstance(GJChronology.java:243)
	at org.joda.time.chrono.TestGJChronology.testFactory_Zone_long_int(TestGJChronology.java:113)

testFactory_Zone_RI(org.joda.time.chrono.TestGJChronology)  Time elapsed: 0.001 sec  <<< ERROR!
org.joda.time.IllegalFieldValueException: Value 8 for dayOfWeek must be in the range [1,7]
	at org.joda.time.field.FieldUtils.verifyValueBounds(FieldUtils.java:234)
	at org.joda.time.field.PreciseDurationDateTimeField.set(PreciseDurationDateTimeField.java:79)
	at org.joda.time.chrono.BasicWeekyearDateTimeField.set(BasicWeekyearDateTimeField.java:201)
	at org.joda.time.chrono.BasicWeekyearDateTimeField.add(BasicWeekyearDateTimeField.java:76)
	at org.joda.time.field.BaseDateTimeField.roundCeiling(BaseDateTimeField.java:888)
	at org.joda.time.chrono.GJChronology.assemble(GJChronology.java:561)
	at org.joda.time.chrono.AssembledChronology.setFields(AssembledChronology.java:323)
	at org.joda.time.chrono.AssembledChronology.<init>(AssembledChronology.java:102)
	at org.joda.time.chrono.GJChronology.<init>(GJChronology.java:262)
	at org.joda.time.chrono.GJChronology.getInstance(GJChronology.java:204)
	at org.joda.time.chrono.GJChronology.getInstance(GJChronology.java:209)
	at org.joda.time.chrono.GJChronology.getInstance(GJChronology.java:172)
	at org.joda.time.chrono.TestGJChronology.testFactory_Zone_RI(TestGJChronology.java:130)

testFactory_Zone_RI_int(org.joda.time.chrono.TestGJChronology)  Time elapsed: 0.001 sec  <<< ERROR!
org.joda.time.IllegalFieldValueException: Value 8 for dayOfWeek must be in the range [1,7]
	at org.joda.time.field.FieldUtils.verifyValueBounds(FieldUtils.java:234)
	at org.joda.time.field.PreciseDurationDateTimeField.set(PreciseDurationDateTimeField.java:79)
	at org.joda.time.chrono.BasicWeekyearDateTimeField.set(BasicWeekyearDateTimeField.java:201)
	at org.joda.time.chrono.BasicWeekyearDateTimeField.add(BasicWeekyearDateTimeField.java:76)
	at org.joda.time.field.BaseDateTimeField.roundCeiling(BaseDateTimeField.java:888)
	at org.joda.time.chrono.GJChronology.assemble(GJChronology.java:561)
	at org.joda.time.chrono.AssembledChronology.setFields(AssembledChronology.java:323)
	at org.joda.time.chrono.AssembledChronology.<init>(AssembledChronology.java:102)
	at org.joda.time.chrono.GJChronology.<init>(GJChronology.java:262)
	at org.joda.time.chrono.GJChronology.getInstance(GJChronology.java:204)
	at org.joda.time.chrono.GJChronology.getInstance(GJChronology.java:209)
	at org.joda.time.chrono.TestGJChronology.testFactory_Zone_RI_int(TestGJChronology.java:142)

testCalendar(org.joda.time.chrono.TestIslamicChronology)  Time elapsed: 0.48 sec  <<< FAILURE!
junit.framework.AssertionFailedError: expected:<1> but was:<8>
	at junit.framework.Assert.fail(Assert.java:47)
	at junit.framework.Assert.failNotEquals(Assert.java:280)
	at junit.framework.Assert.assertEquals(Assert.java:64)
	at junit.framework.Assert.assertEquals(Assert.java:198)
	at junit.framework.Assert.assertEquals(Assert.java:204)
	at org.joda.time.chrono.TestIslamicChronology.testCalendar(TestIslamicChronology.java:363)

testGetChronology_Object_Zone(org.joda.time.convert.TestCalendarConverter)  Time elapsed: 0.005 sec  <<< ERROR!
org.joda.time.IllegalFieldValueException: Value 8 for dayOfWeek must be in the range [1,7]
	at org.joda.time.field.FieldUtils.verifyValueBounds(FieldUtils.java:234)
	at org.joda.time.field.PreciseDurationDateTimeField.set(PreciseDurationDateTimeField.java:79)
	at org.joda.time.chrono.BasicWeekyearDateTimeField.set(BasicWeekyearDateTimeField.java:201)
	at org.joda.time.chrono.BasicWeekyearDateTimeField.add(BasicWeekyearDateTimeField.java:76)
	at org.joda.time.field.BaseDateTimeField.roundCeiling(BaseDateTimeField.java:888)
	at org.joda.time.chrono.GJChronology.assemble(GJChronology.java:561)
	at org.joda.time.chrono.AssembledChronology.setFields(AssembledChronology.java:323)
	at org.joda.time.chrono.AssembledChronology.<init>(AssembledChronology.java:102)
	at org.joda.time.chrono.GJChronology.<init>(GJChronology.java:262)
	at org.joda.time.chrono.GJChronology.getInstance(GJChronology.java:204)
	at org.joda.time.chrono.GJChronology.getInstance(GJChronology.java:209)
	at org.joda.time.chrono.GJChronology.getInstance(GJChronology.java:243)
	at org.joda.time.convert.TestCalendarConverter.testGetChronology_Object_Zone(TestCalendarConverter.java:108)

testGetChronology_Object_nullChronology(org.joda.time.convert.TestCalendarConverter)  Time elapsed: 0 sec  <<< ERROR!
org.joda.time.IllegalFieldValueException: Value 8 for dayOfWeek must be in the range [1,7]
	at org.joda.time.field.FieldUtils.verifyValueBounds(FieldUtils.java:234)
	at org.joda.time.field.PreciseDurationDateTimeField.set(PreciseDurationDateTimeField.java:79)
	at org.joda.time.chrono.BasicWeekyearDateTimeField.set(BasicWeekyearDateTimeField.java:201)
	at org.joda.time.chrono.BasicWeekyearDateTimeField.add(BasicWeekyearDateTimeField.java:76)
	at org.joda.time.field.BaseDateTimeField.roundCeiling(BaseDateTimeField.java:888)
	at org.joda.time.chrono.GJChronology.assemble(GJChronology.java:561)
	at org.joda.time.chrono.AssembledChronology.setFields(AssembledChronology.java:323)
	at org.joda.time.chrono.AssembledChronology.<init>(AssembledChronology.java:102)
	at org.joda.time.chrono.GJChronology.<init>(GJChronology.java:262)
	at org.joda.time.chrono.GJChronology.getInstance(GJChronology.java:204)
	at org.joda.time.chrono.GJChronology.getInstance(GJChronology.java:209)
	at org.joda.time.chrono.GJChronology.getInstance(GJChronology.java:243)
	at org.joda.time.convert.TestCalendarConverter.testGetChronology_Object_nullChronology(TestCalendarConverter.java:136)

testParseDateTime_simple_precedence(org.joda.time.format.TestDateTimeFormatter)  Time elapsed: 0.001 sec  <<< ERROR!
java.lang.ArrayIndexOutOfBoundsException: 8
	at org.joda.time.chrono.GJLocaleSymbols.dayOfWeekValueToShortText(GJLocaleSymbols.java:213)
	at org.joda.time.chrono.GJDayOfWeekDateTimeField.getAsShortText(GJDayOfWeekDateTimeField.java:79)
	at org.joda.time.field.BaseDateTimeField.getAsShortText(BaseDateTimeField.java:168)
	at org.joda.time.field.AbstractReadableInstantFieldProperty.getAsShortText(AbstractReadableInstantFieldProperty.java:198)
	at org.joda.time.format.DateTimeFormatterBuilder$TextField.parseInto(DateTimeFormatterBuilder.java:1739)
	at org.joda.time.format.DateTimeFormatterBuilder$Composite.parseInto(DateTimeFormatterBuilder.java:2462)
	at org.joda.time.format.DateTimeFormatter.parseDateTime(DateTimeFormatter.java:879)
	at org.joda.time.format.TestDateTimeFormatter.testParseDateTime_simple_precedence(TestDateTimeFormatter.java:598)

testParseMutableDateTime_simple_precedence(org.joda.time.format.TestDateTimeFormatter)  Time elapsed: 0.001 sec  <<< ERROR!
java.lang.ArrayIndexOutOfBoundsException: 8
	at org.joda.time.chrono.GJLocaleSymbols.dayOfWeekValueToShortText(GJLocaleSymbols.java:213)
	at org.joda.time.chrono.GJDayOfWeekDateTimeField.getAsShortText(GJDayOfWeekDateTimeField.java:79)
	at org.joda.time.field.BaseDateTimeField.getAsShortText(BaseDateTimeField.java:168)
	at org.joda.time.field.AbstractReadableInstantFieldProperty.getAsShortText(AbstractReadableInstantFieldProperty.java:198)
	at org.joda.time.format.DateTimeFormatterBuilder$TextField.parseInto(DateTimeFormatterBuilder.java:1739)
	at org.joda.time.format.DateTimeFormatterBuilder$Composite.parseInto(DateTimeFormatterBuilder.java:2462)
	at org.joda.time.format.DateTimeFormatter.parseDateTime(DateTimeFormatter.java:879)
	at org.joda.time.format.TestDateTimeFormatter.testParseMutableDateTime_simple_precedence(TestDateTimeFormatter.java:693)

testParseInto_simple_precedence(org.joda.time.format.TestDateTimeFormatter)  Time elapsed: 0.001 sec  <<< ERROR!
java.lang.ArrayIndexOutOfBoundsException: 8
	at org.joda.time.chrono.GJLocaleSymbols.dayOfWeekValueToShortText(GJLocaleSymbols.java:213)
	at org.joda.time.chrono.GJDayOfWeekDateTimeField.getAsShortText(GJDayOfWeekDateTimeField.java:79)
	at org.joda.time.field.BaseDateTimeField.getAsShortText(BaseDateTimeField.java:168)
	at org.joda.time.field.AbstractReadableInstantFieldProperty.getAsShortText(AbstractReadableInstantFieldProperty.java:198)
	at org.joda.time.format.DateTimeFormatterBuilder$TextField.parseInto(DateTimeFormatterBuilder.java:1739)
	at org.joda.time.format.DateTimeFormatterBuilder$Composite.parseInto(DateTimeFormatterBuilder.java:2462)
	at org.joda.time.format.DateTimeFormatter.parseInto(DateTimeFormatter.java:748)
	at org.joda.time.format.TestDateTimeFormatter.testParseInto_simple_precedence(TestDateTimeFormatter.java:815)

testPrinterParserMethods(org.joda.time.format.TestDateTimeFormatter)  Time elapsed: 0.002 sec  <<< ERROR!
java.lang.ArrayIndexOutOfBoundsException: 8
	at org.joda.time.chrono.GJLocaleSymbols.dayOfWeekValueToShortText(GJLocaleSymbols.java:213)
	at org.joda.time.chrono.GJDayOfWeekDateTimeField.getAsShortText(GJDayOfWeekDateTimeField.java:79)
	at org.joda.time.field.BaseDateTimeField.getAsShortText(BaseDateTimeField.java:168)
	at org.joda.time.field.AbstractReadableInstantFieldProperty.getAsShortText(AbstractReadableInstantFieldProperty.java:198)
	at org.joda.time.format.DateTimeFormatterBuilder$TextField.parseInto(DateTimeFormatterBuilder.java:1739)
	at org.joda.time.format.DateTimeFormatterBuilder$Composite.parseInto(DateTimeFormatterBuilder.java:2462)
	at org.joda.time.format.InternalParserDateTimeParser.parseInto(InternalParserDateTimeParser.java:52)
	at org.joda.time.format.DateTimeFormatter.parseDateTime(DateTimeFormatter.java:879)
	at org.joda.time.format.TestDateTimeFormatter.testPrinterParserMethods(TestDateTimeFormatter.java:338)

testFormatParse_textMonthApr_Korean(org.joda.time.format.TestDateTimeFormat)  Time elapsed: 0.006 sec  <<< ERROR!
java.lang.ArrayIndexOutOfBoundsException: 8
	at org.joda.time.chrono.GJLocaleSymbols.dayOfWeekValueToShortText(GJLocaleSymbols.java:213)
	at org.joda.time.chrono.GJDayOfWeekDateTimeField.getAsShortText(GJDayOfWeekDateTimeField.java:79)
	at org.joda.time.field.BaseDateTimeField.getAsShortText(BaseDateTimeField.java:168)
	at org.joda.time.field.AbstractReadableInstantFieldProperty.getAsShortText(AbstractReadableInstantFieldProperty.java:198)
	at org.joda.time.format.DateTimeFormatterBuilder$TextField.parseInto(DateTimeFormatterBuilder.java:1739)
	at org.joda.time.format.DateTimeFormatterBuilder$Composite.parseInto(DateTimeFormatterBuilder.java:2462)
	at org.joda.time.format.DateTimeFormatter.parseDateTime(DateTimeFormatter.java:879)
	at org.joda.time.format.TestDateTimeFormat.testFormatParse_textMonthApr_Korean(TestDateTimeFormat.java:992)

testFormatParse_textAdjoiningMonthDOW_UK(org.joda.time.format.TestDateTimeFormat)  Time elapsed: 0.001 sec  <<< ERROR!
java.lang.ArrayIndexOutOfBoundsException: 8
	at org.joda.time.chrono.GJLocaleSymbols.dayOfWeekValueToShortText(GJLocaleSymbols.java:213)
	at org.joda.time.chrono.GJDayOfWeekDateTimeField.getAsShortText(GJDayOfWeekDateTimeField.java:79)
	at org.joda.time.field.BaseDateTimeField.getAsShortText(BaseDateTimeField.java:168)
	at org.joda.time.field.AbstractReadableInstantFieldProperty.getAsShortText(AbstractReadableInstantFieldProperty.java:198)
	at org.joda.time.format.DateTimeFormatterBuilder$TextField.parseInto(DateTimeFormatterBuilder.java:1739)
	at org.joda.time.format.DateTimeFormatterBuilder$Composite.parseInto(DateTimeFormatterBuilder.java:2462)
	at org.joda.time.format.DateTimeFormatter.parseDateTime(DateTimeFormatter.java:879)
	at org.joda.time.format.TestDateTimeFormat.testFormatParse_textAdjoiningMonthDOW_UK(TestDateTimeFormat.java:1135)


Results :

Failed tests: 
  org.joda.time.chrono.TestCopticChronology#testCalendar AssertionFailedError ex...
  org.joda.time.chrono.TestEthiopicChronology#testCalendar AssertionFailedError ...
  org.joda.time.chrono.TestIslamicChronology#testCalendar AssertionFailedError e...
Tests in error: 
  org.joda.time.TestSerialization#testSerializedGJChronologyChangedInternals IllegalFieldValueException
  org.joda.time.chrono.TestGJChronology#testFactory_Zone_RI IllegalFieldValueException
  org.joda.time.chrono.TestGJChronology#testFactory_Zone_RI_int IllegalFieldValueException
  org.joda.time.chrono.TestGJChronology#testFactory_Zone_long_int IllegalFieldValueException
  org.joda.time.chrono.TestGJChronology#testToString IllegalFieldValueException ...
  org.joda.time.convert.TestCalendarConverter#testGetChronology_Object_Zone IllegalFieldValueException
  org.joda.time.convert.TestCalendarConverter#testGetChronology_Object_nullChronology IllegalFieldValueException
  org.joda.time.format.TestDateTimeFormat#testFormatParse_textAdjoiningMonthDOW_UK ArrayIndexOutOfBoundsException
  org.joda.time.format.TestDateTimeFormat#testFormatParse_textMonthApr_Korean ArrayIndexOutOfBoundsException
  org.joda.time.format.TestDateTimeFormatter#testParseDateTime_simple_precedence ArrayIndexOutOfBoundsException
  org.joda.time.format.TestDateTimeFormatter#testParseInto_simple_precedence ArrayIndexOutOfBoundsException
  org.joda.time.format.TestDateTimeFormatter#testParseMutableDateTime_simple_precedence ArrayIndexOutOfBoundsException
  org.joda.time.format.TestDateTimeFormatter#testPrinterParserMethods ArrayIndexOutOfBoundsException

Tests run: 4157, Failures: 3, Errors: 13, Skipped: 0

[INFO] ------------------------------------------------------------------------
[INFO] BUILD FAILURE
[INFO] ------------------------------------------------------------------------
[INFO] Total time: 15.661s
[INFO] Finished at: Wed Aug 05 22:16:37 BST 2015
[INFO] Final Memory: 9M/213M
[INFO] ------------------------------------------------------------------------
[ERROR] Failed to execute goal org.apache.maven.plugins:maven-surefire-plugin:2.18.1:test (default-test) on project joda-time: There are test failures.
[ERROR] 
[ERROR] Please refer to /home/perham/Study/LittleDarwin/Cases/joda-time-2.8.1/target/surefire-reports for the individual test results.
[ERROR] -> [Help 1]
[ERROR] 
[ERROR] To see the full stack trace of the errors, re-run Maven with the -e switch.
[ERROR] Re-run Maven using the -X switch to enable full debug logging.
[ERROR] 
[ERROR] For more information about the errors and possible solutions, please read the following articles:
[ERROR] [Help 1] http://cwiki.apache.org/confluence/display/MAVEN/MojoFailureException
