[INFO] Scanning for projects...
[INFO]                                                                         
[INFO] ------------------------------------------------------------------------
[INFO] Building Joda-Time 2.8.1
[INFO] ------------------------------------------------------------------------
[INFO] 
[INFO] --- maven-resources-plugin:2.7:resources (default-resources) @ joda-time ---
[INFO] Using 'UTF-8' encoding to copy filtered resources.
[INFO] Copying 2 resources to META-INF
[INFO] Copying 10 resources
[INFO] 
[INFO] --- maven-compiler-plugin:3.3:compile (default-compile) @ joda-time ---
[INFO] Changes detected - recompiling the module!
[INFO] Compiling 166 source files to /home/perham/Study/LittleDarwin/Cases/joda-time-2.8.1/target/classes
[INFO] 
[INFO] --- exec-maven-plugin:1.4.0:java (compile-tzdb) @ joda-time ---
Writing zoneinfo files
Writing ZoneInfoMap
[INFO] 
[INFO] --- maven-resources-plugin:2.7:testResources (default-testResources) @ joda-time ---
[INFO] Using 'UTF-8' encoding to copy filtered resources.
[INFO] Copying 34 resources
[INFO] 
[INFO] --- maven-compiler-plugin:3.3:testCompile (default-testCompile) @ joda-time ---
[INFO] Nothing to compile - all classes are up to date
[INFO] 
[INFO] --- maven-surefire-plugin:2.18.1:test (default-test) @ joda-time ---
[INFO] Surefire report directory: /home/perham/Study/LittleDarwin/Cases/joda-time-2.8.1/target/surefire-reports

-------------------------------------------------------
 T E S T S
-------------------------------------------------------
Running org.joda.time.TestAllPackages

TestBuddhistChronology.testCalendar

TestCopticChronology.testCalendar

TestEthiopicChronology.testCalendar

TestIslamicChronology.testCalendar

Testing Gregorian chronology over 1000 iterations
100% complete (i=1000)

Testing Julian chronology over 1000 iterations
100% complete (i=1000)
Writing zoneinfo files
Writing ZoneInfoMap
Tests run: 4157, Failures: 264, Errors: 0, Skipped: 0, Time elapsed: 5.396 sec <<< FAILURE! - in org.joda.time.TestAllPackages
testConstructor_long_max(org.joda.time.TestDateTime_Constructors)  Time elapsed: 0.003 sec  <<< FAILURE!
junit.framework.AssertionFailedError
	at junit.framework.Assert.fail(Assert.java:47)
	at junit.framework.Assert.fail(Assert.java:53)
	at org.joda.time.TestDateTime_Constructors.testConstructor_long_max(TestDateTime_Constructors.java:255)

testWithers(org.joda.time.TestDateTime_Basics)  Time elapsed: 0.001 sec  <<< FAILURE!
junit.framework.AssertionFailedError: expected:<30> but was:<29>
	at junit.framework.Assert.fail(Assert.java:47)
	at junit.framework.Assert.failNotEquals(Assert.java:280)
	at junit.framework.Assert.assertEquals(Assert.java:64)
	at junit.framework.Assert.assertEquals(Assert.java:198)
	at junit.framework.Assert.assertEquals(Assert.java:204)
	at org.joda.time.TestDateTime_Basics.check(TestDateTime_Basics.java:1289)
	at org.joda.time.TestDateTime_Basics.testWithers(TestDateTime_Basics.java:254)

testPropertyRoundHalfFloorHourOfDay(org.joda.time.TestDateTime_Properties)  Time elapsed: 0.002 sec  <<< FAILURE!
junit.framework.ComparisonFailure: expected:<2004-06-09T1[4]:00:00.000+01:00> but was:<2004-06-09T1[3]:00:00.000+01:00>
	at junit.framework.Assert.assertEquals(Assert.java:81)
	at junit.framework.Assert.assertEquals(Assert.java:87)
	at org.joda.time.TestDateTime_Properties.testPropertyRoundHalfFloorHourOfDay(TestDateTime_Properties.java:1141)

testPropertyRoundHalfCeilingHourOfDay(org.joda.time.TestDateTime_Properties)  Time elapsed: 0.002 sec  <<< FAILURE!
junit.framework.ComparisonFailure: expected:<2004-06-09T1[4]:00:00.000+01:00> but was:<2004-06-09T1[3]:00:00.000+01:00>
	at junit.framework.Assert.assertEquals(Assert.java:81)
	at junit.framework.Assert.assertEquals(Assert.java:87)
	at org.joda.time.TestDateTime_Properties.testPropertyRoundHalfCeilingHourOfDay(TestDateTime_Properties.java:1155)

testPropertyRoundHalfEvenHourOfDay(org.joda.time.TestDateTime_Properties)  Time elapsed: 0.001 sec  <<< FAILURE!
junit.framework.ComparisonFailure: expected:<2004-06-09T1[4]:00:00.000+01:00> but was:<2004-06-09T1[3]:00:00.000+01:00>
	at junit.framework.Assert.assertEquals(Assert.java:81)
	at junit.framework.Assert.assertEquals(Assert.java:87)
	at org.joda.time.TestDateTime_Properties.testPropertyRoundHalfEvenHourOfDay(TestDateTime_Properties.java:1173)

testPropertyGetSecondOfMinute(org.joda.time.TestDateTime_Properties)  Time elapsed: 0.001 sec  <<< FAILURE!
junit.framework.AssertionFailedError: expected:<43> but was:<42>
	at junit.framework.Assert.fail(Assert.java:47)
	at junit.framework.Assert.failNotEquals(Assert.java:280)
	at junit.framework.Assert.assertEquals(Assert.java:64)
	at junit.framework.Assert.assertEquals(Assert.java:198)
	at junit.framework.Assert.assertEquals(Assert.java:204)
	at org.joda.time.TestDateTime_Properties.testPropertyGetSecondOfMinute(TestDateTime_Properties.java:1230)

testPropertyGetSecondOfDay(org.joda.time.TestDateTime_Properties)  Time elapsed: 0.002 sec  <<< FAILURE!
junit.framework.AssertionFailedError: expected:<48223> but was:<48222>
	at junit.framework.Assert.fail(Assert.java:47)
	at junit.framework.Assert.failNotEquals(Assert.java:280)
	at junit.framework.Assert.assertEquals(Assert.java:64)
	at junit.framework.Assert.assertEquals(Assert.java:198)
	at junit.framework.Assert.assertEquals(Assert.java:204)
	at org.joda.time.TestDateTime_Properties.testPropertyGetSecondOfDay(TestDateTime_Properties.java:1249)

testPropertyGetMillisOfSecond(org.joda.time.TestDateTime_Properties)  Time elapsed: 0.001 sec  <<< FAILURE!
junit.framework.AssertionFailedError: expected:<53> but was:<947>
	at junit.framework.Assert.fail(Assert.java:47)
	at junit.framework.Assert.failNotEquals(Assert.java:280)
	at junit.framework.Assert.assertEquals(Assert.java:64)
	at junit.framework.Assert.assertEquals(Assert.java:198)
	at junit.framework.Assert.assertEquals(Assert.java:204)
	at org.joda.time.TestDateTime_Properties.testPropertyGetMillisOfSecond(TestDateTime_Properties.java:1268)

testPropertyGetMillisOfDay(org.joda.time.TestDateTime_Properties)  Time elapsed: 0.001 sec  <<< FAILURE!
junit.framework.AssertionFailedError: expected:<48223053> but was:<48222947>
	at junit.framework.Assert.fail(Assert.java:47)
	at junit.framework.Assert.failNotEquals(Assert.java:280)
	at junit.framework.Assert.assertEquals(Assert.java:64)
	at junit.framework.Assert.assertEquals(Assert.java:198)
	at junit.framework.Assert.assertEquals(Assert.java:204)
	at org.joda.time.TestDateTime_Properties.testPropertyGetMillisOfDay(TestDateTime_Properties.java:1287)

testPropertyToIntervalSecondOfMinute(org.joda.time.TestDateTime_Properties)  Time elapsed: 0.001 sec  <<< FAILURE!
junit.framework.AssertionFailedError: expected:<2004-06-09T13:23:43.000+01:00> but was:<2004-06-09T13:23:42.000+01:00>
	at junit.framework.Assert.fail(Assert.java:47)
	at junit.framework.Assert.failNotEquals(Assert.java:280)
	at junit.framework.Assert.assertEquals(Assert.java:64)
	at junit.framework.Assert.assertEquals(Assert.java:71)
	at org.joda.time.TestDateTime_Properties.testPropertyToIntervalSecondOfMinute(TestDateTime_Properties.java:1362)

testPropertyToIntervalMillisOfSecond(org.joda.time.TestDateTime_Properties)  Time elapsed: 0 sec  <<< FAILURE!
junit.framework.AssertionFailedError: expected:<2004-06-09T13:23:42.946+01:00> but was:<2004-06-09T13:23:42.948+01:00>
	at junit.framework.Assert.fail(Assert.java:47)
	at junit.framework.Assert.failNotEquals(Assert.java:280)
	at junit.framework.Assert.assertEquals(Assert.java:64)
	at junit.framework.Assert.assertEquals(Assert.java:71)
	at org.joda.time.TestDateTime_Properties.testPropertyToIntervalMillisOfSecond(TestDateTime_Properties.java:1370)

testRounding6(org.joda.time.TestMutableDateTime_Basics)  Time elapsed: 0 sec  <<< FAILURE!
junit.framework.ComparisonFailure: expected:<2002-06-09T05:06:0[7.008]+01:00> but was:<2002-06-09T05:06:0[6.992]+01:00>
	at junit.framework.Assert.assertEquals(Assert.java:81)
	at junit.framework.Assert.assertEquals(Assert.java:87)
	at org.joda.time.TestMutableDateTime_Basics.testRounding6(TestMutableDateTime_Basics.java:687)

testSetDate_int_int_int1(org.joda.time.TestMutableDateTime_Sets)  Time elapsed: 0.001 sec  <<< FAILURE!
junit.framework.AssertionFailedError: expected:<48> but was:<47>
	at junit.framework.Assert.fail(Assert.java:47)
	at junit.framework.Assert.failNotEquals(Assert.java:280)
	at junit.framework.Assert.assertEquals(Assert.java:64)
	at junit.framework.Assert.assertEquals(Assert.java:198)
	at junit.framework.Assert.assertEquals(Assert.java:204)
	at org.joda.time.TestMutableDateTime_Sets.testSetDate_int_int_int1(TestMutableDateTime_Sets.java:225)

testSetDate_long1(org.joda.time.TestMutableDateTime_Sets)  Time elapsed: 0.001 sec  <<< FAILURE!
junit.framework.AssertionFailedError: expected:<48> but was:<47>
	at junit.framework.Assert.fail(Assert.java:47)
	at junit.framework.Assert.failNotEquals(Assert.java:280)
	at junit.framework.Assert.assertEquals(Assert.java:64)
	at junit.framework.Assert.assertEquals(Assert.java:198)
	at junit.framework.Assert.assertEquals(Assert.java:204)
	at org.joda.time.TestMutableDateTime_Sets.testSetDate_long1(TestMutableDateTime_Sets.java:248)

testSetDate_RI1(org.joda.time.TestMutableDateTime_Sets)  Time elapsed: 0 sec  <<< FAILURE!
junit.framework.AssertionFailedError: expected:<48> but was:<47>
	at junit.framework.Assert.fail(Assert.java:47)
	at junit.framework.Assert.failNotEquals(Assert.java:280)
	at junit.framework.Assert.assertEquals(Assert.java:64)
	at junit.framework.Assert.assertEquals(Assert.java:198)
	at junit.framework.Assert.assertEquals(Assert.java:204)
	at org.joda.time.TestMutableDateTime_Sets.testSetDate_RI1(TestMutableDateTime_Sets.java:262)

testSetDate_RI2(org.joda.time.TestMutableDateTime_Sets)  Time elapsed: 0.001 sec  <<< FAILURE!
junit.framework.AssertionFailedError: expected:<48> but was:<47>
	at junit.framework.Assert.fail(Assert.java:47)
	at junit.framework.Assert.failNotEquals(Assert.java:280)
	at junit.framework.Assert.assertEquals(Assert.java:64)
	at junit.framework.Assert.assertEquals(Assert.java:198)
	at junit.framework.Assert.assertEquals(Assert.java:204)
	at org.joda.time.TestMutableDateTime_Sets.testSetDate_RI2(TestMutableDateTime_Sets.java:274)

testSetDate_RI_same(org.joda.time.TestMutableDateTime_Sets)  Time elapsed: 0.001 sec  <<< FAILURE!
junit.framework.AssertionFailedError: expected:<48> but was:<47>
	at junit.framework.Assert.fail(Assert.java:47)
	at junit.framework.Assert.failNotEquals(Assert.java:280)
	at junit.framework.Assert.assertEquals(Assert.java:64)
	at junit.framework.Assert.assertEquals(Assert.java:198)
	at junit.framework.Assert.assertEquals(Assert.java:204)
	at org.joda.time.TestMutableDateTime_Sets.testSetDate_RI_same(TestMutableDateTime_Sets.java:287)

testSetDate_RI_different1(org.joda.time.TestMutableDateTime_Sets)  Time elapsed: 0.001 sec  <<< FAILURE!
junit.framework.AssertionFailedError: expected:<48> but was:<47>
	at junit.framework.Assert.fail(Assert.java:47)
	at junit.framework.Assert.failNotEquals(Assert.java:280)
	at junit.framework.Assert.assertEquals(Assert.java:64)
	at junit.framework.Assert.assertEquals(Assert.java:198)
	at junit.framework.Assert.assertEquals(Assert.java:204)
	at org.joda.time.TestMutableDateTime_Sets.testSetDate_RI_different1(TestMutableDateTime_Sets.java:300)

testSetDate_RI_different2(org.joda.time.TestMutableDateTime_Sets)  Time elapsed: 0.001 sec  <<< FAILURE!
junit.framework.AssertionFailedError: expected:<48> but was:<47>
	at junit.framework.Assert.fail(Assert.java:47)
	at junit.framework.Assert.failNotEquals(Assert.java:280)
	at junit.framework.Assert.assertEquals(Assert.java:64)
	at junit.framework.Assert.assertEquals(Assert.java:198)
	at junit.framework.Assert.assertEquals(Assert.java:204)
	at org.joda.time.TestMutableDateTime_Sets.testSetDate_RI_different2(TestMutableDateTime_Sets.java:313)

testSetTime_long1(org.joda.time.TestMutableDateTime_Sets)  Time elapsed: 0.001 sec  <<< FAILURE!
junit.framework.AssertionFailedError: expected:<9> but was:<8>
	at junit.framework.Assert.fail(Assert.java:47)
	at junit.framework.Assert.failNotEquals(Assert.java:280)
	at junit.framework.Assert.assertEquals(Assert.java:64)
	at junit.framework.Assert.assertEquals(Assert.java:198)
	at junit.framework.Assert.assertEquals(Assert.java:204)
	at org.joda.time.TestMutableDateTime_Sets.testSetTime_long1(TestMutableDateTime_Sets.java:349)

testSetTime_RI1(org.joda.time.TestMutableDateTime_Sets)  Time elapsed: 0.001 sec  <<< FAILURE!
junit.framework.AssertionFailedError: expected:<9> but was:<8>
	at junit.framework.Assert.fail(Assert.java:47)
	at junit.framework.Assert.failNotEquals(Assert.java:280)
	at junit.framework.Assert.assertEquals(Assert.java:64)
	at junit.framework.Assert.assertEquals(Assert.java:198)
	at junit.framework.Assert.assertEquals(Assert.java:204)
	at org.joda.time.TestMutableDateTime_Sets.testSetTime_RI1(TestMutableDateTime_Sets.java:363)

testSetTime_Object3(org.joda.time.TestMutableDateTime_Sets)  Time elapsed: 0.001 sec  <<< FAILURE!
junit.framework.AssertionFailedError: expected:<9> but was:<8>
	at junit.framework.Assert.fail(Assert.java:47)
	at junit.framework.Assert.failNotEquals(Assert.java:280)
	at junit.framework.Assert.assertEquals(Assert.java:64)
	at junit.framework.Assert.assertEquals(Assert.java:198)
	at junit.framework.Assert.assertEquals(Assert.java:204)
	at org.joda.time.TestMutableDateTime_Sets.testSetTime_Object3(TestMutableDateTime_Sets.java:389)

testSetDateTime_int_int_int_int_int_int_int1(org.joda.time.TestMutableDateTime_Sets)  Time elapsed: 0.001 sec  <<< FAILURE!
junit.framework.AssertionFailedError: expected:<7> but was:<6>
	at junit.framework.Assert.fail(Assert.java:47)
	at junit.framework.Assert.failNotEquals(Assert.java:280)
	at junit.framework.Assert.assertEquals(Assert.java:64)
	at junit.framework.Assert.assertEquals(Assert.java:198)
	at junit.framework.Assert.assertEquals(Assert.java:204)
	at org.joda.time.TestMutableDateTime_Sets.testSetDateTime_int_int_int_int_int_int_int1(TestMutableDateTime_Sets.java:402)

testSetYear_int1(org.joda.time.TestMutableDateTime_Sets)  Time elapsed: 0 sec  <<< FAILURE!
junit.framework.ComparisonFailure: expected:<2010-06-09T05:06:0[7.008]+01:00> but was:<2010-06-09T05:06:0[6.992]+01:00>
	at junit.framework.Assert.assertEquals(Assert.java:81)
	at junit.framework.Assert.assertEquals(Assert.java:87)
	at org.joda.time.TestMutableDateTime_Sets.testSetYear_int1(TestMutableDateTime_Sets.java:420)

testSetMonthOfYear_int1(org.joda.time.TestMutableDateTime_Sets)  Time elapsed: 0 sec  <<< FAILURE!
junit.framework.ComparisonFailure: expected:<2002-12-09T05:06:0[7.008]Z> but was:<2002-12-09T05:06:0[6.992]Z>
	at junit.framework.Assert.assertEquals(Assert.java:81)
	at junit.framework.Assert.assertEquals(Assert.java:87)
	at org.joda.time.TestMutableDateTime_Sets.testSetMonthOfYear_int1(TestMutableDateTime_Sets.java:427)

testSetMonthOfYear_int2(org.joda.time.TestMutableDateTime_Sets)  Time elapsed: 0.001 sec  <<< FAILURE!
junit.framework.ComparisonFailure: expected:<2002-06-09T05:06:0[7.008]+01:00> but was:<2002-06-09T05:06:0[6.992]+01:00>
	at junit.framework.Assert.assertEquals(Assert.java:81)
	at junit.framework.Assert.assertEquals(Assert.java:87)
	at org.joda.time.TestMutableDateTime_Sets.testSetMonthOfYear_int2(TestMutableDateTime_Sets.java:451)

testSetDayOfMonth_int1(org.joda.time.TestMutableDateTime_Sets)  Time elapsed: 0.001 sec  <<< FAILURE!
junit.framework.ComparisonFailure: expected:<2002-06-17T05:06:0[7.008]+01:00> but was:<2002-06-17T05:06:0[6.992]+01:00>
	at junit.framework.Assert.assertEquals(Assert.java:81)
	at junit.framework.Assert.assertEquals(Assert.java:87)
	at org.joda.time.TestMutableDateTime_Sets.testSetDayOfMonth_int1(TestMutableDateTime_Sets.java:458)

testSetDayOfMonth_int2(org.joda.time.TestMutableDateTime_Sets)  Time elapsed: 0 sec  <<< FAILURE!
junit.framework.ComparisonFailure: expected:<2002-06-09T05:06:0[7.008]+01:00> but was:<2002-06-09T05:06:0[6.992]+01:00>
	at junit.framework.Assert.assertEquals(Assert.java:81)
	at junit.framework.Assert.assertEquals(Assert.java:87)
	at org.joda.time.TestMutableDateTime_Sets.testSetDayOfMonth_int2(TestMutableDateTime_Sets.java:467)

testSetDayOfYear_int1(org.joda.time.TestMutableDateTime_Sets)  Time elapsed: 0.001 sec  <<< FAILURE!
junit.framework.ComparisonFailure: expected:<2002-01-03T05:06:0[7.008]Z> but was:<2002-01-03T05:06:0[6.992]Z>
	at junit.framework.Assert.assertEquals(Assert.java:81)
	at junit.framework.Assert.assertEquals(Assert.java:87)
	at org.joda.time.TestMutableDateTime_Sets.testSetDayOfYear_int1(TestMutableDateTime_Sets.java:489)

testSetDayOfYear_int2(org.joda.time.TestMutableDateTime_Sets)  Time elapsed: 0.001 sec  <<< FAILURE!
junit.framework.ComparisonFailure: expected:<2002-06-09T05:06:0[7.008]+01:00> but was:<2002-06-09T05:06:0[6.992]+01:00>
	at junit.framework.Assert.assertEquals(Assert.java:81)
	at junit.framework.Assert.assertEquals(Assert.java:87)
	at org.joda.time.TestMutableDateTime_Sets.testSetDayOfYear_int2(TestMutableDateTime_Sets.java:513)

testSetWeekyear_int1(org.joda.time.TestMutableDateTime_Sets)  Time elapsed: 0.001 sec  <<< FAILURE!
junit.framework.ComparisonFailure: expected:<2001-06-10T05:06:0[7.008]+01:00> but was:<2001-06-10T05:06:0[6.992]+01:00>
	at junit.framework.Assert.assertEquals(Assert.java:81)
	at junit.framework.Assert.assertEquals(Assert.java:87)
	at org.joda.time.TestMutableDateTime_Sets.testSetWeekyear_int1(TestMutableDateTime_Sets.java:520)

testSetWeekOfWeekyear_int1(org.joda.time.TestMutableDateTime_Sets)  Time elapsed: 0.001 sec  <<< FAILURE!
junit.framework.ComparisonFailure: expected:<2002-01-13T05:06:0[7.008]Z> but was:<2002-01-13T05:06:0[6.992]Z>
	at junit.framework.Assert.assertEquals(Assert.java:81)
	at junit.framework.Assert.assertEquals(Assert.java:87)
	at org.joda.time.TestMutableDateTime_Sets.testSetWeekOfWeekyear_int1(TestMutableDateTime_Sets.java:527)

testSetWeekOfWeekyear_int2(org.joda.time.TestMutableDateTime_Sets)  Time elapsed: 0 sec  <<< FAILURE!
junit.framework.ComparisonFailure: expected:<2002-06-09T05:06:0[7.008]+01:00> but was:<2002-06-09T05:06:0[6.992]+01:00>
	at junit.framework.Assert.assertEquals(Assert.java:81)
	at junit.framework.Assert.assertEquals(Assert.java:87)
	at org.joda.time.TestMutableDateTime_Sets.testSetWeekOfWeekyear_int2(TestMutableDateTime_Sets.java:536)

testSetDayOfWeek_int1(org.joda.time.TestMutableDateTime_Sets)  Time elapsed: 0.001 sec  <<< FAILURE!
junit.framework.ComparisonFailure: expected:<2002-06-07T05:06:0[7.008]+01:00> but was:<2002-06-07T05:06:0[6.992]+01:00>
	at junit.framework.Assert.assertEquals(Assert.java:81)
	at junit.framework.Assert.assertEquals(Assert.java:87)
	at org.joda.time.TestMutableDateTime_Sets.testSetDayOfWeek_int1(TestMutableDateTime_Sets.java:543)

testSetDayOfWeek_int2(org.joda.time.TestMutableDateTime_Sets)  Time elapsed: 0.002 sec  <<< FAILURE!
junit.framework.ComparisonFailure: expected:<2002-06-09T05:06:0[7.008]+01:00> but was:<2002-06-09T05:06:0[6.992]+01:00>
	at junit.framework.Assert.assertEquals(Assert.java:81)
	at junit.framework.Assert.assertEquals(Assert.java:87)
	at org.joda.time.TestMutableDateTime_Sets.testSetDayOfWeek_int2(TestMutableDateTime_Sets.java:552)

testSetHourOfDay_int1(org.joda.time.TestMutableDateTime_Sets)  Time elapsed: 0 sec  <<< FAILURE!
junit.framework.ComparisonFailure: expected:<2002-06-09T13:06:0[7.008]+01:00> but was:<2002-06-09T13:06:0[6.992]+01:00>
	at junit.framework.Assert.assertEquals(Assert.java:81)
	at junit.framework.Assert.assertEquals(Assert.java:87)
	at org.joda.time.TestMutableDateTime_Sets.testSetHourOfDay_int1(TestMutableDateTime_Sets.java:559)

testSetHourOfDay_int2(org.joda.time.TestMutableDateTime_Sets)  Time elapsed: 0.001 sec  <<< FAILURE!
junit.framework.ComparisonFailure: expected:<2002-06-09T05:06:0[7.008]+01:00> but was:<2002-06-09T05:06:0[6.992]+01:00>
	at junit.framework.Assert.assertEquals(Assert.java:81)
	at junit.framework.Assert.assertEquals(Assert.java:87)
	at org.joda.time.TestMutableDateTime_Sets.testSetHourOfDay_int2(TestMutableDateTime_Sets.java:568)

testSetMinuteOfHour_int1(org.joda.time.TestMutableDateTime_Sets)  Time elapsed: 0 sec  <<< FAILURE!
junit.framework.ComparisonFailure: expected:<2002-06-09T05:13:0[7.008]+01:00> but was:<2002-06-09T05:13:0[6.992]+01:00>
	at junit.framework.Assert.assertEquals(Assert.java:81)
	at junit.framework.Assert.assertEquals(Assert.java:87)
	at org.joda.time.TestMutableDateTime_Sets.testSetMinuteOfHour_int1(TestMutableDateTime_Sets.java:575)

testSetMinuteOfHour_int2(org.joda.time.TestMutableDateTime_Sets)  Time elapsed: 0.003 sec  <<< FAILURE!
junit.framework.ComparisonFailure: expected:<2002-06-09T05:06:0[7.008]+01:00> but was:<2002-06-09T05:06:0[6.992]+01:00>
	at junit.framework.Assert.assertEquals(Assert.java:81)
	at junit.framework.Assert.assertEquals(Assert.java:87)
	at org.joda.time.TestMutableDateTime_Sets.testSetMinuteOfHour_int2(TestMutableDateTime_Sets.java:584)

testSetMinuteOfDay_int1(org.joda.time.TestMutableDateTime_Sets)  Time elapsed: 0 sec  <<< FAILURE!
junit.framework.ComparisonFailure: expected:<2002-06-09T00:13:0[7.008]+01:00> but was:<2002-06-09T00:13:0[6.992]+01:00>
	at junit.framework.Assert.assertEquals(Assert.java:81)
	at junit.framework.Assert.assertEquals(Assert.java:87)
	at org.joda.time.TestMutableDateTime_Sets.testSetMinuteOfDay_int1(TestMutableDateTime_Sets.java:591)

testSetMinuteOfDay_int2(org.joda.time.TestMutableDateTime_Sets)  Time elapsed: 0 sec  <<< FAILURE!
junit.framework.ComparisonFailure: expected:<2002-06-09T05:06:0[7.008]+01:00> but was:<2002-06-09T05:06:0[6.992]+01:00>
	at junit.framework.Assert.assertEquals(Assert.java:81)
	at junit.framework.Assert.assertEquals(Assert.java:87)
	at org.joda.time.TestMutableDateTime_Sets.testSetMinuteOfDay_int2(TestMutableDateTime_Sets.java:600)

testSetSecondOfMinute_int1(org.joda.time.TestMutableDateTime_Sets)  Time elapsed: 0 sec  <<< FAILURE!
junit.framework.ComparisonFailure: expected:<2002-06-09T05:06:13.[008]+01:00> but was:<2002-06-09T05:06:13.[992]+01:00>
	at junit.framework.Assert.assertEquals(Assert.java:81)
	at junit.framework.Assert.assertEquals(Assert.java:87)
	at org.joda.time.TestMutableDateTime_Sets.testSetSecondOfMinute_int1(TestMutableDateTime_Sets.java:607)

testSetSecondOfMinute_int2(org.joda.time.TestMutableDateTime_Sets)  Time elapsed: 0 sec  <<< FAILURE!
junit.framework.ComparisonFailure: expected:<2002-06-09T05:06:0[7.008]+01:00> but was:<2002-06-09T05:06:0[6.992]+01:00>
	at junit.framework.Assert.assertEquals(Assert.java:81)
	at junit.framework.Assert.assertEquals(Assert.java:87)
	at org.joda.time.TestMutableDateTime_Sets.testSetSecondOfMinute_int2(TestMutableDateTime_Sets.java:616)

testSetSecondOfDay_int1(org.joda.time.TestMutableDateTime_Sets)  Time elapsed: 0.001 sec  <<< FAILURE!
junit.framework.ComparisonFailure: expected:<2002-06-09T00:00:13.[008]+01:00> but was:<2002-06-09T00:00:13.[992]+01:00>
	at junit.framework.Assert.assertEquals(Assert.java:81)
	at junit.framework.Assert.assertEquals(Assert.java:87)
	at org.joda.time.TestMutableDateTime_Sets.testSetSecondOfDay_int1(TestMutableDateTime_Sets.java:623)

testSetSecondOfDay_int2(org.joda.time.TestMutableDateTime_Sets)  Time elapsed: 0.001 sec  <<< FAILURE!
junit.framework.ComparisonFailure: expected:<2002-06-09T05:06:0[7.008]+01:00> but was:<2002-06-09T05:06:0[6.992]+01:00>
	at junit.framework.Assert.assertEquals(Assert.java:81)
	at junit.framework.Assert.assertEquals(Assert.java:87)
	at org.joda.time.TestMutableDateTime_Sets.testSetSecondOfDay_int2(TestMutableDateTime_Sets.java:632)

testSetMilliOfSecond_int1(org.joda.time.TestMutableDateTime_Sets)  Time elapsed: 0 sec  <<< FAILURE!
junit.framework.ComparisonFailure: expected:<2002-06-09T05:06:0[7].013+01:00> but was:<2002-06-09T05:06:0[6].013+01:00>
	at junit.framework.Assert.assertEquals(Assert.java:81)
	at junit.framework.Assert.assertEquals(Assert.java:87)
	at org.joda.time.TestMutableDateTime_Sets.testSetMilliOfSecond_int1(TestMutableDateTime_Sets.java:639)

testSetMilliOfSecond_int2(org.joda.time.TestMutableDateTime_Sets)  Time elapsed: 0.001 sec  <<< FAILURE!
junit.framework.ComparisonFailure: expected:<2002-06-09T05:06:0[7.008]+01:00> but was:<2002-06-09T05:06:0[6.992]+01:00>
	at junit.framework.Assert.assertEquals(Assert.java:81)
	at junit.framework.Assert.assertEquals(Assert.java:87)
	at org.joda.time.TestMutableDateTime_Sets.testSetMilliOfSecond_int2(TestMutableDateTime_Sets.java:648)

testSetMilliOfDay_int2(org.joda.time.TestMutableDateTime_Sets)  Time elapsed: 0.001 sec  <<< FAILURE!
junit.framework.ComparisonFailure: expected:<2002-06-09T05:06:0[7.008]+01:00> but was:<2002-06-09T05:06:0[6.992]+01:00>
	at junit.framework.Assert.assertEquals(Assert.java:81)
	at junit.framework.Assert.assertEquals(Assert.java:87)
	at org.joda.time.TestMutableDateTime_Sets.testSetMilliOfDay_int2(TestMutableDateTime_Sets.java:664)

testAdd_RP1(org.joda.time.TestMutableDateTime_Adds)  Time elapsed: 0 sec  <<< FAILURE!
junit.framework.ComparisonFailure: expected:<2002-06-09T05:06:0[7.008]+01:00> but was:<2002-06-09T05:06:0[6.992]+01:00>
	at junit.framework.Assert.assertEquals(Assert.java:81)
	at junit.framework.Assert.assertEquals(Assert.java:87)
	at org.joda.time.TestMutableDateTime_Adds.testAdd_RP1(TestMutableDateTime_Adds.java:143)

testAddYears_int1(org.joda.time.TestMutableDateTime_Adds)  Time elapsed: 0.001 sec  <<< FAILURE!
junit.framework.ComparisonFailure: expected:<2010-06-09T05:06:0[7.008]+01:00> but was:<2010-06-09T05:06:0[6.992]+01:00>
	at junit.framework.Assert.assertEquals(Assert.java:81)
	at junit.framework.Assert.assertEquals(Assert.java:87)
	at org.joda.time.TestMutableDateTime_Adds.testAddYears_int1(TestMutableDateTime_Adds.java:212)

testAddMonths_int1(org.joda.time.TestMutableDateTime_Adds)  Time elapsed: 0.001 sec  <<< FAILURE!
junit.framework.ComparisonFailure: expected:<2002-12-09T05:06:0[7.008]Z> but was:<2002-12-09T05:06:0[6.992]Z>
	at junit.framework.Assert.assertEquals(Assert.java:81)
	at junit.framework.Assert.assertEquals(Assert.java:87)
	at org.joda.time.TestMutableDateTime_Adds.testAddMonths_int1(TestMutableDateTime_Adds.java:234)

testAddDays_int1(org.joda.time.TestMutableDateTime_Adds)  Time elapsed: 0.003 sec  <<< FAILURE!
junit.framework.ComparisonFailure: expected:<2002-06-26T05:06:0[7.008]+01:00> but was:<2002-06-26T05:06:0[6.992]+01:00>
	at junit.framework.Assert.assertEquals(Assert.java:81)
	at junit.framework.Assert.assertEquals(Assert.java:87)
	at org.joda.time.TestMutableDateTime_Adds.testAddDays_int1(TestMutableDateTime_Adds.java:256)

testAddWeekyears_int1(org.joda.time.TestMutableDateTime_Adds)  Time elapsed: 0 sec  <<< FAILURE!
junit.framework.ComparisonFailure: expected:<2001-06-10T05:06:0[7.008]+01:00> but was:<2001-06-10T05:06:0[6.992]+01:00>
	at junit.framework.Assert.assertEquals(Assert.java:81)
	at junit.framework.Assert.assertEquals(Assert.java:87)
	at org.joda.time.TestMutableDateTime_Adds.testAddWeekyears_int1(TestMutableDateTime_Adds.java:278)

testAddWeeks_int1(org.joda.time.TestMutableDateTime_Adds)  Time elapsed: 0.001 sec  <<< FAILURE!
junit.framework.ComparisonFailure: expected:<2002-01-13T05:06:0[7.008]Z> but was:<2002-01-13T05:06:0[6.992]Z>
	at junit.framework.Assert.assertEquals(Assert.java:81)
	at junit.framework.Assert.assertEquals(Assert.java:87)
	at org.joda.time.TestMutableDateTime_Adds.testAddWeeks_int1(TestMutableDateTime_Adds.java:285)

testAddHours_int1(org.joda.time.TestMutableDateTime_Adds)  Time elapsed: 0.002 sec  <<< FAILURE!
junit.framework.ComparisonFailure: expected:<2002-06-09T18:06:0[7.008]+01:00> but was:<2002-06-09T18:06:0[6.992]+01:00>
	at junit.framework.Assert.assertEquals(Assert.java:81)
	at junit.framework.Assert.assertEquals(Assert.java:87)
	at org.joda.time.TestMutableDateTime_Adds.testAddHours_int1(TestMutableDateTime_Adds.java:307)

testAddMinutes_int1(org.joda.time.TestMutableDateTime_Adds)  Time elapsed: 0 sec  <<< FAILURE!
junit.framework.ComparisonFailure: expected:<2002-06-09T05:19:0[7.008]+01:00> but was:<2002-06-09T05:19:0[6.992]+01:00>
	at junit.framework.Assert.assertEquals(Assert.java:81)
	at junit.framework.Assert.assertEquals(Assert.java:87)
	at org.joda.time.TestMutableDateTime_Adds.testAddMinutes_int1(TestMutableDateTime_Adds.java:329)

testAddSeconds_int1(org.joda.time.TestMutableDateTime_Adds)  Time elapsed: 0.001 sec  <<< FAILURE!
junit.framework.ComparisonFailure: expected:<2002-06-09T05:06:[20.008]+01:00> but was:<2002-06-09T05:06:[19.992]+01:00>
	at junit.framework.Assert.assertEquals(Assert.java:81)
	at junit.framework.Assert.assertEquals(Assert.java:87)
	at org.joda.time.TestMutableDateTime_Adds.testAddSeconds_int1(TestMutableDateTime_Adds.java:351)

testAddMillis_int1(org.joda.time.TestMutableDateTime_Adds)  Time elapsed: 0.004 sec  <<< FAILURE!
junit.framework.ComparisonFailure: expected:<...002-06-09T05:06:07.0[21]+01:00> but was:<...002-06-09T05:06:07.0[05]+01:00>
	at junit.framework.Assert.assertEquals(Assert.java:81)
	at junit.framework.Assert.assertEquals(Assert.java:87)
	at org.joda.time.TestMutableDateTime_Adds.testAddMillis_int1(TestMutableDateTime_Adds.java:373)

testPropertyRoundHalfFloorHourOfDay(org.joda.time.TestMutableDateTime_Properties)  Time elapsed: 0.001 sec  <<< FAILURE!
junit.framework.ComparisonFailure: expected:<2004-06-09T1[4]:00:00.000+01:00> but was:<2004-06-09T1[3]:00:00.000+01:00>
	at junit.framework.Assert.assertEquals(Assert.java:81)
	at junit.framework.Assert.assertEquals(Assert.java:87)
	at org.joda.time.TestMutableDateTime_Properties.testPropertyRoundHalfFloorHourOfDay(TestMutableDateTime_Properties.java:545)

testPropertyRoundHalfCeilingHourOfDay(org.joda.time.TestMutableDateTime_Properties)  Time elapsed: 0 sec  <<< FAILURE!
junit.framework.ComparisonFailure: expected:<2004-06-09T1[4]:00:00.000+01:00> but was:<2004-06-09T1[3]:00:00.000+01:00>
	at junit.framework.Assert.assertEquals(Assert.java:81)
	at junit.framework.Assert.assertEquals(Assert.java:87)
	at org.joda.time.TestMutableDateTime_Properties.testPropertyRoundHalfCeilingHourOfDay(TestMutableDateTime_Properties.java:559)

testPropertyRoundHalfEvenHourOfDay(org.joda.time.TestMutableDateTime_Properties)  Time elapsed: 0.001 sec  <<< FAILURE!
junit.framework.ComparisonFailure: expected:<2004-06-09T1[4]:00:00.000+01:00> but was:<2004-06-09T1[3]:00:00.000+01:00>
	at junit.framework.Assert.assertEquals(Assert.java:81)
	at junit.framework.Assert.assertEquals(Assert.java:87)
	at org.joda.time.TestMutableDateTime_Properties.testPropertyRoundHalfEvenHourOfDay(TestMutableDateTime_Properties.java:577)

testPropertyGetSecondOfMinute(org.joda.time.TestMutableDateTime_Properties)  Time elapsed: 0 sec  <<< FAILURE!
junit.framework.AssertionFailedError: expected:<43> but was:<42>
	at junit.framework.Assert.fail(Assert.java:47)
	at junit.framework.Assert.failNotEquals(Assert.java:280)
	at junit.framework.Assert.assertEquals(Assert.java:64)
	at junit.framework.Assert.assertEquals(Assert.java:198)
	at junit.framework.Assert.assertEquals(Assert.java:204)
	at org.joda.time.TestMutableDateTime_Properties.testPropertyGetSecondOfMinute(TestMutableDateTime_Properties.java:629)

testPropertyGetSecondOfDay(org.joda.time.TestMutableDateTime_Properties)  Time elapsed: 0.001 sec  <<< FAILURE!
junit.framework.AssertionFailedError: expected:<48223> but was:<48222>
	at junit.framework.Assert.fail(Assert.java:47)
	at junit.framework.Assert.failNotEquals(Assert.java:280)
	at junit.framework.Assert.assertEquals(Assert.java:64)
	at junit.framework.Assert.assertEquals(Assert.java:198)
	at junit.framework.Assert.assertEquals(Assert.java:204)
	at org.joda.time.TestMutableDateTime_Properties.testPropertyGetSecondOfDay(TestMutableDateTime_Properties.java:646)

testPropertyGetMillisOfSecond(org.joda.time.TestMutableDateTime_Properties)  Time elapsed: 0 sec  <<< FAILURE!
junit.framework.AssertionFailedError: expected:<53> but was:<947>
	at junit.framework.Assert.fail(Assert.java:47)
	at junit.framework.Assert.failNotEquals(Assert.java:280)
	at junit.framework.Assert.assertEquals(Assert.java:64)
	at junit.framework.Assert.assertEquals(Assert.java:198)
	at junit.framework.Assert.assertEquals(Assert.java:204)
	at org.joda.time.TestMutableDateTime_Properties.testPropertyGetMillisOfSecond(TestMutableDateTime_Properties.java:663)

testPropertyGetMillisOfDay(org.joda.time.TestMutableDateTime_Properties)  Time elapsed: 0.001 sec  <<< FAILURE!
junit.framework.AssertionFailedError: expected:<48223053> but was:<48222947>
	at junit.framework.Assert.fail(Assert.java:47)
	at junit.framework.Assert.failNotEquals(Assert.java:280)
	at junit.framework.Assert.assertEquals(Assert.java:64)
	at junit.framework.Assert.assertEquals(Assert.java:198)
	at junit.framework.Assert.assertEquals(Assert.java:204)
	at org.joda.time.TestMutableDateTime_Properties.testPropertyGetMillisOfDay(TestMutableDateTime_Properties.java:680)

testPropertyToIntervalSecondOfMinute(org.joda.time.TestMutableDateTime_Properties)  Time elapsed: 0.001 sec  <<< FAILURE!
junit.framework.AssertionFailedError: expected:<2004-06-09T13:23:43.000+01:00> but was:<2004-06-09T13:23:42.000+01:00>
	at junit.framework.Assert.fail(Assert.java:47)
	at junit.framework.Assert.failNotEquals(Assert.java:280)
	at junit.framework.Assert.assertEquals(Assert.java:64)
	at junit.framework.Assert.assertEquals(Assert.java:71)
	at org.joda.time.TestMutableDateTime_Properties.testPropertyToIntervalSecondOfMinute(TestMutableDateTime_Properties.java:763)

testPropertyToIntervalMillisOfSecond(org.joda.time.TestMutableDateTime_Properties)  Time elapsed: 0.001 sec  <<< FAILURE!
junit.framework.AssertionFailedError: expected:<2004-06-09T13:23:42.946+01:00> but was:<2004-06-09T13:23:42.948+01:00>
	at junit.framework.Assert.fail(Assert.java:47)
	at junit.framework.Assert.failNotEquals(Assert.java:280)
	at junit.framework.Assert.assertEquals(Assert.java:64)
	at junit.framework.Assert.assertEquals(Assert.java:71)
	at org.joda.time.TestMutableDateTime_Properties.testPropertyToIntervalMillisOfSecond(TestMutableDateTime_Properties.java:772)

testIsBefore(org.joda.time.TestDateMidnight_Basics)  Time elapsed: 0.001 sec  <<< FAILURE!
junit.framework.AssertionFailedError: expected:<true> but was:<false>
	at junit.framework.Assert.fail(Assert.java:47)
	at junit.framework.Assert.failNotEquals(Assert.java:280)
	at junit.framework.Assert.assertEquals(Assert.java:64)
	at junit.framework.Assert.assertEquals(Assert.java:146)
	at junit.framework.Assert.assertEquals(Assert.java:152)
	at org.joda.time.TestDateMidnight_Basics.testIsBefore(TestDateMidnight_Basics.java:386)

testIsAfter(org.joda.time.TestDateMidnight_Basics)  Time elapsed: 0.001 sec  <<< FAILURE!
junit.framework.AssertionFailedError: expected:<false> but was:<true>
	at junit.framework.Assert.fail(Assert.java:47)
	at junit.framework.Assert.failNotEquals(Assert.java:280)
	at junit.framework.Assert.assertEquals(Assert.java:64)
	at junit.framework.Assert.assertEquals(Assert.java:146)
	at junit.framework.Assert.assertEquals(Assert.java:152)
	at org.joda.time.TestDateMidnight_Basics.testIsAfter(TestDateMidnight_Basics.java:415)

testToString(org.joda.time.TestInterval_Basics)  Time elapsed: 0.001 sec  <<< FAILURE!
junit.framework.ComparisonFailure: expected:<2004-06-09T07:08:0[9.010Z/2005-08-13T12:14:16.018]Z> but was:<2004-06-09T07:08:0[8.990Z/2005-08-13T12:14:15.982]Z>
	at junit.framework.Assert.assertEquals(Assert.java:81)
	at junit.framework.Assert.assertEquals(Assert.java:87)
	at org.joda.time.TestInterval_Basics.testToString(TestInterval_Basics.java:1046)

testConstructor_int_int_int_int_int_int_int(org.joda.time.TestLocalDateTime_Constructors)  Time elapsed: 0 sec  <<< FAILURE!
junit.framework.AssertionFailedError: expected:<30> but was:<29>
	at junit.framework.Assert.fail(Assert.java:47)
	at junit.framework.Assert.failNotEquals(Assert.java:280)
	at junit.framework.Assert.assertEquals(Assert.java:64)
	at junit.framework.Assert.assertEquals(Assert.java:198)
	at junit.framework.Assert.assertEquals(Assert.java:204)
	at org.joda.time.TestLocalDateTime_Constructors.testConstructor_int_int_int_int_int_int_int(TestLocalDateTime_Constructors.java:704)

testParse_noFormatter(org.joda.time.TestLocalDateTime_Constructors)  Time elapsed: 0 sec  <<< FAILURE!
junit.framework.AssertionFailedError: expected:<2010-01-02T14:50:29.568> but was:<2010-01-02T14:50:30.432>
	at junit.framework.Assert.fail(Assert.java:47)
	at junit.framework.Assert.failNotEquals(Assert.java:280)
	at junit.framework.Assert.assertEquals(Assert.java:64)
	at junit.framework.Assert.assertEquals(Assert.java:71)
	at org.joda.time.TestLocalDateTime_Constructors.testParse_noFormatter(TestLocalDateTime_Constructors.java:96)

testConstructor_int_int_int_Chronology(org.joda.time.TestLocalDateTime_Constructors)  Time elapsed: 0.001 sec  <<< FAILURE!
junit.framework.AssertionFailedError: expected:<30> but was:<29>
	at junit.framework.Assert.fail(Assert.java:47)
	at junit.framework.Assert.failNotEquals(Assert.java:280)
	at junit.framework.Assert.assertEquals(Assert.java:64)
	at junit.framework.Assert.assertEquals(Assert.java:198)
	at junit.framework.Assert.assertEquals(Assert.java:204)
	at org.joda.time.TestLocalDateTime_Constructors.testConstructor_int_int_int_Chronology(TestLocalDateTime_Constructors.java:745)

testGet_DateTimeFieldType(org.joda.time.TestLocalDateTime_Basics)  Time elapsed: 0.001 sec  <<< FAILURE!
junit.framework.AssertionFailedError: expected:<30> but was:<29>
	at junit.framework.Assert.fail(Assert.java:47)
	at junit.framework.Assert.failNotEquals(Assert.java:280)
	at junit.framework.Assert.assertEquals(Assert.java:64)
	at junit.framework.Assert.assertEquals(Assert.java:198)
	at junit.framework.Assert.assertEquals(Assert.java:204)
	at org.joda.time.TestLocalDateTime_Basics.testGet_DateTimeFieldType(TestLocalDateTime_Basics.java:127)

testEqualsHashCode(org.joda.time.TestLocalDateTime_Basics)  Time elapsed: 0.001 sec  <<< FAILURE!
junit.framework.AssertionFailedError: expected:<true> but was:<false>
	at junit.framework.Assert.fail(Assert.java:47)
	at junit.framework.Assert.failNotEquals(Assert.java:280)
	at junit.framework.Assert.assertEquals(Assert.java:64)
	at junit.framework.Assert.assertEquals(Assert.java:146)
	at junit.framework.Assert.assertEquals(Assert.java:152)
	at org.joda.time.TestLocalDateTime_Basics.testEqualsHashCode(TestLocalDateTime_Basics.java:302)

testCompareTo(org.joda.time.TestLocalDateTime_Basics)  Time elapsed: 0.002 sec  <<< FAILURE!
junit.framework.AssertionFailedError: expected:<0> but was:<-1>
	at junit.framework.Assert.fail(Assert.java:47)
	at junit.framework.Assert.failNotEquals(Assert.java:280)
	at junit.framework.Assert.assertEquals(Assert.java:64)
	at junit.framework.Assert.assertEquals(Assert.java:198)
	at junit.framework.Assert.assertEquals(Assert.java:204)
	at org.joda.time.TestLocalDateTime_Basics.testCompareTo(TestLocalDateTime_Basics.java:356)

testToString(org.joda.time.TestLocalDateTime_Basics)  Time elapsed: 0.002 sec  <<< FAILURE!
junit.framework.ComparisonFailure: expected:<2002-06-09T10:20:[30.04]0> but was:<2002-06-09T10:20:[29.96]0>
	at junit.framework.Assert.assertEquals(Assert.java:81)
	at junit.framework.Assert.assertEquals(Assert.java:87)
	at org.joda.time.TestLocalDateTime_Basics.testToString(TestLocalDateTime_Basics.java:1072)

testGetters(org.joda.time.TestLocalDateTime_Basics)  Time elapsed: 0 sec  <<< FAILURE!
junit.framework.AssertionFailedError: expected:<30> but was:<29>
	at junit.framework.Assert.fail(Assert.java:47)
	at junit.framework.Assert.failNotEquals(Assert.java:280)
	at junit.framework.Assert.assertEquals(Assert.java:64)
	at junit.framework.Assert.assertEquals(Assert.java:198)
	at junit.framework.Assert.assertEquals(Assert.java:204)
	at org.joda.time.TestLocalDateTime_Basics.testGetters(TestLocalDateTime_Basics.java:731)

testWithers(org.joda.time.TestLocalDateTime_Basics)  Time elapsed: 0 sec  <<< FAILURE!
junit.framework.AssertionFailedError: expected:<30> but was:<29>
	at junit.framework.Assert.fail(Assert.java:47)
	at junit.framework.Assert.failNotEquals(Assert.java:280)
	at junit.framework.Assert.assertEquals(Assert.java:64)
	at junit.framework.Assert.assertEquals(Assert.java:198)
	at junit.framework.Assert.assertEquals(Assert.java:204)
	at org.joda.time.TestLocalDateTime_Basics.check(TestLocalDateTime_Basics.java:1106)
	at org.joda.time.TestLocalDateTime_Basics.testWithers(TestLocalDateTime_Basics.java:739)

testToString_String(org.joda.time.TestLocalDateTime_Basics)  Time elapsed: 0 sec  <<< FAILURE!
junit.framework.ComparisonFailure: expected:<2002-06-09T10:20:[30.04]0> but was:<2002-06-09T10:20:[29.96]0>
	at junit.framework.Assert.assertEquals(Assert.java:81)
	at junit.framework.Assert.assertEquals(Assert.java:87)
	at org.joda.time.TestLocalDateTime_Basics.testToString_String(TestLocalDateTime_Basics.java:1079)

testToString_String_Locale(org.joda.time.TestLocalDateTime_Basics)  Time elapsed: 0.006 sec  <<< FAILURE!
junit.framework.ComparisonFailure: expected:<1970-06-09T10:20:[30.04]0> but was:<1970-06-09T10:20:[29.96]0>
	at junit.framework.Assert.assertEquals(Assert.java:81)
	at junit.framework.Assert.assertEquals(Assert.java:87)
	at org.joda.time.TestLocalDateTime_Basics.testToString_String_Locale(TestLocalDateTime_Basics.java:1087)

testToString_DTFormatter(org.joda.time.TestLocalDateTime_Basics)  Time elapsed: 0 sec  <<< FAILURE!
junit.framework.ComparisonFailure: expected:<2002-06-09T10:20:[30.04]0> but was:<2002-06-09T10:20:[29.96]0>
	at junit.framework.Assert.assertEquals(Assert.java:81)
	at junit.framework.Assert.assertEquals(Assert.java:87)
	at org.joda.time.TestLocalDateTime_Basics.testToString_DTFormatter(TestLocalDateTime_Basics.java:1096)

testToDateTime(org.joda.time.TestLocalDateTime_Basics)  Time elapsed: 0.001 sec  <<< FAILURE!
junit.framework.AssertionFailedError: expected:<8> but was:<7>
	at junit.framework.Assert.fail(Assert.java:47)
	at junit.framework.Assert.failNotEquals(Assert.java:280)
	at junit.framework.Assert.assertEquals(Assert.java:64)
	at junit.framework.Assert.assertEquals(Assert.java:198)
	at junit.framework.Assert.assertEquals(Assert.java:204)
	at org.joda.time.TestLocalDateTime_Basics.check(TestLocalDateTime_Basics.java:1106)
	at org.joda.time.TestLocalDateTime_Basics.testToDateTime(TestLocalDateTime_Basics.java:770)

testToLocalTime(org.joda.time.TestLocalDateTime_Basics)  Time elapsed: 0.001 sec  <<< FAILURE!
junit.framework.AssertionFailedError: expected:<06:07:08.009> but was:<06:07:07.991>
	at junit.framework.Assert.fail(Assert.java:47)
	at junit.framework.Assert.failNotEquals(Assert.java:280)
	at junit.framework.Assert.assertEquals(Assert.java:64)
	at junit.framework.Assert.assertEquals(Assert.java:71)
	at org.joda.time.TestLocalDateTime_Basics.testToLocalTime(TestLocalDateTime_Basics.java:826)

testToDate_summer_Zone(org.joda.time.TestLocalDateTime_Basics)  Time elapsed: 0.003 sec  <<< FAILURE!
junit.framework.AssertionFailedError: expected:<30> but was:<29>
	at junit.framework.Assert.fail(Assert.java:47)
	at junit.framework.Assert.failNotEquals(Assert.java:280)
	at junit.framework.Assert.assertEquals(Assert.java:64)
	at junit.framework.Assert.assertEquals(Assert.java:198)
	at junit.framework.Assert.assertEquals(Assert.java:204)
	at org.joda.time.TestLocalDateTime_Basics.check(TestLocalDateTime_Basics.java:1106)
	at org.joda.time.TestLocalDateTime_Basics.testToDate_summer_Zone(TestLocalDateTime_Basics.java:939)

testToDate_winter_Zone(org.joda.time.TestLocalDateTime_Basics)  Time elapsed: 0.003 sec  <<< FAILURE!
junit.framework.AssertionFailedError: expected:<30> but was:<29>
	at junit.framework.Assert.fail(Assert.java:47)
	at junit.framework.Assert.failNotEquals(Assert.java:280)
	at junit.framework.Assert.assertEquals(Assert.java:64)
	at junit.framework.Assert.assertEquals(Assert.java:198)
	at junit.framework.Assert.assertEquals(Assert.java:204)
	at org.joda.time.TestLocalDateTime_Basics.check(TestLocalDateTime_Basics.java:1106)
	at org.joda.time.TestLocalDateTime_Basics.testToDate_winter_Zone(TestLocalDateTime_Basics.java:957)

testWithDate(org.joda.time.TestLocalDateTime_Basics)  Time elapsed: 0.001 sec  <<< FAILURE!
junit.framework.AssertionFailedError: expected:<30> but was:<29>
	at junit.framework.Assert.fail(Assert.java:47)
	at junit.framework.Assert.failNotEquals(Assert.java:280)
	at junit.framework.Assert.assertEquals(Assert.java:64)
	at junit.framework.Assert.assertEquals(Assert.java:198)
	at junit.framework.Assert.assertEquals(Assert.java:204)
	at org.joda.time.TestLocalDateTime_Basics.check(TestLocalDateTime_Basics.java:1106)
	at org.joda.time.TestLocalDateTime_Basics.testWithDate(TestLocalDateTime_Basics.java:464)

testWithTime(org.joda.time.TestLocalDateTime_Basics)  Time elapsed: 0 sec  <<< FAILURE!
junit.framework.AssertionFailedError: expected:<30> but was:<29>
	at junit.framework.Assert.fail(Assert.java:47)
	at junit.framework.Assert.failNotEquals(Assert.java:280)
	at junit.framework.Assert.assertEquals(Assert.java:64)
	at junit.framework.Assert.assertEquals(Assert.java:198)
	at junit.framework.Assert.assertEquals(Assert.java:204)
	at org.joda.time.TestLocalDateTime_Basics.check(TestLocalDateTime_Basics.java:1106)
	at org.joda.time.TestLocalDateTime_Basics.testWithTime(TestLocalDateTime_Basics.java:473)

testToDateTime_Zone(org.joda.time.TestLocalDateTime_Basics)  Time elapsed: 0 sec  <<< FAILURE!
junit.framework.AssertionFailedError: expected:<8> but was:<7>
	at junit.framework.Assert.fail(Assert.java:47)
	at junit.framework.Assert.failNotEquals(Assert.java:280)
	at junit.framework.Assert.assertEquals(Assert.java:64)
	at junit.framework.Assert.assertEquals(Assert.java:198)
	at junit.framework.Assert.assertEquals(Assert.java:204)
	at org.joda.time.TestLocalDateTime_Basics.check(TestLocalDateTime_Basics.java:1106)
	at org.joda.time.TestLocalDateTime_Basics.testToDateTime_Zone(TestLocalDateTime_Basics.java:780)

testToDateTime_nullZone(org.joda.time.TestLocalDateTime_Basics)  Time elapsed: 0.001 sec  <<< FAILURE!
junit.framework.AssertionFailedError: expected:<8> but was:<7>
	at junit.framework.Assert.fail(Assert.java:47)
	at junit.framework.Assert.failNotEquals(Assert.java:280)
	at junit.framework.Assert.assertEquals(Assert.java:64)
	at junit.framework.Assert.assertEquals(Assert.java:198)
	at junit.framework.Assert.assertEquals(Assert.java:204)
	at org.joda.time.TestLocalDateTime_Basics.check(TestLocalDateTime_Basics.java:1106)
	at org.joda.time.TestLocalDateTime_Basics.testToDateTime_nullZone(TestLocalDateTime_Basics.java:789)

testToDateTime_RI(org.joda.time.TestLocalDateTime_Basics)  Time elapsed: 0.001 sec  <<< FAILURE!
junit.framework.AssertionFailedError: expected:<30> but was:<29>
	at junit.framework.Assert.fail(Assert.java:47)
	at junit.framework.Assert.failNotEquals(Assert.java:280)
	at junit.framework.Assert.assertEquals(Assert.java:64)
	at junit.framework.Assert.assertEquals(Assert.java:198)
	at junit.framework.Assert.assertEquals(Assert.java:204)
	at org.joda.time.TestLocalDateTime_Basics.check(TestLocalDateTime_Basics.java:1106)
	at org.joda.time.TestLocalDateTime_Basics.testToDateTime_RI(TestLocalDateTime_Basics.java:835)

testToDateTime_nullRI(org.joda.time.TestLocalDateTime_Basics)  Time elapsed: 0 sec  <<< FAILURE!
junit.framework.AssertionFailedError: expected:<30> but was:<29>
	at junit.framework.Assert.fail(Assert.java:47)
	at junit.framework.Assert.failNotEquals(Assert.java:280)
	at junit.framework.Assert.assertEquals(Assert.java:64)
	at junit.framework.Assert.assertEquals(Assert.java:198)
	at junit.framework.Assert.assertEquals(Assert.java:204)
	at org.joda.time.TestLocalDateTime_Basics.check(TestLocalDateTime_Basics.java:1106)
	at org.joda.time.TestLocalDateTime_Basics.testToDateTime_nullRI(TestLocalDateTime_Basics.java:844)

testToDate_summer(org.joda.time.TestLocalDateTime_Basics)  Time elapsed: 0.011 sec  <<< FAILURE!
junit.framework.AssertionFailedError: expected:<30> but was:<29>
	at junit.framework.Assert.fail(Assert.java:47)
	at junit.framework.Assert.failNotEquals(Assert.java:280)
	at junit.framework.Assert.assertEquals(Assert.java:64)
	at junit.framework.Assert.assertEquals(Assert.java:198)
	at junit.framework.Assert.assertEquals(Assert.java:204)
	at org.joda.time.TestLocalDateTime_Basics.check(TestLocalDateTime_Basics.java:1106)
	at org.joda.time.TestLocalDateTime_Basics.testToDate_summer(TestLocalDateTime_Basics.java:854)

testToDate_winter(org.joda.time.TestLocalDateTime_Basics)  Time elapsed: 0.003 sec  <<< FAILURE!
junit.framework.AssertionFailedError: expected:<30> but was:<29>
	at junit.framework.Assert.fail(Assert.java:47)
	at junit.framework.Assert.failNotEquals(Assert.java:280)
	at junit.framework.Assert.assertEquals(Assert.java:64)
	at junit.framework.Assert.assertEquals(Assert.java:198)
	at junit.framework.Assert.assertEquals(Assert.java:204)
	at org.joda.time.TestLocalDateTime_Basics.check(TestLocalDateTime_Basics.java:1106)
	at org.joda.time.TestLocalDateTime_Basics.testToDate_winter(TestLocalDateTime_Basics.java:872)

testPropertyAddToCopyYear(org.joda.time.TestLocalDateTime_Properties)  Time elapsed: 0.001 sec  <<< FAILURE!
junit.framework.AssertionFailedError: expected:<30> but was:<29>
	at junit.framework.Assert.fail(Assert.java:47)
	at junit.framework.Assert.failNotEquals(Assert.java:280)
	at junit.framework.Assert.assertEquals(Assert.java:64)
	at junit.framework.Assert.assertEquals(Assert.java:198)
	at junit.framework.Assert.assertEquals(Assert.java:204)
	at org.joda.time.TestLocalDateTime_Properties.check(TestLocalDateTime_Properties.java:1081)
	at org.joda.time.TestLocalDateTime_Properties.testPropertyAddToCopyYear(TestLocalDateTime_Properties.java:117)

testPropertyAddWrapFieldToCopyYear(org.joda.time.TestLocalDateTime_Properties)  Time elapsed: 0 sec  <<< FAILURE!
junit.framework.AssertionFailedError: expected:<30> but was:<29>
	at junit.framework.Assert.fail(Assert.java:47)
	at junit.framework.Assert.failNotEquals(Assert.java:280)
	at junit.framework.Assert.assertEquals(Assert.java:64)
	at junit.framework.Assert.assertEquals(Assert.java:198)
	at junit.framework.Assert.assertEquals(Assert.java:204)
	at org.joda.time.TestLocalDateTime_Properties.check(TestLocalDateTime_Properties.java:1081)
	at org.joda.time.TestLocalDateTime_Properties.testPropertyAddWrapFieldToCopyYear(TestLocalDateTime_Properties.java:148)

testPropertyWithMaximumValueDayOfMonth(org.joda.time.TestLocalDateTime_Properties)  Time elapsed: 0.001 sec  <<< FAILURE!
junit.framework.AssertionFailedError: expected:<30> but was:<29>
	at junit.framework.Assert.fail(Assert.java:47)
	at junit.framework.Assert.failNotEquals(Assert.java:280)
	at junit.framework.Assert.assertEquals(Assert.java:64)
	at junit.framework.Assert.assertEquals(Assert.java:198)
	at junit.framework.Assert.assertEquals(Assert.java:204)
	at org.joda.time.TestLocalDateTime_Properties.check(TestLocalDateTime_Properties.java:1081)
	at org.joda.time.TestLocalDateTime_Properties.testPropertyWithMaximumValueDayOfMonth(TestLocalDateTime_Properties.java:463)

testPropertyWithMinimumValueDayOfMonth(org.joda.time.TestLocalDateTime_Properties)  Time elapsed: 0 sec  <<< FAILURE!
junit.framework.AssertionFailedError: expected:<30> but was:<29>
	at junit.framework.Assert.fail(Assert.java:47)
	at junit.framework.Assert.failNotEquals(Assert.java:280)
	at junit.framework.Assert.assertEquals(Assert.java:64)
	at junit.framework.Assert.assertEquals(Assert.java:198)
	at junit.framework.Assert.assertEquals(Assert.java:204)
	at org.joda.time.TestLocalDateTime_Properties.check(TestLocalDateTime_Properties.java:1081)
	at org.joda.time.TestLocalDateTime_Properties.testPropertyWithMinimumValueDayOfMonth(TestLocalDateTime_Properties.java:470)

testPropertyAddToCopyHour(org.joda.time.TestLocalDateTime_Properties)  Time elapsed: 0 sec  <<< FAILURE!
junit.framework.AssertionFailedError: expected:<30> but was:<29>
	at junit.framework.Assert.fail(Assert.java:47)
	at junit.framework.Assert.failNotEquals(Assert.java:280)
	at junit.framework.Assert.assertEquals(Assert.java:64)
	at junit.framework.Assert.assertEquals(Assert.java:198)
	at junit.framework.Assert.assertEquals(Assert.java:204)
	at org.joda.time.TestLocalDateTime_Properties.check(TestLocalDateTime_Properties.java:1081)
	at org.joda.time.TestLocalDateTime_Properties.testPropertyAddToCopyHour(TestLocalDateTime_Properties.java:596)

testPropertyAddWrapFieldToCopyHour(org.joda.time.TestLocalDateTime_Properties)  Time elapsed: 0.001 sec  <<< FAILURE!
junit.framework.AssertionFailedError: expected:<30> but was:<29>
	at junit.framework.Assert.fail(Assert.java:47)
	at junit.framework.Assert.failNotEquals(Assert.java:280)
	at junit.framework.Assert.assertEquals(Assert.java:64)
	at junit.framework.Assert.assertEquals(Assert.java:198)
	at junit.framework.Assert.assertEquals(Assert.java:204)
	at org.joda.time.TestLocalDateTime_Properties.check(TestLocalDateTime_Properties.java:1081)
	at org.joda.time.TestLocalDateTime_Properties.testPropertyAddWrapFieldToCopyHour(TestLocalDateTime_Properties.java:618)

testPropertySetHour(org.joda.time.TestLocalDateTime_Properties)  Time elapsed: 0.001 sec  <<< FAILURE!
junit.framework.AssertionFailedError: expected:<30> but was:<29>
	at junit.framework.Assert.fail(Assert.java:47)
	at junit.framework.Assert.failNotEquals(Assert.java:280)
	at junit.framework.Assert.assertEquals(Assert.java:64)
	at junit.framework.Assert.assertEquals(Assert.java:198)
	at junit.framework.Assert.assertEquals(Assert.java:204)
	at org.joda.time.TestLocalDateTime_Properties.check(TestLocalDateTime_Properties.java:1081)
	at org.joda.time.TestLocalDateTime_Properties.testPropertySetHour(TestLocalDateTime_Properties.java:634)

testPropertySetTextHour(org.joda.time.TestLocalDateTime_Properties)  Time elapsed: 0.001 sec  <<< FAILURE!
junit.framework.AssertionFailedError: expected:<30> but was:<29>
	at junit.framework.Assert.fail(Assert.java:47)
	at junit.framework.Assert.failNotEquals(Assert.java:280)
	at junit.framework.Assert.assertEquals(Assert.java:64)
	at junit.framework.Assert.assertEquals(Assert.java:198)
	at junit.framework.Assert.assertEquals(Assert.java:204)
	at org.joda.time.TestLocalDateTime_Properties.check(TestLocalDateTime_Properties.java:1081)
	at org.joda.time.TestLocalDateTime_Properties.testPropertySetTextHour(TestLocalDateTime_Properties.java:650)

testPropertyWithMaximumValueHour(org.joda.time.TestLocalDateTime_Properties)  Time elapsed: 0 sec  <<< FAILURE!
junit.framework.AssertionFailedError: expected:<30> but was:<29>
	at junit.framework.Assert.fail(Assert.java:47)
	at junit.framework.Assert.failNotEquals(Assert.java:280)
	at junit.framework.Assert.assertEquals(Assert.java:64)
	at junit.framework.Assert.assertEquals(Assert.java:198)
	at junit.framework.Assert.assertEquals(Assert.java:204)
	at org.joda.time.TestLocalDateTime_Properties.check(TestLocalDateTime_Properties.java:1081)
	at org.joda.time.TestLocalDateTime_Properties.testPropertyWithMaximumValueHour(TestLocalDateTime_Properties.java:657)

testPropertyWithMinimumValueHour(org.joda.time.TestLocalDateTime_Properties)  Time elapsed: 0.001 sec  <<< FAILURE!
junit.framework.AssertionFailedError: expected:<30> but was:<29>
	at junit.framework.Assert.fail(Assert.java:47)
	at junit.framework.Assert.failNotEquals(Assert.java:280)
	at junit.framework.Assert.assertEquals(Assert.java:64)
	at junit.framework.Assert.assertEquals(Assert.java:198)
	at junit.framework.Assert.assertEquals(Assert.java:204)
	at org.joda.time.TestLocalDateTime_Properties.check(TestLocalDateTime_Properties.java:1081)
	at org.joda.time.TestLocalDateTime_Properties.testPropertyWithMinimumValueHour(TestLocalDateTime_Properties.java:664)

testPropertyWithMaxMinValueMinute(org.joda.time.TestLocalDateTime_Properties)  Time elapsed: 0 sec  <<< FAILURE!
junit.framework.AssertionFailedError: expected:<30> but was:<29>
	at junit.framework.Assert.fail(Assert.java:47)
	at junit.framework.Assert.failNotEquals(Assert.java:280)
	at junit.framework.Assert.assertEquals(Assert.java:64)
	at junit.framework.Assert.assertEquals(Assert.java:198)
	at junit.framework.Assert.assertEquals(Assert.java:204)
	at org.joda.time.TestLocalDateTime_Properties.check(TestLocalDateTime_Properties.java:1081)
	at org.joda.time.TestLocalDateTime_Properties.testPropertyWithMaxMinValueMinute(TestLocalDateTime_Properties.java:719)

testPropertyAddToCopyMinute(org.joda.time.TestLocalDateTime_Properties)  Time elapsed: 0 sec  <<< FAILURE!
junit.framework.AssertionFailedError: expected:<30> but was:<29>
	at junit.framework.Assert.fail(Assert.java:47)
	at junit.framework.Assert.failNotEquals(Assert.java:280)
	at junit.framework.Assert.assertEquals(Assert.java:64)
	at junit.framework.Assert.assertEquals(Assert.java:198)
	at junit.framework.Assert.assertEquals(Assert.java:204)
	at org.joda.time.TestLocalDateTime_Properties.check(TestLocalDateTime_Properties.java:1081)
	at org.joda.time.TestLocalDateTime_Properties.testPropertyAddToCopyMinute(TestLocalDateTime_Properties.java:726)

testPropertyAddWrapFieldToCopyMinute(org.joda.time.TestLocalDateTime_Properties)  Time elapsed: 0.001 sec  <<< FAILURE!
junit.framework.AssertionFailedError: expected:<30> but was:<29>
	at junit.framework.Assert.fail(Assert.java:47)
	at junit.framework.Assert.failNotEquals(Assert.java:280)
	at junit.framework.Assert.assertEquals(Assert.java:64)
	at junit.framework.Assert.assertEquals(Assert.java:198)
	at junit.framework.Assert.assertEquals(Assert.java:204)
	at org.joda.time.TestLocalDateTime_Properties.check(TestLocalDateTime_Properties.java:1081)
	at org.joda.time.TestLocalDateTime_Properties.testPropertyAddWrapFieldToCopyMinute(TestLocalDateTime_Properties.java:766)

testPropertySetMinute(org.joda.time.TestLocalDateTime_Properties)  Time elapsed: 0.001 sec  <<< FAILURE!
junit.framework.AssertionFailedError: expected:<30> but was:<29>
	at junit.framework.Assert.fail(Assert.java:47)
	at junit.framework.Assert.failNotEquals(Assert.java:280)
	at junit.framework.Assert.assertEquals(Assert.java:64)
	at junit.framework.Assert.assertEquals(Assert.java:198)
	at junit.framework.Assert.assertEquals(Assert.java:204)
	at org.joda.time.TestLocalDateTime_Properties.check(TestLocalDateTime_Properties.java:1081)
	at org.joda.time.TestLocalDateTime_Properties.testPropertySetMinute(TestLocalDateTime_Properties.java:779)

testPropertySetTextMinute(org.joda.time.TestLocalDateTime_Properties)  Time elapsed: 0 sec  <<< FAILURE!
junit.framework.AssertionFailedError: expected:<30> but was:<29>
	at junit.framework.Assert.fail(Assert.java:47)
	at junit.framework.Assert.failNotEquals(Assert.java:280)
	at junit.framework.Assert.assertEquals(Assert.java:64)
	at junit.framework.Assert.assertEquals(Assert.java:198)
	at junit.framework.Assert.assertEquals(Assert.java:204)
	at org.joda.time.TestLocalDateTime_Properties.check(TestLocalDateTime_Properties.java:1081)
	at org.joda.time.TestLocalDateTime_Properties.testPropertySetTextMinute(TestLocalDateTime_Properties.java:795)

testPropertyGetSecond(org.joda.time.TestLocalDateTime_Properties)  Time elapsed: 0 sec  <<< FAILURE!
junit.framework.AssertionFailedError: expected:<30> but was:<29>
	at junit.framework.Assert.fail(Assert.java:47)
	at junit.framework.Assert.failNotEquals(Assert.java:280)
	at junit.framework.Assert.assertEquals(Assert.java:64)
	at junit.framework.Assert.assertEquals(Assert.java:198)
	at junit.framework.Assert.assertEquals(Assert.java:204)
	at org.joda.time.TestLocalDateTime_Properties.testPropertyGetSecond(TestLocalDateTime_Properties.java:828)

testPropertyWithMaxMinValueSecond(org.joda.time.TestLocalDateTime_Properties)  Time elapsed: 0 sec  <<< FAILURE!
junit.framework.AssertionFailedError: expected:<40> but was:<960>
	at junit.framework.Assert.fail(Assert.java:47)
	at junit.framework.Assert.failNotEquals(Assert.java:280)
	at junit.framework.Assert.assertEquals(Assert.java:64)
	at junit.framework.Assert.assertEquals(Assert.java:198)
	at junit.framework.Assert.assertEquals(Assert.java:204)
	at org.joda.time.TestLocalDateTime_Properties.check(TestLocalDateTime_Properties.java:1082)
	at org.joda.time.TestLocalDateTime_Properties.testPropertyWithMaxMinValueSecond(TestLocalDateTime_Properties.java:850)

testPropertyAddToCopySecond(org.joda.time.TestLocalDateTime_Properties)  Time elapsed: 0.001 sec  <<< FAILURE!
junit.framework.AssertionFailedError: expected:<30> but was:<29>
	at junit.framework.Assert.fail(Assert.java:47)
	at junit.framework.Assert.failNotEquals(Assert.java:280)
	at junit.framework.Assert.assertEquals(Assert.java:64)
	at junit.framework.Assert.assertEquals(Assert.java:198)
	at junit.framework.Assert.assertEquals(Assert.java:204)
	at org.joda.time.TestLocalDateTime_Properties.check(TestLocalDateTime_Properties.java:1081)
	at org.joda.time.TestLocalDateTime_Properties.testPropertyAddToCopySecond(TestLocalDateTime_Properties.java:857)

testPropertyAddWrapFieldToCopySecond(org.joda.time.TestLocalDateTime_Properties)  Time elapsed: 0 sec  <<< FAILURE!
junit.framework.AssertionFailedError: expected:<30> but was:<29>
	at junit.framework.Assert.fail(Assert.java:47)
	at junit.framework.Assert.failNotEquals(Assert.java:280)
	at junit.framework.Assert.assertEquals(Assert.java:64)
	at junit.framework.Assert.assertEquals(Assert.java:198)
	at junit.framework.Assert.assertEquals(Assert.java:204)
	at org.joda.time.TestLocalDateTime_Properties.check(TestLocalDateTime_Properties.java:1081)
	at org.joda.time.TestLocalDateTime_Properties.testPropertyAddWrapFieldToCopySecond(TestLocalDateTime_Properties.java:894)

testPropertySetSecond(org.joda.time.TestLocalDateTime_Properties)  Time elapsed: 0.001 sec  <<< FAILURE!
junit.framework.AssertionFailedError: expected:<30> but was:<29>
	at junit.framework.Assert.fail(Assert.java:47)
	at junit.framework.Assert.failNotEquals(Assert.java:280)
	at junit.framework.Assert.assertEquals(Assert.java:64)
	at junit.framework.Assert.assertEquals(Assert.java:198)
	at junit.framework.Assert.assertEquals(Assert.java:204)
	at org.joda.time.TestLocalDateTime_Properties.check(TestLocalDateTime_Properties.java:1081)
	at org.joda.time.TestLocalDateTime_Properties.testPropertySetSecond(TestLocalDateTime_Properties.java:907)

testPropertySetTextSecond(org.joda.time.TestLocalDateTime_Properties)  Time elapsed: 0 sec  <<< FAILURE!
junit.framework.AssertionFailedError: expected:<30> but was:<29>
	at junit.framework.Assert.fail(Assert.java:47)
	at junit.framework.Assert.failNotEquals(Assert.java:280)
	at junit.framework.Assert.assertEquals(Assert.java:64)
	at junit.framework.Assert.assertEquals(Assert.java:198)
	at junit.framework.Assert.assertEquals(Assert.java:204)
	at org.joda.time.TestLocalDateTime_Properties.check(TestLocalDateTime_Properties.java:1081)
	at org.joda.time.TestLocalDateTime_Properties.testPropertySetTextSecond(TestLocalDateTime_Properties.java:923)

testPropertyGetMilli(org.joda.time.TestLocalDateTime_Properties)  Time elapsed: 0.001 sec  <<< FAILURE!
junit.framework.AssertionFailedError: expected:<40> but was:<960>
	at junit.framework.Assert.fail(Assert.java:47)
	at junit.framework.Assert.failNotEquals(Assert.java:280)
	at junit.framework.Assert.assertEquals(Assert.java:64)
	at junit.framework.Assert.assertEquals(Assert.java:198)
	at junit.framework.Assert.assertEquals(Assert.java:204)
	at org.joda.time.TestLocalDateTime_Properties.testPropertyGetMilli(TestLocalDateTime_Properties.java:956)

testPropertyWithMaxMinValueMilli(org.joda.time.TestLocalDateTime_Properties)  Time elapsed: 0 sec  <<< FAILURE!
junit.framework.AssertionFailedError: expected:<30> but was:<29>
	at junit.framework.Assert.fail(Assert.java:47)
	at junit.framework.Assert.failNotEquals(Assert.java:280)
	at junit.framework.Assert.assertEquals(Assert.java:64)
	at junit.framework.Assert.assertEquals(Assert.java:198)
	at junit.framework.Assert.assertEquals(Assert.java:204)
	at org.joda.time.TestLocalDateTime_Properties.check(TestLocalDateTime_Properties.java:1081)
	at org.joda.time.TestLocalDateTime_Properties.testPropertyWithMaxMinValueMilli(TestLocalDateTime_Properties.java:978)

testPropertyAddToCopyMilli(org.joda.time.TestLocalDateTime_Properties)  Time elapsed: 0.001 sec  <<< FAILURE!
junit.framework.AssertionFailedError: expected:<30> but was:<29>
	at junit.framework.Assert.fail(Assert.java:47)
	at junit.framework.Assert.failNotEquals(Assert.java:280)
	at junit.framework.Assert.assertEquals(Assert.java:64)
	at junit.framework.Assert.assertEquals(Assert.java:198)
	at junit.framework.Assert.assertEquals(Assert.java:204)
	at org.joda.time.TestLocalDateTime_Properties.check(TestLocalDateTime_Properties.java:1081)
	at org.joda.time.TestLocalDateTime_Properties.testPropertyAddToCopyMilli(TestLocalDateTime_Properties.java:985)

testPropertyAddWrapFieldToCopyMilli(org.joda.time.TestLocalDateTime_Properties)  Time elapsed: 0 sec  <<< FAILURE!
junit.framework.AssertionFailedError: expected:<30> but was:<29>
	at junit.framework.Assert.fail(Assert.java:47)
	at junit.framework.Assert.failNotEquals(Assert.java:280)
	at junit.framework.Assert.assertEquals(Assert.java:64)
	at junit.framework.Assert.assertEquals(Assert.java:198)
	at junit.framework.Assert.assertEquals(Assert.java:204)
	at org.joda.time.TestLocalDateTime_Properties.check(TestLocalDateTime_Properties.java:1081)
	at org.joda.time.TestLocalDateTime_Properties.testPropertyAddWrapFieldToCopyMilli(TestLocalDateTime_Properties.java:1019)

testPropertySetMilli(org.joda.time.TestLocalDateTime_Properties)  Time elapsed: 0.001 sec  <<< FAILURE!
junit.framework.AssertionFailedError: expected:<30> but was:<29>
	at junit.framework.Assert.fail(Assert.java:47)
	at junit.framework.Assert.failNotEquals(Assert.java:280)
	at junit.framework.Assert.assertEquals(Assert.java:64)
	at junit.framework.Assert.assertEquals(Assert.java:198)
	at junit.framework.Assert.assertEquals(Assert.java:204)
	at org.joda.time.TestLocalDateTime_Properties.check(TestLocalDateTime_Properties.java:1081)
	at org.joda.time.TestLocalDateTime_Properties.testPropertySetMilli(TestLocalDateTime_Properties.java:1032)

testPropertySetTextMilli(org.joda.time.TestLocalDateTime_Properties)  Time elapsed: 0 sec  <<< FAILURE!
junit.framework.AssertionFailedError: expected:<30> but was:<29>
	at junit.framework.Assert.fail(Assert.java:47)
	at junit.framework.Assert.failNotEquals(Assert.java:280)
	at junit.framework.Assert.assertEquals(Assert.java:64)
	at junit.framework.Assert.assertEquals(Assert.java:198)
	at junit.framework.Assert.assertEquals(Assert.java:204)
	at org.joda.time.TestLocalDateTime_Properties.check(TestLocalDateTime_Properties.java:1081)
	at org.joda.time.TestLocalDateTime_Properties.testPropertySetTextMilli(TestLocalDateTime_Properties.java:1048)

testPropertySetCopyYear(org.joda.time.TestLocalDateTime_Properties)  Time elapsed: 0.001 sec  <<< FAILURE!
junit.framework.AssertionFailedError: expected:<30> but was:<29>
	at junit.framework.Assert.fail(Assert.java:47)
	at junit.framework.Assert.failNotEquals(Assert.java:280)
	at junit.framework.Assert.assertEquals(Assert.java:64)
	at junit.framework.Assert.assertEquals(Assert.java:198)
	at junit.framework.Assert.assertEquals(Assert.java:204)
	at org.joda.time.TestLocalDateTime_Properties.check(TestLocalDateTime_Properties.java:1081)
	at org.joda.time.TestLocalDateTime_Properties.testPropertySetCopyYear(TestLocalDateTime_Properties.java:164)

testPropertySetCopyTextYear(org.joda.time.TestLocalDateTime_Properties)  Time elapsed: 0 sec  <<< FAILURE!
junit.framework.AssertionFailedError: expected:<30> but was:<29>
	at junit.framework.Assert.fail(Assert.java:47)
	at junit.framework.Assert.failNotEquals(Assert.java:280)
	at junit.framework.Assert.assertEquals(Assert.java:64)
	at junit.framework.Assert.assertEquals(Assert.java:198)
	at junit.framework.Assert.assertEquals(Assert.java:204)
	at org.joda.time.TestLocalDateTime_Properties.check(TestLocalDateTime_Properties.java:1081)
	at org.joda.time.TestLocalDateTime_Properties.testPropertySetCopyTextYear(TestLocalDateTime_Properties.java:171)

testPropertyAddToCopyMonth(org.joda.time.TestLocalDateTime_Properties)  Time elapsed: 0.001 sec  <<< FAILURE!
junit.framework.AssertionFailedError: expected:<30> but was:<29>
	at junit.framework.Assert.fail(Assert.java:47)
	at junit.framework.Assert.failNotEquals(Assert.java:280)
	at junit.framework.Assert.assertEquals(Assert.java:64)
	at junit.framework.Assert.assertEquals(Assert.java:198)
	at junit.framework.Assert.assertEquals(Assert.java:204)
	at org.joda.time.TestLocalDateTime_Properties.check(TestLocalDateTime_Properties.java:1081)
	at org.joda.time.TestLocalDateTime_Properties.testPropertyAddToCopyMonth(TestLocalDateTime_Properties.java:230)

testPropertyAddWrapFieldToCopyMonth(org.joda.time.TestLocalDateTime_Properties)  Time elapsed: 0 sec  <<< FAILURE!
junit.framework.AssertionFailedError: expected:<30> but was:<29>
	at junit.framework.Assert.fail(Assert.java:47)
	at junit.framework.Assert.failNotEquals(Assert.java:280)
	at junit.framework.Assert.assertEquals(Assert.java:64)
	at junit.framework.Assert.assertEquals(Assert.java:198)
	at junit.framework.Assert.assertEquals(Assert.java:204)
	at org.joda.time.TestLocalDateTime_Properties.check(TestLocalDateTime_Properties.java:1081)
	at org.joda.time.TestLocalDateTime_Properties.testPropertyAddWrapFieldToCopyMonth(TestLocalDateTime_Properties.java:260)

testPropertySetCopyMonth(org.joda.time.TestLocalDateTime_Properties)  Time elapsed: 0.001 sec  <<< FAILURE!
junit.framework.AssertionFailedError: expected:<30> but was:<29>
	at junit.framework.Assert.fail(Assert.java:47)
	at junit.framework.Assert.failNotEquals(Assert.java:280)
	at junit.framework.Assert.assertEquals(Assert.java:64)
	at junit.framework.Assert.assertEquals(Assert.java:198)
	at junit.framework.Assert.assertEquals(Assert.java:204)
	at org.joda.time.TestLocalDateTime_Properties.check(TestLocalDateTime_Properties.java:1081)
	at org.joda.time.TestLocalDateTime_Properties.testPropertySetCopyMonth(TestLocalDateTime_Properties.java:287)

testPropertySetCopyTextMonth(org.joda.time.TestLocalDateTime_Properties)  Time elapsed: 0 sec  <<< FAILURE!
junit.framework.AssertionFailedError: expected:<30> but was:<29>
	at junit.framework.Assert.fail(Assert.java:47)
	at junit.framework.Assert.failNotEquals(Assert.java:280)
	at junit.framework.Assert.assertEquals(Assert.java:64)
	at junit.framework.Assert.assertEquals(Assert.java:198)
	at junit.framework.Assert.assertEquals(Assert.java:204)
	at org.joda.time.TestLocalDateTime_Properties.check(TestLocalDateTime_Properties.java:1081)
	at org.joda.time.TestLocalDateTime_Properties.testPropertySetCopyTextMonth(TestLocalDateTime_Properties.java:307)

testPropertyAddToCopyDay(org.joda.time.TestLocalDateTime_Properties)  Time elapsed: 0 sec  <<< FAILURE!
junit.framework.AssertionFailedError: expected:<30> but was:<29>
	at junit.framework.Assert.fail(Assert.java:47)
	at junit.framework.Assert.failNotEquals(Assert.java:280)
	at junit.framework.Assert.assertEquals(Assert.java:64)
	at junit.framework.Assert.assertEquals(Assert.java:198)
	at junit.framework.Assert.assertEquals(Assert.java:204)
	at org.joda.time.TestLocalDateTime_Properties.check(TestLocalDateTime_Properties.java:1081)
	at org.joda.time.TestLocalDateTime_Properties.testPropertyAddToCopyDay(TestLocalDateTime_Properties.java:377)

testPropertyAddWrapFieldToCopyDay(org.joda.time.TestLocalDateTime_Properties)  Time elapsed: 0 sec  <<< FAILURE!
junit.framework.AssertionFailedError: expected:<30> but was:<29>
	at junit.framework.Assert.fail(Assert.java:47)
	at junit.framework.Assert.failNotEquals(Assert.java:280)
	at junit.framework.Assert.assertEquals(Assert.java:64)
	at junit.framework.Assert.assertEquals(Assert.java:198)
	at junit.framework.Assert.assertEquals(Assert.java:204)
	at org.joda.time.TestLocalDateTime_Properties.check(TestLocalDateTime_Properties.java:1081)
	at org.joda.time.TestLocalDateTime_Properties.testPropertyAddWrapFieldToCopyDay(TestLocalDateTime_Properties.java:414)

testPropertySetCopyDay(org.joda.time.TestLocalDateTime_Properties)  Time elapsed: 0.001 sec  <<< FAILURE!
junit.framework.AssertionFailedError: expected:<30> but was:<29>
	at junit.framework.Assert.fail(Assert.java:47)
	at junit.framework.Assert.failNotEquals(Assert.java:280)
	at junit.framework.Assert.assertEquals(Assert.java:64)
	at junit.framework.Assert.assertEquals(Assert.java:198)
	at junit.framework.Assert.assertEquals(Assert.java:204)
	at org.joda.time.TestLocalDateTime_Properties.check(TestLocalDateTime_Properties.java:1081)
	at org.joda.time.TestLocalDateTime_Properties.testPropertySetCopyDay(TestLocalDateTime_Properties.java:440)

testPropertySetCopyTextDay(org.joda.time.TestLocalDateTime_Properties)  Time elapsed: 0 sec  <<< FAILURE!
junit.framework.AssertionFailedError: expected:<30> but was:<29>
	at junit.framework.Assert.fail(Assert.java:47)
	at junit.framework.Assert.failNotEquals(Assert.java:280)
	at junit.framework.Assert.assertEquals(Assert.java:64)
	at junit.framework.Assert.assertEquals(Assert.java:198)
	at junit.framework.Assert.assertEquals(Assert.java:204)
	at org.joda.time.TestLocalDateTime_Properties.check(TestLocalDateTime_Properties.java:1081)
	at org.joda.time.TestLocalDateTime_Properties.testPropertySetCopyTextDay(TestLocalDateTime_Properties.java:456)

testPropertyWithMaxMinValueHour(org.joda.time.TestLocalDateTime_Properties)  Time elapsed: 0.001 sec  <<< FAILURE!
junit.framework.AssertionFailedError: expected:<30> but was:<29>
	at junit.framework.Assert.fail(Assert.java:47)
	at junit.framework.Assert.failNotEquals(Assert.java:280)
	at junit.framework.Assert.assertEquals(Assert.java:64)
	at junit.framework.Assert.assertEquals(Assert.java:198)
	at junit.framework.Assert.assertEquals(Assert.java:204)
	at org.joda.time.TestLocalDateTime_Properties.check(TestLocalDateTime_Properties.java:1081)
	at org.joda.time.TestLocalDateTime_Properties.testPropertyWithMaxMinValueHour(TestLocalDateTime_Properties.java:589)

testToLocalDateTime_LocalTime(org.joda.time.TestLocalDate_Basics)  Time elapsed: 0 sec  <<< FAILURE!
junit.framework.AssertionFailedError: expected:<2005-06-09T12:13:13.985> but was:<2005-06-09T12:13:14.015>
	at junit.framework.Assert.fail(Assert.java:47)
	at junit.framework.Assert.failNotEquals(Assert.java:280)
	at junit.framework.Assert.assertEquals(Assert.java:64)
	at junit.framework.Assert.assertEquals(Assert.java:71)
	at org.joda.time.TestLocalDate_Basics.testToLocalDateTime_LocalTime(TestLocalDate_Basics.java:786)

testConstructor_DateTimeZone(org.joda.time.TestLocalTime_Constructors)  Time elapsed: 0 sec  <<< FAILURE!
junit.framework.AssertionFailedError: expected:<30> but was:<29>
	at junit.framework.Assert.fail(Assert.java:47)
	at junit.framework.Assert.failNotEquals(Assert.java:280)
	at junit.framework.Assert.assertEquals(Assert.java:64)
	at junit.framework.Assert.assertEquals(Assert.java:198)
	at junit.framework.Assert.assertEquals(Assert.java:204)
	at org.joda.time.TestLocalTime_Constructors.testConstructor_DateTimeZone(TestLocalTime_Constructors.java:206)

testConstructor_nullDateTimeZone(org.joda.time.TestLocalTime_Constructors)  Time elapsed: 0 sec  <<< FAILURE!
junit.framework.AssertionFailedError: expected:<30> but was:<29>
	at junit.framework.Assert.fail(Assert.java:47)
	at junit.framework.Assert.failNotEquals(Assert.java:280)
	at junit.framework.Assert.assertEquals(Assert.java:64)
	at junit.framework.Assert.assertEquals(Assert.java:198)
	at junit.framework.Assert.assertEquals(Assert.java:204)
	at org.joda.time.TestLocalTime_Constructors.testConstructor_nullDateTimeZone(TestLocalTime_Constructors.java:228)

testConstructor_long_DateTimeZone_2(org.joda.time.TestLocalTime_Constructors)  Time elapsed: 0 sec  <<< FAILURE!
junit.framework.AssertionFailedError: expected:<3> but was:<2>
	at junit.framework.Assert.fail(Assert.java:47)
	at junit.framework.Assert.failNotEquals(Assert.java:280)
	at junit.framework.Assert.assertEquals(Assert.java:64)
	at junit.framework.Assert.assertEquals(Assert.java:198)
	at junit.framework.Assert.assertEquals(Assert.java:204)
	at org.joda.time.TestLocalTime_Constructors.testConstructor_long_DateTimeZone_2(TestLocalTime_Constructors.java:289)

testToString(org.joda.time.TestMutableInterval_Basics)  Time elapsed: 0 sec  <<< FAILURE!
junit.framework.ComparisonFailure: expected:<2004-06-09T07:08:0[9.010Z/2005-08-13T12:14:16.018]Z> but was:<2004-06-09T07:08:0[8.990Z/2005-08-13T12:14:15.982]Z>
	at junit.framework.Assert.assertEquals(Assert.java:81)
	at junit.framework.Assert.assertEquals(Assert.java:87)
	at org.joda.time.TestMutableInterval_Basics.testToString(TestMutableInterval_Basics.java:471)

testConstructor_long_long1(org.joda.time.TestPeriod_Constructors)  Time elapsed: 0.003 sec  <<< FAILURE!
junit.framework.AssertionFailedError: expected:<1> but was:<0>
	at junit.framework.Assert.fail(Assert.java:47)
	at junit.framework.Assert.failNotEquals(Assert.java:280)
	at junit.framework.Assert.assertEquals(Assert.java:64)
	at junit.framework.Assert.assertEquals(Assert.java:198)
	at junit.framework.Assert.assertEquals(Assert.java:204)
	at org.joda.time.TestPeriod_Constructors.testConstructor_long_long1(TestPeriod_Constructors.java:473)

testConstructor_RI_RI1(org.joda.time.TestPeriod_Constructors)  Time elapsed: 0 sec  <<< FAILURE!
junit.framework.AssertionFailedError: expected:<1> but was:<0>
	at junit.framework.Assert.fail(Assert.java:47)
	at junit.framework.Assert.failNotEquals(Assert.java:280)
	at junit.framework.Assert.assertEquals(Assert.java:64)
	at junit.framework.Assert.assertEquals(Assert.java:198)
	at junit.framework.Assert.assertEquals(Assert.java:204)
	at org.joda.time.TestPeriod_Constructors.testConstructor_RI_RI1(TestPeriod_Constructors.java:628)

testConstructor_RI_RI2(org.joda.time.TestPeriod_Constructors)  Time elapsed: 0 sec  <<< FAILURE!
junit.framework.AssertionFailedError: expected:<1> but was:<0>
	at junit.framework.Assert.fail(Assert.java:47)
	at junit.framework.Assert.failNotEquals(Assert.java:280)
	at junit.framework.Assert.assertEquals(Assert.java:64)
	at junit.framework.Assert.assertEquals(Assert.java:198)
	at junit.framework.Assert.assertEquals(Assert.java:204)
	at org.joda.time.TestPeriod_Constructors.testConstructor_RI_RI2(TestPeriod_Constructors.java:643)

testConstructor_RI_RI3(org.joda.time.TestPeriod_Constructors)  Time elapsed: 0 sec  <<< FAILURE!
junit.framework.AssertionFailedError: expected:<1> but was:<0>
	at junit.framework.Assert.fail(Assert.java:47)
	at junit.framework.Assert.failNotEquals(Assert.java:280)
	at junit.framework.Assert.assertEquals(Assert.java:64)
	at junit.framework.Assert.assertEquals(Assert.java:198)
	at junit.framework.Assert.assertEquals(Assert.java:204)
	at org.joda.time.TestPeriod_Constructors.testConstructor_RI_RI3(TestPeriod_Constructors.java:658)

testConstructor_RI_RI4(org.joda.time.TestPeriod_Constructors)  Time elapsed: 0.001 sec  <<< FAILURE!
junit.framework.AssertionFailedError: expected:<-1> but was:<0>
	at junit.framework.Assert.fail(Assert.java:47)
	at junit.framework.Assert.failNotEquals(Assert.java:280)
	at junit.framework.Assert.assertEquals(Assert.java:64)
	at junit.framework.Assert.assertEquals(Assert.java:198)
	at junit.framework.Assert.assertEquals(Assert.java:204)
	at org.joda.time.TestPeriod_Constructors.testConstructor_RI_RI4(TestPeriod_Constructors.java:673)

testConstructor_long_long_Chronology1(org.joda.time.TestPeriod_Constructors)  Time elapsed: 0.001 sec  <<< FAILURE!
junit.framework.AssertionFailedError: expected:<1> but was:<0>
	at junit.framework.Assert.fail(Assert.java:47)
	at junit.framework.Assert.failNotEquals(Assert.java:280)
	at junit.framework.Assert.assertEquals(Assert.java:64)
	at junit.framework.Assert.assertEquals(Assert.java:198)
	at junit.framework.Assert.assertEquals(Assert.java:204)
	at org.joda.time.TestPeriod_Constructors.testConstructor_long_long_Chronology1(TestPeriod_Constructors.java:566)

testConstructor_long_long2(org.joda.time.TestPeriod_Constructors)  Time elapsed: 0 sec  <<< FAILURE!
junit.framework.AssertionFailedError: expected:<1> but was:<0>
	at junit.framework.Assert.fail(Assert.java:47)
	at junit.framework.Assert.failNotEquals(Assert.java:280)
	at junit.framework.Assert.assertEquals(Assert.java:64)
	at junit.framework.Assert.assertEquals(Assert.java:198)
	at junit.framework.Assert.assertEquals(Assert.java:204)
	at org.joda.time.TestPeriod_Constructors.testConstructor_long_long2(TestPeriod_Constructors.java:488)

testConstructor_RI_RD1(org.joda.time.TestPeriod_Constructors)  Time elapsed: 0.001 sec  <<< FAILURE!
junit.framework.AssertionFailedError: expected:<1> but was:<0>
	at junit.framework.Assert.fail(Assert.java:47)
	at junit.framework.Assert.failNotEquals(Assert.java:280)
	at junit.framework.Assert.assertEquals(Assert.java:64)
	at junit.framework.Assert.assertEquals(Assert.java:198)
	at junit.framework.Assert.assertEquals(Assert.java:204)
	at org.joda.time.TestPeriod_Constructors.testConstructor_RI_RD1(TestPeriod_Constructors.java:1025)

testConstructor_RD_RI1(org.joda.time.TestPeriod_Constructors)  Time elapsed: 0 sec  <<< FAILURE!
junit.framework.AssertionFailedError: expected:<1> but was:<0>
	at junit.framework.Assert.fail(Assert.java:47)
	at junit.framework.Assert.failNotEquals(Assert.java:280)
	at junit.framework.Assert.assertEquals(Assert.java:64)
	at junit.framework.Assert.assertEquals(Assert.java:198)
	at junit.framework.Assert.assertEquals(Assert.java:204)
	at org.joda.time.TestPeriod_Constructors.testConstructor_RD_RI1(TestPeriod_Constructors.java:1089)

testConstructor_RI_RD_PeriodType1(org.joda.time.TestPeriod_Constructors)  Time elapsed: 0.001 sec  <<< FAILURE!
junit.framework.AssertionFailedError: expected:<1> but was:<0>
	at junit.framework.Assert.fail(Assert.java:47)
	at junit.framework.Assert.failNotEquals(Assert.java:280)
	at junit.framework.Assert.assertEquals(Assert.java:64)
	at junit.framework.Assert.assertEquals(Assert.java:198)
	at junit.framework.Assert.assertEquals(Assert.java:204)
	at org.joda.time.TestPeriod_Constructors.testConstructor_RI_RD_PeriodType1(TestPeriod_Constructors.java:1057)

testConstructor_RD_RI_PeriodType1(org.joda.time.TestPeriod_Constructors)  Time elapsed: 0.001 sec  <<< FAILURE!
junit.framework.AssertionFailedError: expected:<1> but was:<0>
	at junit.framework.Assert.fail(Assert.java:47)
	at junit.framework.Assert.failNotEquals(Assert.java:280)
	at junit.framework.Assert.assertEquals(Assert.java:64)
	at junit.framework.Assert.assertEquals(Assert.java:198)
	at junit.framework.Assert.assertEquals(Assert.java:204)
	at org.joda.time.TestPeriod_Constructors.testConstructor_RD_RI_PeriodType1(TestPeriod_Constructors.java:1121)

testConstructor_long_long_PeriodType1(org.joda.time.TestPeriod_Constructors)  Time elapsed: 0.001 sec  <<< FAILURE!
junit.framework.AssertionFailedError: expected:<1> but was:<0>
	at junit.framework.Assert.fail(Assert.java:47)
	at junit.framework.Assert.failNotEquals(Assert.java:280)
	at junit.framework.Assert.assertEquals(Assert.java:64)
	at junit.framework.Assert.assertEquals(Assert.java:198)
	at junit.framework.Assert.assertEquals(Assert.java:204)
	at org.joda.time.TestPeriod_Constructors.testConstructor_long_long_PeriodType1(TestPeriod_Constructors.java:504)

testConstructor_long_long_PeriodType2(org.joda.time.TestPeriod_Constructors)  Time elapsed: 0 sec  <<< FAILURE!
junit.framework.AssertionFailedError: expected:<1> but was:<0>
	at junit.framework.Assert.fail(Assert.java:47)
	at junit.framework.Assert.failNotEquals(Assert.java:280)
	at junit.framework.Assert.assertEquals(Assert.java:64)
	at junit.framework.Assert.assertEquals(Assert.java:198)
	at junit.framework.Assert.assertEquals(Assert.java:204)
	at org.joda.time.TestPeriod_Constructors.testConstructor_long_long_PeriodType2(TestPeriod_Constructors.java:519)

testToPeriod_PeriodType3(org.joda.time.TestPeriod_Constructors)  Time elapsed: 0.001 sec  <<< FAILURE!
junit.framework.AssertionFailedError: expected:<7> but was:<6>
	at junit.framework.Assert.fail(Assert.java:47)
	at junit.framework.Assert.failNotEquals(Assert.java:280)
	at junit.framework.Assert.assertEquals(Assert.java:64)
	at junit.framework.Assert.assertEquals(Assert.java:198)
	at junit.framework.Assert.assertEquals(Assert.java:204)
	at org.joda.time.TestPeriod_Constructors.testToPeriod_PeriodType3(TestPeriod_Constructors.java:550)

testConstructor_long_long_PeriodType3(org.joda.time.TestPeriod_Constructors)  Time elapsed: 0 sec  <<< FAILURE!
junit.framework.AssertionFailedError: expected:<1> but was:<0>
	at junit.framework.Assert.fail(Assert.java:47)
	at junit.framework.Assert.failNotEquals(Assert.java:280)
	at junit.framework.Assert.assertEquals(Assert.java:64)
	at junit.framework.Assert.assertEquals(Assert.java:198)
	at junit.framework.Assert.assertEquals(Assert.java:204)
	at org.joda.time.TestPeriod_Constructors.testConstructor_long_long_PeriodType3(TestPeriod_Constructors.java:534)

testConstructor_long_long_PeriodType_Chronology1(org.joda.time.TestPeriod_Constructors)  Time elapsed: 0.001 sec  <<< FAILURE!
junit.framework.AssertionFailedError: expected:<1> but was:<0>
	at junit.framework.Assert.fail(Assert.java:47)
	at junit.framework.Assert.failNotEquals(Assert.java:280)
	at junit.framework.Assert.assertEquals(Assert.java:64)
	at junit.framework.Assert.assertEquals(Assert.java:198)
	at junit.framework.Assert.assertEquals(Assert.java:204)
	at org.joda.time.TestPeriod_Constructors.testConstructor_long_long_PeriodType_Chronology1(TestPeriod_Constructors.java:597)

testConstructor_long_long_PeriodType_Chronology2(org.joda.time.TestPeriod_Constructors)  Time elapsed: 0 sec  <<< FAILURE!
junit.framework.AssertionFailedError: expected:<1> but was:<0>
	at junit.framework.Assert.fail(Assert.java:47)
	at junit.framework.Assert.failNotEquals(Assert.java:280)
	at junit.framework.Assert.assertEquals(Assert.java:64)
	at junit.framework.Assert.assertEquals(Assert.java:198)
	at junit.framework.Assert.assertEquals(Assert.java:204)
	at org.joda.time.TestPeriod_Constructors.testConstructor_long_long_PeriodType_Chronology2(TestPeriod_Constructors.java:612)

testConstructor_RI_RI_PeriodType1(org.joda.time.TestPeriod_Constructors)  Time elapsed: 0 sec  <<< FAILURE!
junit.framework.AssertionFailedError: expected:<1> but was:<0>
	at junit.framework.Assert.fail(Assert.java:47)
	at junit.framework.Assert.failNotEquals(Assert.java:280)
	at junit.framework.Assert.assertEquals(Assert.java:64)
	at junit.framework.Assert.assertEquals(Assert.java:198)
	at junit.framework.Assert.assertEquals(Assert.java:204)
	at org.joda.time.TestPeriod_Constructors.testConstructor_RI_RI_PeriodType1(TestPeriod_Constructors.java:736)

testConstructor_RI_RI_PeriodType2(org.joda.time.TestPeriod_Constructors)  Time elapsed: 0.001 sec  <<< FAILURE!
junit.framework.AssertionFailedError: expected:<1> but was:<0>
	at junit.framework.Assert.fail(Assert.java:47)
	at junit.framework.Assert.failNotEquals(Assert.java:280)
	at junit.framework.Assert.assertEquals(Assert.java:64)
	at junit.framework.Assert.assertEquals(Assert.java:198)
	at junit.framework.Assert.assertEquals(Assert.java:204)
	at org.joda.time.TestPeriod_Constructors.testConstructor_RI_RI_PeriodType2(TestPeriod_Constructors.java:751)

testConstructor_RI_RI_PeriodType3(org.joda.time.TestPeriod_Constructors)  Time elapsed: 0 sec  <<< FAILURE!
junit.framework.AssertionFailedError: expected:<1> but was:<0>
	at junit.framework.Assert.fail(Assert.java:47)
	at junit.framework.Assert.failNotEquals(Assert.java:280)
	at junit.framework.Assert.assertEquals(Assert.java:64)
	at junit.framework.Assert.assertEquals(Assert.java:198)
	at junit.framework.Assert.assertEquals(Assert.java:204)
	at org.joda.time.TestPeriod_Constructors.testConstructor_RI_RI_PeriodType3(TestPeriod_Constructors.java:766)

testConstructor_RI_RI_PeriodType4(org.joda.time.TestPeriod_Constructors)  Time elapsed: 0.001 sec  <<< FAILURE!
junit.framework.AssertionFailedError: expected:<1> but was:<0>
	at junit.framework.Assert.fail(Assert.java:47)
	at junit.framework.Assert.failNotEquals(Assert.java:280)
	at junit.framework.Assert.assertEquals(Assert.java:64)
	at junit.framework.Assert.assertEquals(Assert.java:198)
	at junit.framework.Assert.assertEquals(Assert.java:204)
	at org.joda.time.TestPeriod_Constructors.testConstructor_RI_RI_PeriodType4(TestPeriod_Constructors.java:781)

testConstructor_long_long_Chronology2(org.joda.time.TestPeriod_Constructors)  Time elapsed: 0.001 sec  <<< FAILURE!
junit.framework.AssertionFailedError: expected:<1> but was:<0>
	at junit.framework.Assert.fail(Assert.java:47)
	at junit.framework.Assert.failNotEquals(Assert.java:280)
	at junit.framework.Assert.assertEquals(Assert.java:64)
	at junit.framework.Assert.assertEquals(Assert.java:198)
	at junit.framework.Assert.assertEquals(Assert.java:204)
	at org.joda.time.TestPeriod_Constructors.testConstructor_long_long_Chronology2(TestPeriod_Constructors.java:581)

testConstructor_long_long1(org.joda.time.TestMutablePeriod_Constructors)  Time elapsed: 0 sec  <<< FAILURE!
junit.framework.AssertionFailedError: expected:<1> but was:<0>
	at junit.framework.Assert.fail(Assert.java:47)
	at junit.framework.Assert.failNotEquals(Assert.java:280)
	at junit.framework.Assert.assertEquals(Assert.java:64)
	at junit.framework.Assert.assertEquals(Assert.java:198)
	at junit.framework.Assert.assertEquals(Assert.java:204)
	at org.joda.time.TestMutablePeriod_Constructors.testConstructor_long_long1(TestMutablePeriod_Constructors.java:479)

testConstructor_RI_RI1(org.joda.time.TestMutablePeriod_Constructors)  Time elapsed: 0.001 sec  <<< FAILURE!
junit.framework.AssertionFailedError: expected:<1> but was:<0>
	at junit.framework.Assert.fail(Assert.java:47)
	at junit.framework.Assert.failNotEquals(Assert.java:280)
	at junit.framework.Assert.assertEquals(Assert.java:64)
	at junit.framework.Assert.assertEquals(Assert.java:198)
	at junit.framework.Assert.assertEquals(Assert.java:204)
	at org.joda.time.TestMutablePeriod_Constructors.testConstructor_RI_RI1(TestMutablePeriod_Constructors.java:618)

testConstructor_RI_RI2(org.joda.time.TestMutablePeriod_Constructors)  Time elapsed: 0.001 sec  <<< FAILURE!
junit.framework.AssertionFailedError: expected:<1> but was:<0>
	at junit.framework.Assert.fail(Assert.java:47)
	at junit.framework.Assert.failNotEquals(Assert.java:280)
	at junit.framework.Assert.assertEquals(Assert.java:64)
	at junit.framework.Assert.assertEquals(Assert.java:198)
	at junit.framework.Assert.assertEquals(Assert.java:204)
	at org.joda.time.TestMutablePeriod_Constructors.testConstructor_RI_RI2(TestMutablePeriod_Constructors.java:633)

testConstructor_RI_RI3(org.joda.time.TestMutablePeriod_Constructors)  Time elapsed: 0.001 sec  <<< FAILURE!
junit.framework.AssertionFailedError: expected:<1> but was:<0>
	at junit.framework.Assert.fail(Assert.java:47)
	at junit.framework.Assert.failNotEquals(Assert.java:280)
	at junit.framework.Assert.assertEquals(Assert.java:64)
	at junit.framework.Assert.assertEquals(Assert.java:198)
	at junit.framework.Assert.assertEquals(Assert.java:204)
	at org.joda.time.TestMutablePeriod_Constructors.testConstructor_RI_RI3(TestMutablePeriod_Constructors.java:648)

testConstructor_RI_RI4(org.joda.time.TestMutablePeriod_Constructors)  Time elapsed: 0.001 sec  <<< FAILURE!
junit.framework.AssertionFailedError: expected:<-1> but was:<0>
	at junit.framework.Assert.fail(Assert.java:47)
	at junit.framework.Assert.failNotEquals(Assert.java:280)
	at junit.framework.Assert.assertEquals(Assert.java:64)
	at junit.framework.Assert.assertEquals(Assert.java:198)
	at junit.framework.Assert.assertEquals(Assert.java:204)
	at org.joda.time.TestMutablePeriod_Constructors.testConstructor_RI_RI4(TestMutablePeriod_Constructors.java:663)

testConstructor_long_long_Chronology1(org.joda.time.TestMutablePeriod_Constructors)  Time elapsed: 0.001 sec  <<< FAILURE!
junit.framework.AssertionFailedError: expected:<1> but was:<0>
	at junit.framework.Assert.fail(Assert.java:47)
	at junit.framework.Assert.failNotEquals(Assert.java:280)
	at junit.framework.Assert.assertEquals(Assert.java:64)
	at junit.framework.Assert.assertEquals(Assert.java:198)
	at junit.framework.Assert.assertEquals(Assert.java:204)
	at org.joda.time.TestMutablePeriod_Constructors.testConstructor_long_long_Chronology1(TestMutablePeriod_Constructors.java:556)

testConstructor_long_long2(org.joda.time.TestMutablePeriod_Constructors)  Time elapsed: 0.001 sec  <<< FAILURE!
junit.framework.AssertionFailedError: expected:<1> but was:<0>
	at junit.framework.Assert.fail(Assert.java:47)
	at junit.framework.Assert.failNotEquals(Assert.java:280)
	at junit.framework.Assert.assertEquals(Assert.java:64)
	at junit.framework.Assert.assertEquals(Assert.java:198)
	at junit.framework.Assert.assertEquals(Assert.java:204)
	at org.joda.time.TestMutablePeriod_Constructors.testConstructor_long_long2(TestMutablePeriod_Constructors.java:494)

testConstructor_RI_RD1(org.joda.time.TestMutablePeriod_Constructors)  Time elapsed: 0.001 sec  <<< FAILURE!
junit.framework.AssertionFailedError: expected:<1> but was:<0>
	at junit.framework.Assert.fail(Assert.java:47)
	at junit.framework.Assert.failNotEquals(Assert.java:280)
	at junit.framework.Assert.assertEquals(Assert.java:64)
	at junit.framework.Assert.assertEquals(Assert.java:198)
	at junit.framework.Assert.assertEquals(Assert.java:204)
	at org.joda.time.TestMutablePeriod_Constructors.testConstructor_RI_RD1(TestMutablePeriod_Constructors.java:771)

testConstructor_RI_RD_PeriodType1(org.joda.time.TestMutablePeriod_Constructors)  Time elapsed: 0.001 sec  <<< FAILURE!
junit.framework.AssertionFailedError: expected:<1> but was:<0>
	at junit.framework.Assert.fail(Assert.java:47)
	at junit.framework.Assert.failNotEquals(Assert.java:280)
	at junit.framework.Assert.assertEquals(Assert.java:64)
	at junit.framework.Assert.assertEquals(Assert.java:198)
	at junit.framework.Assert.assertEquals(Assert.java:204)
	at org.joda.time.TestMutablePeriod_Constructors.testConstructor_RI_RD_PeriodType1(TestMutablePeriod_Constructors.java:803)

testConstructor_long_long_PeriodType1(org.joda.time.TestMutablePeriod_Constructors)  Time elapsed: 0.001 sec  <<< FAILURE!
junit.framework.AssertionFailedError: expected:<1> but was:<0>
	at junit.framework.Assert.fail(Assert.java:47)
	at junit.framework.Assert.failNotEquals(Assert.java:280)
	at junit.framework.Assert.assertEquals(Assert.java:64)
	at junit.framework.Assert.assertEquals(Assert.java:198)
	at junit.framework.Assert.assertEquals(Assert.java:204)
	at org.joda.time.TestMutablePeriod_Constructors.testConstructor_long_long_PeriodType1(TestMutablePeriod_Constructors.java:510)

testConstructor_long_long_PeriodType2(org.joda.time.TestMutablePeriod_Constructors)  Time elapsed: 0.001 sec  <<< FAILURE!
junit.framework.AssertionFailedError: expected:<1> but was:<0>
	at junit.framework.Assert.fail(Assert.java:47)
	at junit.framework.Assert.failNotEquals(Assert.java:280)
	at junit.framework.Assert.assertEquals(Assert.java:64)
	at junit.framework.Assert.assertEquals(Assert.java:198)
	at junit.framework.Assert.assertEquals(Assert.java:204)
	at org.joda.time.TestMutablePeriod_Constructors.testConstructor_long_long_PeriodType2(TestMutablePeriod_Constructors.java:525)

testConstructor_long_long_PeriodType3(org.joda.time.TestMutablePeriod_Constructors)  Time elapsed: 0 sec  <<< FAILURE!
junit.framework.AssertionFailedError: expected:<1> but was:<0>
	at junit.framework.Assert.fail(Assert.java:47)
	at junit.framework.Assert.failNotEquals(Assert.java:280)
	at junit.framework.Assert.assertEquals(Assert.java:64)
	at junit.framework.Assert.assertEquals(Assert.java:198)
	at junit.framework.Assert.assertEquals(Assert.java:204)
	at org.joda.time.TestMutablePeriod_Constructors.testConstructor_long_long_PeriodType3(TestMutablePeriod_Constructors.java:540)

testConstructor_long_long_PeriodType_Chronology1(org.joda.time.TestMutablePeriod_Constructors)  Time elapsed: 0.001 sec  <<< FAILURE!
junit.framework.AssertionFailedError: expected:<1> but was:<0>
	at junit.framework.Assert.fail(Assert.java:47)
	at junit.framework.Assert.failNotEquals(Assert.java:280)
	at junit.framework.Assert.assertEquals(Assert.java:64)
	at junit.framework.Assert.assertEquals(Assert.java:198)
	at junit.framework.Assert.assertEquals(Assert.java:204)
	at org.joda.time.TestMutablePeriod_Constructors.testConstructor_long_long_PeriodType_Chronology1(TestMutablePeriod_Constructors.java:587)

testConstructor_long_long_PeriodType_Chronology2(org.joda.time.TestMutablePeriod_Constructors)  Time elapsed: 0.001 sec  <<< FAILURE!
junit.framework.AssertionFailedError: expected:<1> but was:<0>
	at junit.framework.Assert.fail(Assert.java:47)
	at junit.framework.Assert.failNotEquals(Assert.java:280)
	at junit.framework.Assert.assertEquals(Assert.java:64)
	at junit.framework.Assert.assertEquals(Assert.java:198)
	at junit.framework.Assert.assertEquals(Assert.java:204)
	at org.joda.time.TestMutablePeriod_Constructors.testConstructor_long_long_PeriodType_Chronology2(TestMutablePeriod_Constructors.java:602)

testConstructor_RI_RI_PeriodType1(org.joda.time.TestMutablePeriod_Constructors)  Time elapsed: 0 sec  <<< FAILURE!
junit.framework.AssertionFailedError: expected:<1> but was:<0>
	at junit.framework.Assert.fail(Assert.java:47)
	at junit.framework.Assert.failNotEquals(Assert.java:280)
	at junit.framework.Assert.assertEquals(Assert.java:64)
	at junit.framework.Assert.assertEquals(Assert.java:198)
	at junit.framework.Assert.assertEquals(Assert.java:204)
	at org.joda.time.TestMutablePeriod_Constructors.testConstructor_RI_RI_PeriodType1(TestMutablePeriod_Constructors.java:694)

testConstructor_RI_RI_PeriodType2(org.joda.time.TestMutablePeriod_Constructors)  Time elapsed: 0 sec  <<< FAILURE!
junit.framework.AssertionFailedError: expected:<1> but was:<0>
	at junit.framework.Assert.fail(Assert.java:47)
	at junit.framework.Assert.failNotEquals(Assert.java:280)
	at junit.framework.Assert.assertEquals(Assert.java:64)
	at junit.framework.Assert.assertEquals(Assert.java:198)
	at junit.framework.Assert.assertEquals(Assert.java:204)
	at org.joda.time.TestMutablePeriod_Constructors.testConstructor_RI_RI_PeriodType2(TestMutablePeriod_Constructors.java:709)

testConstructor_RI_RI_PeriodType3(org.joda.time.TestMutablePeriod_Constructors)  Time elapsed: 0 sec  <<< FAILURE!
junit.framework.AssertionFailedError: expected:<1> but was:<0>
	at junit.framework.Assert.fail(Assert.java:47)
	at junit.framework.Assert.failNotEquals(Assert.java:280)
	at junit.framework.Assert.assertEquals(Assert.java:64)
	at junit.framework.Assert.assertEquals(Assert.java:198)
	at junit.framework.Assert.assertEquals(Assert.java:204)
	at org.joda.time.TestMutablePeriod_Constructors.testConstructor_RI_RI_PeriodType3(TestMutablePeriod_Constructors.java:724)

testConstructor_RI_RI_PeriodType4(org.joda.time.TestMutablePeriod_Constructors)  Time elapsed: 0.001 sec  <<< FAILURE!
junit.framework.AssertionFailedError: expected:<1> but was:<0>
	at junit.framework.Assert.fail(Assert.java:47)
	at junit.framework.Assert.failNotEquals(Assert.java:280)
	at junit.framework.Assert.assertEquals(Assert.java:64)
	at junit.framework.Assert.assertEquals(Assert.java:198)
	at junit.framework.Assert.assertEquals(Assert.java:204)
	at org.joda.time.TestMutablePeriod_Constructors.testConstructor_RI_RI_PeriodType4(TestMutablePeriod_Constructors.java:739)

testConstructor_long_long_Chronology2(org.joda.time.TestMutablePeriod_Constructors)  Time elapsed: 0 sec  <<< FAILURE!
junit.framework.AssertionFailedError: expected:<1> but was:<0>
	at junit.framework.Assert.fail(Assert.java:47)
	at junit.framework.Assert.failNotEquals(Assert.java:280)
	at junit.framework.Assert.assertEquals(Assert.java:64)
	at junit.framework.Assert.assertEquals(Assert.java:198)
	at junit.framework.Assert.assertEquals(Assert.java:204)
	at org.joda.time.TestMutablePeriod_Constructors.testConstructor_long_long_Chronology2(TestMutablePeriod_Constructors.java:571)

testAdd_RInterval2(org.joda.time.TestMutablePeriod_Updates)  Time elapsed: 0 sec  <<< FAILURE!
junit.framework.AssertionFailedError: expected:<2> but was:<1>
	at junit.framework.Assert.fail(Assert.java:47)
	at junit.framework.Assert.failNotEquals(Assert.java:280)
	at junit.framework.Assert.assertEquals(Assert.java:64)
	at junit.framework.Assert.assertEquals(Assert.java:198)
	at junit.framework.Assert.assertEquals(Assert.java:204)
	at org.joda.time.TestMutablePeriod_Updates.testAdd_RInterval2(TestMutablePeriod_Updates.java:1338)

testAdd_RInterval4(org.joda.time.TestMutablePeriod_Updates)  Time elapsed: 0.001 sec  <<< FAILURE!
junit.framework.AssertionFailedError: expected:<8> but was:<7>
	at junit.framework.Assert.fail(Assert.java:47)
	at junit.framework.Assert.failNotEquals(Assert.java:280)
	at junit.framework.Assert.assertEquals(Assert.java:64)
	at junit.framework.Assert.assertEquals(Assert.java:198)
	at junit.framework.Assert.assertEquals(Assert.java:204)
	at org.joda.time.TestMutablePeriod_Updates.testAdd_RInterval4(TestMutablePeriod_Updates.java:1366)

testSetPeriod_long_long1(org.joda.time.TestMutablePeriod_Updates)  Time elapsed: 0 sec  <<< FAILURE!
junit.framework.AssertionFailedError: expected:<1> but was:<0>
	at junit.framework.Assert.fail(Assert.java:47)
	at junit.framework.Assert.failNotEquals(Assert.java:280)
	at junit.framework.Assert.assertEquals(Assert.java:64)
	at junit.framework.Assert.assertEquals(Assert.java:198)
	at junit.framework.Assert.assertEquals(Assert.java:204)
	at org.joda.time.TestMutablePeriod_Updates.testSetPeriod_long_long1(TestMutablePeriod_Updates.java:569)

testSetPeriod_long_long2(org.joda.time.TestMutablePeriod_Updates)  Time elapsed: 0.001 sec  <<< FAILURE!
junit.framework.AssertionFailedError: expected:<-1> but was:<0>
	at junit.framework.Assert.fail(Assert.java:47)
	at junit.framework.Assert.failNotEquals(Assert.java:280)
	at junit.framework.Assert.assertEquals(Assert.java:64)
	at junit.framework.Assert.assertEquals(Assert.java:198)
	at junit.framework.Assert.assertEquals(Assert.java:204)
	at org.joda.time.TestMutablePeriod_Updates.testSetPeriod_long_long2(TestMutablePeriod_Updates.java:584)

testSetPeriod_long_long_NoYears(org.joda.time.TestMutablePeriod_Updates)  Time elapsed: 0.001 sec  <<< FAILURE!
junit.framework.AssertionFailedError: expected:<1> but was:<0>
	at junit.framework.Assert.fail(Assert.java:47)
	at junit.framework.Assert.failNotEquals(Assert.java:280)
	at junit.framework.Assert.assertEquals(Assert.java:64)
	at junit.framework.Assert.assertEquals(Assert.java:198)
	at junit.framework.Assert.assertEquals(Assert.java:204)
	at org.joda.time.TestMutablePeriod_Updates.testSetPeriod_long_long_NoYears(TestMutablePeriod_Updates.java:613)

testSetPeriod_long_long_NoMonths(org.joda.time.TestMutablePeriod_Updates)  Time elapsed: 0 sec  <<< FAILURE!
junit.framework.AssertionFailedError: expected:<1> but was:<0>
	at junit.framework.Assert.fail(Assert.java:47)
	at junit.framework.Assert.failNotEquals(Assert.java:280)
	at junit.framework.Assert.assertEquals(Assert.java:64)
	at junit.framework.Assert.assertEquals(Assert.java:198)
	at junit.framework.Assert.assertEquals(Assert.java:204)
	at org.joda.time.TestMutablePeriod_Updates.testSetPeriod_long_long_NoMonths(TestMutablePeriod_Updates.java:628)

testSetPeriod_long_long_NoWeeks(org.joda.time.TestMutablePeriod_Updates)  Time elapsed: 0.001 sec  <<< FAILURE!
junit.framework.AssertionFailedError: expected:<1> but was:<0>
	at junit.framework.Assert.fail(Assert.java:47)
	at junit.framework.Assert.failNotEquals(Assert.java:280)
	at junit.framework.Assert.assertEquals(Assert.java:64)
	at junit.framework.Assert.assertEquals(Assert.java:198)
	at junit.framework.Assert.assertEquals(Assert.java:204)
	at org.joda.time.TestMutablePeriod_Updates.testSetPeriod_long_long_NoWeeks(TestMutablePeriod_Updates.java:643)

testSetPeriod_long_long_NoDays(org.joda.time.TestMutablePeriod_Updates)  Time elapsed: 0 sec  <<< FAILURE!
junit.framework.AssertionFailedError: expected:<1> but was:<0>
	at junit.framework.Assert.fail(Assert.java:47)
	at junit.framework.Assert.failNotEquals(Assert.java:280)
	at junit.framework.Assert.assertEquals(Assert.java:64)
	at junit.framework.Assert.assertEquals(Assert.java:198)
	at junit.framework.Assert.assertEquals(Assert.java:204)
	at org.joda.time.TestMutablePeriod_Updates.testSetPeriod_long_long_NoDays(TestMutablePeriod_Updates.java:658)

testSetPeriod_long_long_NoHours(org.joda.time.TestMutablePeriod_Updates)  Time elapsed: 0.001 sec  <<< FAILURE!
junit.framework.AssertionFailedError: expected:<1> but was:<0>
	at junit.framework.Assert.fail(Assert.java:47)
	at junit.framework.Assert.failNotEquals(Assert.java:280)
	at junit.framework.Assert.assertEquals(Assert.java:64)
	at junit.framework.Assert.assertEquals(Assert.java:198)
	at junit.framework.Assert.assertEquals(Assert.java:204)
	at org.joda.time.TestMutablePeriod_Updates.testSetPeriod_long_long_NoHours(TestMutablePeriod_Updates.java:673)

testSetPeriod_long_long_NoMinutes(org.joda.time.TestMutablePeriod_Updates)  Time elapsed: 0 sec  <<< FAILURE!
junit.framework.AssertionFailedError: expected:<61> but was:<60>
	at junit.framework.Assert.fail(Assert.java:47)
	at junit.framework.Assert.failNotEquals(Assert.java:280)
	at junit.framework.Assert.assertEquals(Assert.java:64)
	at junit.framework.Assert.assertEquals(Assert.java:198)
	at junit.framework.Assert.assertEquals(Assert.java:204)
	at org.joda.time.TestMutablePeriod_Updates.testSetPeriod_long_long_NoMinutes(TestMutablePeriod_Updates.java:688)

testSetPeriod_long_long_NoSeconds(org.joda.time.TestMutablePeriod_Updates)  Time elapsed: 0.001 sec  <<< FAILURE!
junit.framework.AssertionFailedError: expected:<1001> but was:<999>
	at junit.framework.Assert.fail(Assert.java:47)
	at junit.framework.Assert.failNotEquals(Assert.java:280)
	at junit.framework.Assert.assertEquals(Assert.java:64)
	at junit.framework.Assert.assertEquals(Assert.java:198)
	at junit.framework.Assert.assertEquals(Assert.java:204)
	at org.joda.time.TestMutablePeriod_Updates.testSetPeriod_long_long_NoSeconds(TestMutablePeriod_Updates.java:704)

testSetPeriod_long_long_NoMillis(org.joda.time.TestMutablePeriod_Updates)  Time elapsed: 0 sec  <<< FAILURE!
junit.framework.AssertionFailedError: expected:<1> but was:<0>
	at junit.framework.Assert.fail(Assert.java:47)
	at junit.framework.Assert.failNotEquals(Assert.java:280)
	at junit.framework.Assert.assertEquals(Assert.java:64)
	at junit.framework.Assert.assertEquals(Assert.java:198)
	at junit.framework.Assert.assertEquals(Assert.java:204)
	at org.joda.time.TestMutablePeriod_Updates.testSetPeriod_long_long_NoMillis(TestMutablePeriod_Updates.java:718)

testSetPeriod_RI_RI1(org.joda.time.TestMutablePeriod_Updates)  Time elapsed: 0 sec  <<< FAILURE!
junit.framework.AssertionFailedError: expected:<1> but was:<0>
	at junit.framework.Assert.fail(Assert.java:47)
	at junit.framework.Assert.failNotEquals(Assert.java:280)
	at junit.framework.Assert.assertEquals(Assert.java:64)
	at junit.framework.Assert.assertEquals(Assert.java:198)
	at junit.framework.Assert.assertEquals(Assert.java:204)
	at org.joda.time.TestMutablePeriod_Updates.testSetPeriod_RI_RI1(TestMutablePeriod_Updates.java:734)

testSetPeriod_RI_RI2(org.joda.time.TestMutablePeriod_Updates)  Time elapsed: 0.001 sec  <<< FAILURE!
junit.framework.AssertionFailedError: expected:<-1> but was:<0>
	at junit.framework.Assert.fail(Assert.java:47)
	at junit.framework.Assert.failNotEquals(Assert.java:280)
	at junit.framework.Assert.assertEquals(Assert.java:64)
	at junit.framework.Assert.assertEquals(Assert.java:198)
	at junit.framework.Assert.assertEquals(Assert.java:204)
	at org.joda.time.TestMutablePeriod_Updates.testSetPeriod_RI_RI2(TestMutablePeriod_Updates.java:749)

testSetPeriod_RInterval1(org.joda.time.TestMutablePeriod_Updates)  Time elapsed: 0 sec  <<< FAILURE!
junit.framework.AssertionFailedError: expected:<1> but was:<0>
	at junit.framework.Assert.fail(Assert.java:47)
	at junit.framework.Assert.failNotEquals(Assert.java:280)
	at junit.framework.Assert.assertEquals(Assert.java:64)
	at junit.framework.Assert.assertEquals(Assert.java:198)
	at junit.framework.Assert.assertEquals(Assert.java:204)
	at org.joda.time.TestMutablePeriod_Updates.testSetPeriod_RInterval1(TestMutablePeriod_Updates.java:779)

testConstructor_DateTimeZone(org.joda.time.TestTimeOfDay_Constructors)  Time elapsed: 0.001 sec  <<< FAILURE!
junit.framework.AssertionFailedError: expected:<30> but was:<29>
	at junit.framework.Assert.fail(Assert.java:47)
	at junit.framework.Assert.failNotEquals(Assert.java:280)
	at junit.framework.Assert.assertEquals(Assert.java:64)
	at junit.framework.Assert.assertEquals(Assert.java:198)
	at junit.framework.Assert.assertEquals(Assert.java:204)
	at org.joda.time.TestTimeOfDay_Constructors.testConstructor_DateTimeZone(TestTimeOfDay_Constructors.java:199)

testConstructor_nullDateTimeZone(org.joda.time.TestTimeOfDay_Constructors)  Time elapsed: 0.001 sec  <<< FAILURE!
junit.framework.AssertionFailedError: expected:<30> but was:<29>
	at junit.framework.Assert.fail(Assert.java:47)
	at junit.framework.Assert.failNotEquals(Assert.java:280)
	at junit.framework.Assert.assertEquals(Assert.java:64)
	at junit.framework.Assert.assertEquals(Assert.java:198)
	at junit.framework.Assert.assertEquals(Assert.java:204)
	at org.joda.time.TestTimeOfDay_Constructors.testConstructor_nullDateTimeZone(TestTimeOfDay_Constructors.java:222)

testToDateTime_TOD(org.joda.time.TestYearMonthDay_Basics)  Time elapsed: 0.001 sec  <<< FAILURE!
junit.framework.AssertionFailedError: expected:<2005-06-09T12:13:13.985Z> but was:<2005-06-09T12:13:14.015Z>
	at junit.framework.Assert.fail(Assert.java:47)
	at junit.framework.Assert.failNotEquals(Assert.java:280)
	at junit.framework.Assert.assertEquals(Assert.java:64)
	at junit.framework.Assert.assertEquals(Assert.java:71)
	at org.joda.time.TestYearMonthDay_Basics.testToDateTime_TOD(TestYearMonthDay_Basics.java:611)

testToDateTime_TOD_Zone(org.joda.time.TestYearMonthDay_Basics)  Time elapsed: 0.001 sec  <<< FAILURE!
junit.framework.AssertionFailedError: expected:<2005-06-09T12:13:13.985+09:00> but was:<2005-06-09T12:13:14.015+09:00>
	at junit.framework.Assert.fail(Assert.java:47)
	at junit.framework.Assert.failNotEquals(Assert.java:280)
	at junit.framework.Assert.assertEquals(Assert.java:64)
	at junit.framework.Assert.assertEquals(Assert.java:71)
	at org.joda.time.TestYearMonthDay_Basics.testToDateTime_TOD_Zone(TestYearMonthDay_Basics.java:633)

testToDateTime_TOD_nullZone(org.joda.time.TestYearMonthDay_Basics)  Time elapsed: 0 sec  <<< FAILURE!
junit.framework.AssertionFailedError: expected:<2005-06-09T12:13:13.985Z> but was:<2005-06-09T12:13:14.015Z>
	at junit.framework.Assert.fail(Assert.java:47)
	at junit.framework.Assert.failNotEquals(Assert.java:280)
	at junit.framework.Assert.assertEquals(Assert.java:64)
	at junit.framework.Assert.assertEquals(Assert.java:71)
	at org.joda.time.TestYearMonthDay_Basics.testToDateTime_TOD_nullZone(TestYearMonthDay_Basics.java:643)

test_DateTime_roundFloor_secondOfMinute_NewYork_Autumn_preCutover(org.joda.time.TestDateTimeZoneCutover)  Time elapsed: 0 sec  <<< FAILURE!
junit.framework.ComparisonFailure: expected:<2007-11-04T01:30:[40].500-04:00> but was:<2007-11-04T01:30:[39].500-04:00>
	at junit.framework.Assert.assertEquals(Assert.java:81)
	at junit.framework.Assert.assertEquals(Assert.java:87)
	at org.joda.time.TestDateTimeZoneCutover.test_DateTime_roundFloor_secondOfMinute_NewYork_Autumn_preCutover(TestDateTimeZoneCutover.java:741)

test_DateTime_roundFloor_secondOfMinute_NewYork_Autumn_postCutover(org.joda.time.TestDateTimeZoneCutover)  Time elapsed: 0.001 sec  <<< FAILURE!
junit.framework.ComparisonFailure: expected:<2007-11-04T01:30:[40].500-05:00> but was:<2007-11-04T01:30:[39].500-05:00>
	at junit.framework.Assert.assertEquals(Assert.java:81)
	at junit.framework.Assert.assertEquals(Assert.java:87)
	at org.joda.time.TestDateTimeZoneCutover.test_DateTime_roundFloor_secondOfMinute_NewYork_Autumn_postCutover(TestDateTimeZoneCutover.java:748)

test_DateTime_roundCeiling_secondOfMinute_NewYork_Autumn_preCutover(org.joda.time.TestDateTimeZoneCutover)  Time elapsed: 0.001 sec  <<< FAILURE!
junit.framework.ComparisonFailure: expected:<2007-11-04T01:30:[40].500-04:00> but was:<2007-11-04T01:30:[39].500-04:00>
	at junit.framework.Assert.assertEquals(Assert.java:81)
	at junit.framework.Assert.assertEquals(Assert.java:87)
	at org.joda.time.TestDateTimeZoneCutover.test_DateTime_roundCeiling_secondOfMinute_NewYork_Autumn_preCutover(TestDateTimeZoneCutover.java:798)

test_DateTime_roundCeiling_secondOfMinute_NewYork_Autumn_postCutover(org.joda.time.TestDateTimeZoneCutover)  Time elapsed: 0.001 sec  <<< FAILURE!
junit.framework.ComparisonFailure: expected:<2007-11-04T01:30:[40].500-05:00> but was:<2007-11-04T01:30:[39].500-05:00>
	at junit.framework.Assert.assertEquals(Assert.java:81)
	at junit.framework.Assert.assertEquals(Assert.java:87)
	at org.joda.time.TestDateTimeZoneCutover.test_DateTime_roundCeiling_secondOfMinute_NewYork_Autumn_postCutover(TestDateTimeZoneCutover.java:805)

test_getOffsetFromLocal_Moscow_Autumn(org.joda.time.TestDateTimeZoneCutover)  Time elapsed: 0.001 sec  <<< FAILURE!
junit.framework.ComparisonFailure: 2007-10-28T02:30:58.001+04:00 expected:<2007-10-28T02:30:5[9.999]+04:00> but was:<2007-10-28T02:30:5[8.001]+04:00>
	at junit.framework.Assert.assertEquals(Assert.java:81)
	at org.joda.time.TestDateTimeZoneCutover.doTest_getOffsetFromLocal(TestDateTimeZoneCutover.java:1371)
	at org.joda.time.TestDateTimeZoneCutover.doTest_getOffsetFromLocal(TestDateTimeZoneCutover.java:1359)
	at org.joda.time.TestDateTimeZoneCutover.test_getOffsetFromLocal_Moscow_Autumn(TestDateTimeZoneCutover.java:898)

testDateTime(org.joda.time.TestStringConvert)  Time elapsed: 0.002 sec  <<< FAILURE!
junit.framework.ComparisonFailure: expected:<2010-06-30T02:30:[50.678]+02:00> but was:<2010-06-30T02:30:[49.322]+02:00>
	at junit.framework.Assert.assertEquals(Assert.java:81)
	at junit.framework.Assert.assertEquals(Assert.java:87)
	at org.joda.time.TestStringConvert.testDateTime(TestStringConvert.java:63)

testMutableDateTime(org.joda.time.TestStringConvert)  Time elapsed: 0.001 sec  <<< FAILURE!
junit.framework.ComparisonFailure: expected:<2010-06-30T02:30:[50.678]+02:00> but was:<2010-06-30T02:30:[49.322]+02:00>
	at junit.framework.Assert.assertEquals(Assert.java:81)
	at junit.framework.Assert.assertEquals(Assert.java:87)
	at org.joda.time.TestStringConvert.testMutableDateTime(TestStringConvert.java:70)

testParseEquivalence(org.joda.time.chrono.TestGJChronology)  Time elapsed: 0 sec  <<< FAILURE!
junit.framework.AssertionFailedError: expected:<1581-01-01T01:23:45.678Z> but was:<1581-01-01T01:23:44.322Z>
	at junit.framework.Assert.fail(Assert.java:47)
	at junit.framework.Assert.failNotEquals(Assert.java:280)
	at junit.framework.Assert.assertEquals(Assert.java:64)
	at junit.framework.Assert.assertEquals(Assert.java:71)
	at org.joda.time.chrono.TestGJChronology.testParse(TestGJChronology.java:375)
	at org.joda.time.chrono.TestGJChronology.testParseEquivalence(TestGJChronology.java:362)

testMaxYear(org.joda.time.chrono.TestISOChronology)  Time elapsed: 0.001 sec  <<< FAILURE!
junit.framework.AssertionFailedError: expected:<31535999999> but was:<31535998001>
	at junit.framework.Assert.fail(Assert.java:47)
	at junit.framework.Assert.failNotEquals(Assert.java:280)
	at junit.framework.Assert.assertEquals(Assert.java:64)
	at junit.framework.Assert.assertEquals(Assert.java:133)
	at junit.framework.Assert.assertEquals(Assert.java:139)
	at org.joda.time.chrono.TestISOChronology.testMaxYear(TestISOChronology.java:322)

testMinYear(org.joda.time.chrono.TestISOChronology)  Time elapsed: 0.001 sec  <<< FAILURE!
junit.framework.AssertionFailedError: expected:<31535999999> but was:<31535998001>
	at junit.framework.Assert.fail(Assert.java:47)
	at junit.framework.Assert.failNotEquals(Assert.java:280)
	at junit.framework.Assert.assertEquals(Assert.java:64)
	at junit.framework.Assert.assertEquals(Assert.java:133)
	at junit.framework.Assert.assertEquals(Assert.java:139)
	at org.joda.time.chrono.TestISOChronology.testMinYear(TestISOChronology.java:355)

testGetInstantMillis_Object_Zone(org.joda.time.convert.TestStringConverter)  Time elapsed: 0.001 sec  <<< FAILURE!
junit.framework.AssertionFailedError: expected:<1086776687499> but was:<1086776688501>
	at junit.framework.Assert.fail(Assert.java:47)
	at junit.framework.Assert.failNotEquals(Assert.java:280)
	at junit.framework.Assert.assertEquals(Assert.java:64)
	at junit.framework.Assert.assertEquals(Assert.java:133)
	at junit.framework.Assert.assertEquals(Assert.java:139)
	at org.joda.time.convert.TestStringConverter.testGetInstantMillis_Object_Zone(TestStringConverter.java:158)

testGetInstantMillis_Object_Chronology(org.joda.time.convert.TestStringConverter)  Time elapsed: 0.001 sec  <<< FAILURE!
junit.framework.AssertionFailedError: expected:<1087903487499> but was:<1087903488501>
	at junit.framework.Assert.fail(Assert.java:47)
	at junit.framework.Assert.failNotEquals(Assert.java:280)
	at junit.framework.Assert.assertEquals(Assert.java:64)
	at junit.framework.Assert.assertEquals(Assert.java:133)
	at junit.framework.Assert.assertEquals(Assert.java:139)
	at org.joda.time.convert.TestStringConverter.testGetInstantMillis_Object_Chronology(TestStringConverter.java:172)

testGetInstantMillis_Object(org.joda.time.convert.TestStringConverter)  Time elapsed: 0 sec  <<< FAILURE!
junit.framework.AssertionFailedError: expected:<1086755087499> but was:<1086755088501>
	at junit.framework.Assert.fail(Assert.java:47)
	at junit.framework.Assert.failNotEquals(Assert.java:280)
	at junit.framework.Assert.assertEquals(Assert.java:64)
	at junit.framework.Assert.assertEquals(Assert.java:133)
	at junit.framework.Assert.assertEquals(Assert.java:139)
	at org.joda.time.convert.TestStringConverter.testGetInstantMillis_Object(TestStringConverter.java:114)

testPrint_bufferMethods(org.joda.time.format.TestDateTimeFormatter)  Time elapsed: 0.001 sec  <<< FAILURE!
junit.framework.ComparisonFailure: expected:<...ed 2004-06-09T10:20:[30]Z> but was:<...ed 2004-06-09T10:20:[29]Z>
	at junit.framework.Assert.assertEquals(Assert.java:81)
	at junit.framework.Assert.assertEquals(Assert.java:87)
	at org.joda.time.format.TestDateTimeFormatter.testPrint_bufferMethods(TestDateTimeFormatter.java:164)

testPrint_writerMethods(org.joda.time.format.TestDateTimeFormatter)  Time elapsed: 0.001 sec  <<< FAILURE!
junit.framework.ComparisonFailure: expected:<...ed 2004-06-09T10:20:[30]Z> but was:<...ed 2004-06-09T10:20:[29]Z>
	at junit.framework.Assert.assertEquals(Assert.java:81)
	at junit.framework.Assert.assertEquals(Assert.java:87)
	at org.joda.time.format.TestDateTimeFormatter.testPrint_writerMethods(TestDateTimeFormatter.java:186)

testPrint_appendableMethods(org.joda.time.format.TestDateTimeFormatter)  Time elapsed: 0.001 sec  <<< FAILURE!
junit.framework.ComparisonFailure: expected:<...ed 2004-06-09T10:20:[30]Z> but was:<...ed 2004-06-09T10:20:[29]Z>
	at junit.framework.Assert.assertEquals(Assert.java:81)
	at junit.framework.Assert.assertEquals(Assert.java:87)
	at org.joda.time.format.TestDateTimeFormatter.testPrint_appendableMethods(TestDateTimeFormatter.java:208)

testPrint_chrono_and_zone(org.joda.time.format.TestDateTimeFormatter)  Time elapsed: 0 sec  <<< FAILURE!
junit.framework.ComparisonFailure: expected:<...ed 2004-06-09T10:20:[30]Z> but was:<...ed 2004-06-09T10:20:[29]Z>
	at junit.framework.Assert.assertEquals(Assert.java:81)
	at junit.framework.Assert.assertEquals(Assert.java:87)
	at org.joda.time.format.TestDateTimeFormatter.testPrint_chrono_and_zone(TestDateTimeFormatter.java:228)

testZoneNameNearTransition(org.joda.time.format.TestDateTimeFormatter)  Time elapsed: 0.002 sec  <<< FAILURE!
junit.framework.ComparisonFailure: expected:<2005-10-30 01:59:5[9.9] Eastern Daylight Ti...> but was:<2005-10-30 01:59:5[8.0] Eastern Daylight Ti...>
	at junit.framework.Assert.assertEquals(Assert.java:81)
	at junit.framework.Assert.assertEquals(Assert.java:87)
	at org.joda.time.format.TestDateTimeFormatter.testZoneNameNearTransition(TestDateTimeFormatter.java:1004)

testZoneShortNameNearTransition(org.joda.time.format.TestDateTimeFormatter)  Time elapsed: 0.001 sec  <<< FAILURE!
junit.framework.ComparisonFailure: expected:<2005-10-30 01:59:5[9.9] EDT> but was:<2005-10-30 01:59:5[8.0] EDT>
	at junit.framework.Assert.assertEquals(Assert.java:81)
	at junit.framework.Assert.assertEquals(Assert.java:87)
	at org.joda.time.format.TestDateTimeFormatter.testZoneShortNameNearTransition(TestDateTimeFormatter.java:1020)

testPrint_simple(org.joda.time.format.TestDateTimeFormatter)  Time elapsed: 0.001 sec  <<< FAILURE!
junit.framework.ComparisonFailure: expected:<...ed 2004-06-09T10:20:[30]Z> but was:<...ed 2004-06-09T10:20:[29]Z>
	at junit.framework.Assert.assertEquals(Assert.java:81)
	at junit.framework.Assert.assertEquals(Assert.java:87)
	at org.joda.time.format.TestDateTimeFormatter.testPrint_simple(TestDateTimeFormatter.java:112)

testPrint_locale(org.joda.time.format.TestDateTimeFormatter)  Time elapsed: 0.001 sec  <<< FAILURE!
junit.framework.ComparisonFailure: expected:<...r. 2004-06-09T10:20:[30]Z> but was:<...r. 2004-06-09T10:20:[29]Z>
	at junit.framework.Assert.assertEquals(Assert.java:81)
	at junit.framework.Assert.assertEquals(Assert.java:87)
	at org.joda.time.format.TestDateTimeFormatter.testPrint_locale(TestDateTimeFormatter.java:127)

testPrint_zone(org.joda.time.format.TestDateTimeFormatter)  Time elapsed: 0.001 sec  <<< FAILURE!
junit.framework.ComparisonFailure: expected:<...ed 2004-06-09T06:20:[30]-04:00> but was:<...ed 2004-06-09T06:20:[29]-04:00>
	at junit.framework.Assert.assertEquals(Assert.java:81)
	at junit.framework.Assert.assertEquals(Assert.java:87)
	at org.joda.time.format.TestDateTimeFormatter.testPrint_zone(TestDateTimeFormatter.java:134)

testPrint_chrono(org.joda.time.format.TestDateTimeFormatter)  Time elapsed: 0 sec  <<< FAILURE!
junit.framework.ComparisonFailure: expected:<...ed 2004-06-09T12:20:[30]+02:00> but was:<...ed 2004-06-09T12:20:[29]+02:00>
	at junit.framework.Assert.assertEquals(Assert.java:81)
	at junit.framework.Assert.assertEquals(Assert.java:87)
	at org.joda.time.format.TestDateTimeFormatter.testPrint_chrono(TestDateTimeFormatter.java:148)

testFormat_second(org.joda.time.format.TestDateTimeFormat)  Time elapsed: 0 sec  <<< FAILURE!
junit.framework.ComparisonFailure: 2004-06-09T10:20:29.960Z expected:<[30]> but was:<[29]>
	at junit.framework.Assert.assertEquals(Assert.java:81)
	at org.joda.time.format.TestDateTimeFormat.testFormat_second(TestDateTimeFormat.java:718)

testFormat_fractionOfSecond(org.joda.time.format.TestDateTimeFormat)  Time elapsed: 0.001 sec  <<< FAILURE!
junit.framework.ComparisonFailure: 2004-06-09T10:20:29.960Z expected:<[04]0> but was:<[96]0>
	at junit.framework.Assert.assertEquals(Assert.java:81)
	at org.joda.time.format.TestDateTimeFormat.testFormat_fractionOfSecond(TestDateTimeFormat.java:731)

testFormat_fractionOfSecondLong(org.joda.time.format.TestDateTimeFormat)  Time elapsed: 0 sec  <<< FAILURE!
junit.framework.ComparisonFailure: 2004-06-09T10:20:29.960Z expected:<[04]0000> but was:<[96]0000>
	at junit.framework.Assert.assertEquals(Assert.java:81)
	at org.joda.time.format.TestDateTimeFormat.testFormat_fractionOfSecondLong(TestDateTimeFormat.java:744)

testFormat_samples(org.joda.time.format.TestDateTimeFormat)  Time elapsed: 0.001 sec  <<< FAILURE!
junit.framework.ComparisonFailure: expected:<2004-06-09 10.20.[30]> but was:<2004-06-09 10.20.[29]>
	at junit.framework.Assert.assertEquals(Assert.java:81)
	at junit.framework.Assert.assertEquals(Assert.java:87)
	at org.joda.time.format.TestDateTimeFormat.testFormat_samples(TestDateTimeFormat.java:844)

testFormat_ordinalDateTimeNoMillis(org.joda.time.format.TestISODateTimeFormat)  Time elapsed: 0.001 sec  <<< FAILURE!
junit.framework.ComparisonFailure: expected:<2004-161T10:20:[30]Z> but was:<2004-161T10:20:[29]Z>
	at junit.framework.Assert.assertEquals(Assert.java:81)
	at junit.framework.Assert.assertEquals(Assert.java:87)
	at org.joda.time.format.TestISODateTimeFormat.testFormat_ordinalDateTimeNoMillis(TestISODateTimeFormat.java:232)

testFormat_weekDateTime(org.joda.time.format.TestISODateTimeFormat)  Time elapsed: 0 sec  <<< FAILURE!
junit.framework.ComparisonFailure: expected:<2004-W24-3T10:20:[30.04]0Z> but was:<2004-W24-3T10:20:[29.96]0Z>
	at junit.framework.Assert.assertEquals(Assert.java:81)
	at junit.framework.Assert.assertEquals(Assert.java:87)
	at org.joda.time.format.TestISODateTimeFormat.testFormat_weekDateTime(TestISODateTimeFormat.java:254)

testFormat_weekDateTimeNoMillis(org.joda.time.format.TestISODateTimeFormat)  Time elapsed: 0.001 sec  <<< FAILURE!
junit.framework.ComparisonFailure: expected:<2004-W24-3T10:20:[30]Z> but was:<2004-W24-3T10:20:[29]Z>
	at junit.framework.Assert.assertEquals(Assert.java:81)
	at junit.framework.Assert.assertEquals(Assert.java:87)
	at org.joda.time.format.TestISODateTimeFormat.testFormat_weekDateTimeNoMillis(TestISODateTimeFormat.java:265)

testFormat_basicTime(org.joda.time.format.TestISODateTimeFormat)  Time elapsed: 0 sec  <<< FAILURE!
junit.framework.ComparisonFailure: expected:<1020[30.04]0Z> but was:<1020[29.96]0Z>
	at junit.framework.Assert.assertEquals(Assert.java:81)
	at junit.framework.Assert.assertEquals(Assert.java:87)
	at org.joda.time.format.TestISODateTimeFormat.testFormat_basicTime(TestISODateTimeFormat.java:288)

testFormat_basicTimeNoMillis(org.joda.time.format.TestISODateTimeFormat)  Time elapsed: 0.001 sec  <<< FAILURE!
junit.framework.ComparisonFailure: expected:<1020[30]Z> but was:<1020[29]Z>
	at junit.framework.Assert.assertEquals(Assert.java:81)
	at junit.framework.Assert.assertEquals(Assert.java:87)
	at org.joda.time.format.TestISODateTimeFormat.testFormat_basicTimeNoMillis(TestISODateTimeFormat.java:299)

testFormat_basicTTime(org.joda.time.format.TestISODateTimeFormat)  Time elapsed: 0 sec  <<< FAILURE!
junit.framework.ComparisonFailure: expected:<T1020[30.04]0Z> but was:<T1020[29.96]0Z>
	at junit.framework.Assert.assertEquals(Assert.java:81)
	at junit.framework.Assert.assertEquals(Assert.java:87)
	at org.joda.time.format.TestISODateTimeFormat.testFormat_basicTTime(TestISODateTimeFormat.java:310)

testFormat_basicTTimeNoMillis(org.joda.time.format.TestISODateTimeFormat)  Time elapsed: 0.001 sec  <<< FAILURE!
junit.framework.ComparisonFailure: expected:<T1020[30]Z> but was:<T1020[29]Z>
	at junit.framework.Assert.assertEquals(Assert.java:81)
	at junit.framework.Assert.assertEquals(Assert.java:87)
	at org.joda.time.format.TestISODateTimeFormat.testFormat_basicTTimeNoMillis(TestISODateTimeFormat.java:321)

testFormat_basicDateTime(org.joda.time.format.TestISODateTimeFormat)  Time elapsed: 0 sec  <<< FAILURE!
junit.framework.ComparisonFailure: expected:<20040609T1020[30.04]0Z> but was:<20040609T1020[29.96]0Z>
	at junit.framework.Assert.assertEquals(Assert.java:81)
	at junit.framework.Assert.assertEquals(Assert.java:87)
	at org.joda.time.format.TestISODateTimeFormat.testFormat_basicDateTime(TestISODateTimeFormat.java:332)

testFormat_basicDateTimeNoMillis(org.joda.time.format.TestISODateTimeFormat)  Time elapsed: 0.001 sec  <<< FAILURE!
junit.framework.ComparisonFailure: expected:<20040609T1020[30]Z> but was:<20040609T1020[29]Z>
	at junit.framework.Assert.assertEquals(Assert.java:81)
	at junit.framework.Assert.assertEquals(Assert.java:87)
	at org.joda.time.format.TestISODateTimeFormat.testFormat_basicDateTimeNoMillis(TestISODateTimeFormat.java:343)

testFormat_basicOrdinalDateTime(org.joda.time.format.TestISODateTimeFormat)  Time elapsed: 0.001 sec  <<< FAILURE!
junit.framework.ComparisonFailure: expected:<2004161T1020[30.04]0Z> but was:<2004161T1020[29.96]0Z>
	at junit.framework.Assert.assertEquals(Assert.java:81)
	at junit.framework.Assert.assertEquals(Assert.java:87)
	at org.joda.time.format.TestISODateTimeFormat.testFormat_basicOrdinalDateTime(TestISODateTimeFormat.java:365)

testFormat_basicOrdinalDateTimeNoMillis(org.joda.time.format.TestISODateTimeFormat)  Time elapsed: 0.001 sec  <<< FAILURE!
junit.framework.ComparisonFailure: expected:<2004161T1020[30]Z> but was:<2004161T1020[29]Z>
	at junit.framework.Assert.assertEquals(Assert.java:81)
	at junit.framework.Assert.assertEquals(Assert.java:87)
	at org.joda.time.format.TestISODateTimeFormat.testFormat_basicOrdinalDateTimeNoMillis(TestISODateTimeFormat.java:376)

testFormat_basicWeekDateTime(org.joda.time.format.TestISODateTimeFormat)  Time elapsed: 0.001 sec  <<< FAILURE!
junit.framework.ComparisonFailure: expected:<2004W243T1020[30.04]0Z> but was:<2004W243T1020[29.96]0Z>
	at junit.framework.Assert.assertEquals(Assert.java:81)
	at junit.framework.Assert.assertEquals(Assert.java:87)
	at org.joda.time.format.TestISODateTimeFormat.testFormat_basicWeekDateTime(TestISODateTimeFormat.java:398)

testFormat_basicWeekDateTimeNoMillis(org.joda.time.format.TestISODateTimeFormat)  Time elapsed: 0.001 sec  <<< FAILURE!
junit.framework.ComparisonFailure: expected:<2004W243T1020[30]Z> but was:<2004W243T1020[29]Z>
	at junit.framework.Assert.assertEquals(Assert.java:81)
	at junit.framework.Assert.assertEquals(Assert.java:87)
	at org.joda.time.format.TestISODateTimeFormat.testFormat_basicWeekDateTimeNoMillis(TestISODateTimeFormat.java:409)

testFormat_hourMinuteSecond(org.joda.time.format.TestISODateTimeFormat)  Time elapsed: 0 sec  <<< FAILURE!
junit.framework.ComparisonFailure: expected:<10:20:[30]> but was:<10:20:[29]>
	at junit.framework.Assert.assertEquals(Assert.java:81)
	at junit.framework.Assert.assertEquals(Assert.java:87)
	at org.joda.time.format.TestISODateTimeFormat.testFormat_hourMinuteSecond(TestISODateTimeFormat.java:510)

testFormat_hourMinuteSecondMillis(org.joda.time.format.TestISODateTimeFormat)  Time elapsed: 0.001 sec  <<< FAILURE!
junit.framework.ComparisonFailure: expected:<10:20:[30.04]0> but was:<10:20:[29.96]0>
	at junit.framework.Assert.assertEquals(Assert.java:81)
	at junit.framework.Assert.assertEquals(Assert.java:87)
	at org.joda.time.format.TestISODateTimeFormat.testFormat_hourMinuteSecondMillis(TestISODateTimeFormat.java:521)

testFormat_hourMinuteSecondFraction(org.joda.time.format.TestISODateTimeFormat)  Time elapsed: 0.001 sec  <<< FAILURE!
junit.framework.ComparisonFailure: expected:<10:20:[30.04]0> but was:<10:20:[29.96]0>
	at junit.framework.Assert.assertEquals(Assert.java:81)
	at junit.framework.Assert.assertEquals(Assert.java:87)
	at org.joda.time.format.TestISODateTimeFormat.testFormat_hourMinuteSecondFraction(TestISODateTimeFormat.java:532)

testFormat_dateHourMinuteSecond(org.joda.time.format.TestISODateTimeFormat)  Time elapsed: 0 sec  <<< FAILURE!
junit.framework.ComparisonFailure: expected:<2004-06-09T10:20:[30]> but was:<2004-06-09T10:20:[29]>
	at junit.framework.Assert.assertEquals(Assert.java:81)
	at junit.framework.Assert.assertEquals(Assert.java:87)
	at org.joda.time.format.TestISODateTimeFormat.testFormat_dateHourMinuteSecond(TestISODateTimeFormat.java:566)

testFormat_dateHourMinuteSecondMillis(org.joda.time.format.TestISODateTimeFormat)  Time elapsed: 0 sec  <<< FAILURE!
junit.framework.ComparisonFailure: expected:<2004-06-09T10:20:[30.04]0> but was:<2004-06-09T10:20:[29.96]0>
	at junit.framework.Assert.assertEquals(Assert.java:81)
	at junit.framework.Assert.assertEquals(Assert.java:87)
	at org.joda.time.format.TestISODateTimeFormat.testFormat_dateHourMinuteSecondMillis(TestISODateTimeFormat.java:577)

testFormat_tTime(org.joda.time.format.TestISODateTimeFormat)  Time elapsed: 0 sec  <<< FAILURE!
junit.framework.ComparisonFailure: expected:<T10:20:[30.04]0Z> but was:<T10:20:[29.96]0Z>
	at junit.framework.Assert.assertEquals(Assert.java:81)
	at junit.framework.Assert.assertEquals(Assert.java:87)
	at org.joda.time.format.TestISODateTimeFormat.testFormat_tTime(TestISODateTimeFormat.java:154)

testFormat_tTimeNoMillis(org.joda.time.format.TestISODateTimeFormat)  Time elapsed: 0.001 sec  <<< FAILURE!
junit.framework.ComparisonFailure: expected:<T10:20:[30]Z> but was:<T10:20:[29]Z>
	at junit.framework.Assert.assertEquals(Assert.java:81)
	at junit.framework.Assert.assertEquals(Assert.java:87)
	at org.joda.time.format.TestISODateTimeFormat.testFormat_tTimeNoMillis(TestISODateTimeFormat.java:165)

testFormat_dateTime(org.joda.time.format.TestISODateTimeFormat)  Time elapsed: 0.001 sec  <<< FAILURE!
junit.framework.ComparisonFailure: expected:<2004-06-09T10:20:[30.04]0Z> but was:<2004-06-09T10:20:[29.96]0Z>
	at junit.framework.Assert.assertEquals(Assert.java:81)
	at junit.framework.Assert.assertEquals(Assert.java:87)
	at org.joda.time.format.TestISODateTimeFormat.testFormat_dateTime(TestISODateTimeFormat.java:176)

testFormat_dateTimeNoMillis(org.joda.time.format.TestISODateTimeFormat)  Time elapsed: 0.001 sec  <<< FAILURE!
junit.framework.ComparisonFailure: expected:<2004-06-09T10:20:[30]Z> but was:<2004-06-09T10:20:[29]Z>
	at junit.framework.Assert.assertEquals(Assert.java:81)
	at junit.framework.Assert.assertEquals(Assert.java:87)
	at org.joda.time.format.TestISODateTimeFormat.testFormat_dateTimeNoMillis(TestISODateTimeFormat.java:199)

testFormat_ordinalDateTime(org.joda.time.format.TestISODateTimeFormat)  Time elapsed: 0 sec  <<< FAILURE!
junit.framework.ComparisonFailure: expected:<2004-161T10:20:[30.04]0Z> but was:<2004-161T10:20:[29.96]0Z>
	at junit.framework.Assert.assertEquals(Assert.java:81)
	at junit.framework.Assert.assertEquals(Assert.java:87)
	at org.joda.time.format.TestISODateTimeFormat.testFormat_ordinalDateTime(TestISODateTimeFormat.java:221)

testFormat_time(org.joda.time.format.TestISODateTimeFormat)  Time elapsed: 0 sec  <<< FAILURE!
junit.framework.ComparisonFailure: expected:<10:20:[30.04]0Z> but was:<10:20:[29.96]0Z>
	at junit.framework.Assert.assertEquals(Assert.java:81)
	at junit.framework.Assert.assertEquals(Assert.java:87)
	at org.joda.time.format.TestISODateTimeFormat.testFormat_time(TestISODateTimeFormat.java:116)

testFormat_timeNoMillis(org.joda.time.format.TestISODateTimeFormat)  Time elapsed: 0 sec  <<< FAILURE!
junit.framework.ComparisonFailure: expected:<10:20:[30]Z> but was:<10:20:[29]Z>
	at junit.framework.Assert.assertEquals(Assert.java:81)
	at junit.framework.Assert.assertEquals(Assert.java:87)
	at org.joda.time.format.TestISODateTimeFormat.testFormat_timeNoMillis(TestISODateTimeFormat.java:135)

testFormat_dateHourMinuteSecondFraction(org.joda.time.format.TestISODateTimeFormat)  Time elapsed: 0 sec  <<< FAILURE!
junit.framework.ComparisonFailure: expected:<2004-06-09T10:20:[30.04]0> but was:<2004-06-09T10:20:[29.96]0>
	at junit.framework.Assert.assertEquals(Assert.java:81)
	at junit.framework.Assert.assertEquals(Assert.java:87)
	at org.joda.time.format.TestISODateTimeFormat.testFormat_dateHourMinuteSecondFraction(TestISODateTimeFormat.java:588)

test_timeParser(org.joda.time.format.TestISODateTimeFormatParsing)  Time elapsed: 0.002 sec  <<< FAILURE!
junit.framework.AssertionFailedError: expected:<1970-01-01T10:20:29.960Z> but was:<1970-01-01T10:20:30.040Z>
	at junit.framework.Assert.fail(Assert.java:47)
	at junit.framework.Assert.failNotEquals(Assert.java:280)
	at junit.framework.Assert.assertEquals(Assert.java:64)
	at junit.framework.Assert.assertEquals(Assert.java:71)
	at org.joda.time.format.TestISODateTimeFormatParsing.assertParse(TestISODateTimeFormatParsing.java:841)
	at org.joda.time.format.TestISODateTimeFormatParsing.test_timeParser(TestISODateTimeFormatParsing.java:180)

test_time(org.joda.time.format.TestISODateTimeFormatParsing)  Time elapsed: 0 sec  <<< FAILURE!
junit.framework.AssertionFailedError: expected:<1970-01-01T10:20:29.600Z> but was:<1970-01-01T10:20:30.400Z>
	at junit.framework.Assert.fail(Assert.java:47)
	at junit.framework.Assert.failNotEquals(Assert.java:280)
	at junit.framework.Assert.assertEquals(Assert.java:64)
	at junit.framework.Assert.assertEquals(Assert.java:71)
	at org.joda.time.format.TestISODateTimeFormatParsing.assertParse(TestISODateTimeFormatParsing.java:841)
	at org.joda.time.format.TestISODateTimeFormatParsing.test_time(TestISODateTimeFormatParsing.java:375)

test_tTime(org.joda.time.format.TestISODateTimeFormatParsing)  Time elapsed: 0.001 sec  <<< FAILURE!
junit.framework.AssertionFailedError: expected:<1970-01-01T10:20:29.600Z> but was:<1970-01-01T10:20:30.400Z>
	at junit.framework.Assert.fail(Assert.java:47)
	at junit.framework.Assert.failNotEquals(Assert.java:280)
	at junit.framework.Assert.assertEquals(Assert.java:64)
	at junit.framework.Assert.assertEquals(Assert.java:71)
	at org.joda.time.format.TestISODateTimeFormatParsing.assertParse(TestISODateTimeFormatParsing.java:841)
	at org.joda.time.format.TestISODateTimeFormatParsing.test_tTime(TestISODateTimeFormatParsing.java:402)

test_dateTime(org.joda.time.format.TestISODateTimeFormatParsing)  Time elapsed: 0.001 sec  <<< FAILURE!
junit.framework.AssertionFailedError: expected:<2006-02-04T10:20:29.600Z> but was:<2006-02-04T10:20:30.400Z>
	at junit.framework.Assert.fail(Assert.java:47)
	at junit.framework.Assert.failNotEquals(Assert.java:280)
	at junit.framework.Assert.assertEquals(Assert.java:64)
	at junit.framework.Assert.assertEquals(Assert.java:71)
	at org.joda.time.format.TestISODateTimeFormatParsing.assertParse(TestISODateTimeFormatParsing.java:841)
	at org.joda.time.format.TestISODateTimeFormatParsing.test_dateTime(TestISODateTimeFormatParsing.java:429)

test_ordinalDateTime(org.joda.time.format.TestISODateTimeFormatParsing)  Time elapsed: 0 sec  <<< FAILURE!
junit.framework.AssertionFailedError: expected:<2006-05-03T10:20:29.600Z> but was:<2006-05-03T10:20:30.400Z>
	at junit.framework.Assert.fail(Assert.java:47)
	at junit.framework.Assert.failNotEquals(Assert.java:280)
	at junit.framework.Assert.assertEquals(Assert.java:64)
	at junit.framework.Assert.assertEquals(Assert.java:71)
	at org.joda.time.format.TestISODateTimeFormatParsing.assertParse(TestISODateTimeFormatParsing.java:841)
	at org.joda.time.format.TestISODateTimeFormatParsing.test_ordinalDateTime(TestISODateTimeFormatParsing.java:486)

test_weekDateTime(org.joda.time.format.TestISODateTimeFormatParsing)  Time elapsed: 0.001 sec  <<< FAILURE!
junit.framework.AssertionFailedError: expected:<2006-07-05T10:20:29.600Z> but was:<2006-07-05T10:20:30.400Z>
	at junit.framework.Assert.fail(Assert.java:47)
	at junit.framework.Assert.failNotEquals(Assert.java:280)
	at junit.framework.Assert.assertEquals(Assert.java:64)
	at junit.framework.Assert.assertEquals(Assert.java:71)
	at org.joda.time.format.TestISODateTimeFormatParsing.assertParse(TestISODateTimeFormatParsing.java:841)
	at org.joda.time.format.TestISODateTimeFormatParsing.test_weekDateTime(TestISODateTimeFormatParsing.java:533)

test_basicTime(org.joda.time.format.TestISODateTimeFormatParsing)  Time elapsed: 0.001 sec  <<< FAILURE!
junit.framework.AssertionFailedError: expected:<1970-01-01T10:20:29.600Z> but was:<1970-01-01T10:20:30.400Z>
	at junit.framework.Assert.fail(Assert.java:47)
	at junit.framework.Assert.failNotEquals(Assert.java:280)
	at junit.framework.Assert.assertEquals(Assert.java:64)
	at junit.framework.Assert.assertEquals(Assert.java:71)
	at org.joda.time.format.TestISODateTimeFormatParsing.assertParse(TestISODateTimeFormatParsing.java:841)
	at org.joda.time.format.TestISODateTimeFormatParsing.test_basicTime(TestISODateTimeFormatParsing.java:582)

test_basicTTime(org.joda.time.format.TestISODateTimeFormatParsing)  Time elapsed: 0.001 sec  <<< FAILURE!
junit.framework.AssertionFailedError: expected:<1970-01-01T10:20:29.600Z> but was:<1970-01-01T10:20:30.400Z>
	at junit.framework.Assert.fail(Assert.java:47)
	at junit.framework.Assert.failNotEquals(Assert.java:280)
	at junit.framework.Assert.assertEquals(Assert.java:64)
	at junit.framework.Assert.assertEquals(Assert.java:71)
	at org.joda.time.format.TestISODateTimeFormatParsing.assertParse(TestISODateTimeFormatParsing.java:841)
	at org.joda.time.format.TestISODateTimeFormatParsing.test_basicTTime(TestISODateTimeFormatParsing.java:609)

test_basicDateTime(org.joda.time.format.TestISODateTimeFormatParsing)  Time elapsed: 0.001 sec  <<< FAILURE!
junit.framework.AssertionFailedError: expected:<2006-12-04T10:20:29.600Z> but was:<2006-12-04T10:20:30.400Z>
	at junit.framework.Assert.fail(Assert.java:47)
	at junit.framework.Assert.failNotEquals(Assert.java:280)
	at junit.framework.Assert.assertEquals(Assert.java:64)
	at junit.framework.Assert.assertEquals(Assert.java:71)
	at org.joda.time.format.TestISODateTimeFormatParsing.assertParse(TestISODateTimeFormatParsing.java:841)
	at org.joda.time.format.TestISODateTimeFormatParsing.test_basicDateTime(TestISODateTimeFormatParsing.java:636)

test_basicOrdinalDateTime(org.joda.time.format.TestISODateTimeFormatParsing)  Time elapsed: 0.001 sec  <<< FAILURE!
junit.framework.AssertionFailedError: expected:<2006-05-03T10:20:29.600Z> but was:<2006-05-03T10:20:30.400Z>
	at junit.framework.Assert.fail(Assert.java:47)
	at junit.framework.Assert.failNotEquals(Assert.java:280)
	at junit.framework.Assert.assertEquals(Assert.java:64)
	at junit.framework.Assert.assertEquals(Assert.java:71)
	at org.joda.time.format.TestISODateTimeFormatParsing.assertParse(TestISODateTimeFormatParsing.java:841)
	at org.joda.time.format.TestISODateTimeFormatParsing.test_basicOrdinalDateTime(TestISODateTimeFormatParsing.java:686)

test_basicWeekDateTime(org.joda.time.format.TestISODateTimeFormatParsing)  Time elapsed: 0.001 sec  <<< FAILURE!
junit.framework.AssertionFailedError: expected:<2006-07-05T10:20:29.600Z> but was:<2006-07-05T10:20:30.400Z>
	at junit.framework.Assert.fail(Assert.java:47)
	at junit.framework.Assert.failNotEquals(Assert.java:280)
	at junit.framework.Assert.assertEquals(Assert.java:64)
	at junit.framework.Assert.assertEquals(Assert.java:71)
	at org.joda.time.format.TestISODateTimeFormatParsing.assertParse(TestISODateTimeFormatParsing.java:841)
	at org.joda.time.format.TestISODateTimeFormatParsing.test_basicWeekDateTime(TestISODateTimeFormatParsing.java:734)

test_hourMinuteSecondMillis(org.joda.time.format.TestISODateTimeFormatParsing)  Time elapsed: 0 sec  <<< FAILURE!
junit.framework.AssertionFailedError: expected:<1970-01-01T10:20:29.600Z> but was:<1970-01-01T10:20:30.400Z>
	at junit.framework.Assert.fail(Assert.java:47)
	at junit.framework.Assert.failNotEquals(Assert.java:280)
	at junit.framework.Assert.assertEquals(Assert.java:64)
	at junit.framework.Assert.assertEquals(Assert.java:71)
	at org.joda.time.format.TestISODateTimeFormatParsing.assertParse(TestISODateTimeFormatParsing.java:841)
	at org.joda.time.format.TestISODateTimeFormatParsing.test_hourMinuteSecondMillis(TestISODateTimeFormatParsing.java:797)

test_hourMinuteSecondFraction(org.joda.time.format.TestISODateTimeFormatParsing)  Time elapsed: 0 sec  <<< FAILURE!
junit.framework.AssertionFailedError: expected:<1970-01-01T10:20:29.600Z> but was:<1970-01-01T10:20:30.400Z>
	at junit.framework.Assert.fail(Assert.java:47)
	at junit.framework.Assert.failNotEquals(Assert.java:280)
	at junit.framework.Assert.assertEquals(Assert.java:64)
	at junit.framework.Assert.assertEquals(Assert.java:71)
	at org.joda.time.format.TestISODateTimeFormatParsing.assertParse(TestISODateTimeFormatParsing.java:841)
	at org.joda.time.format.TestISODateTimeFormatParsing.test_hourMinuteSecondFraction(TestISODateTimeFormatParsing.java:812)


Results :

Failed tests: 
  org.joda.time.TestDateMidnight_Basics#testIsAfter AssertionFailedError expecte...
  org.joda.time.TestDateMidnight_Basics#testIsBefore AssertionFailedError expect...
  org.joda.time.TestDateTimeZoneCutover#test_DateTime_roundCeiling_secondOfMinute_NewYork_Autumn_postCutover ComparisonFailure
  org.joda.time.TestDateTimeZoneCutover#test_DateTime_roundCeiling_secondOfMinute_NewYork_Autumn_preCutover ComparisonFailure
  org.joda.time.TestDateTimeZoneCutover#test_DateTime_roundFloor_secondOfMinute_NewYork_Autumn_postCutover ComparisonFailure
  org.joda.time.TestDateTimeZoneCutover#test_DateTime_roundFloor_secondOfMinute_NewYork_Autumn_preCutover ComparisonFailure
  org.joda.time.TestDateTimeZoneCutover#test_getOffsetFromLocal_Moscow_Autumn ComparisonFailure
  org.joda.time.TestDateTime_Basics#testWithers AssertionFailedError expected:<3...
  org.joda.time.TestDateTime_Constructors#testConstructor_long_max AssertionFailedError
  org.joda.time.TestDateTime_Properties#testPropertyGetMillisOfDay AssertionFailedError
  org.joda.time.TestDateTime_Properties#testPropertyGetMillisOfSecond AssertionFailedError
  org.joda.time.TestDateTime_Properties#testPropertyGetSecondOfDay AssertionFailedError
  org.joda.time.TestDateTime_Properties#testPropertyGetSecondOfMinute AssertionFailedError
  org.joda.time.TestDateTime_Properties#testPropertyRoundHalfCeilingHourOfDay ComparisonFailure
  org.joda.time.TestDateTime_Properties#testPropertyRoundHalfEvenHourOfDay ComparisonFailure
  org.joda.time.TestDateTime_Properties#testPropertyRoundHalfFloorHourOfDay ComparisonFailure
  org.joda.time.TestDateTime_Properties#testPropertyToIntervalMillisOfSecond AssertionFailedError
  org.joda.time.TestDateTime_Properties#testPropertyToIntervalSecondOfMinute AssertionFailedError
  org.joda.time.TestInterval_Basics#testToString ComparisonFailure expected:<200...
  org.joda.time.TestLocalDateTime_Basics#testCompareTo AssertionFailedError expe...
  org.joda.time.TestLocalDateTime_Basics#testEqualsHashCode AssertionFailedError
  org.joda.time.TestLocalDateTime_Basics#testGet_DateTimeFieldType AssertionFailedError
  org.joda.time.TestLocalDateTime_Basics#testGetters AssertionFailedError expect...
  org.joda.time.TestLocalDateTime_Basics#testToDateTime AssertionFailedError exp...
  org.joda.time.TestLocalDateTime_Basics#testToDateTime_RI AssertionFailedError ...
  org.joda.time.TestLocalDateTime_Basics#testToDateTime_Zone AssertionFailedError
  org.joda.time.TestLocalDateTime_Basics#testToDateTime_nullRI AssertionFailedError
  org.joda.time.TestLocalDateTime_Basics#testToDateTime_nullZone AssertionFailedError
  org.joda.time.TestLocalDateTime_Basics#testToDate_summer AssertionFailedError ...
  org.joda.time.TestLocalDateTime_Basics#testToDate_summer_Zone AssertionFailedError
  org.joda.time.TestLocalDateTime_Basics#testToDate_winter AssertionFailedError ...
  org.joda.time.TestLocalDateTime_Basics#testToDate_winter_Zone AssertionFailedError
  org.joda.time.TestLocalDateTime_Basics#testToLocalTime AssertionFailedError ex...
  org.joda.time.TestLocalDateTime_Basics#testToString ComparisonFailure expected...
  org.joda.time.TestLocalDateTime_Basics#testToString_DTFormatter ComparisonFailure
  org.joda.time.TestLocalDateTime_Basics#testToString_String ComparisonFailure e...
  org.joda.time.TestLocalDateTime_Basics#testToString_String_Locale ComparisonFailure
  org.joda.time.TestLocalDateTime_Basics#testWithDate AssertionFailedError expec...
  org.joda.time.TestLocalDateTime_Basics#testWithTime AssertionFailedError expec...
  org.joda.time.TestLocalDateTime_Basics#testWithers AssertionFailedError expect...
  org.joda.time.TestLocalDateTime_Constructors#testConstructor_int_int_int_Chronology AssertionFailedError
  org.joda.time.TestLocalDateTime_Constructors#testConstructor_int_int_int_int_int_int_int AssertionFailedError
  org.joda.time.TestLocalDateTime_Constructors#testParse_noFormatter AssertionFailedError
  org.joda.time.TestLocalDateTime_Properties#testPropertyAddToCopyDay AssertionFailedError
  org.joda.time.TestLocalDateTime_Properties#testPropertyAddToCopyHour AssertionFailedError
  org.joda.time.TestLocalDateTime_Properties#testPropertyAddToCopyMilli AssertionFailedError
  org.joda.time.TestLocalDateTime_Properties#testPropertyAddToCopyMinute AssertionFailedError
  org.joda.time.TestLocalDateTime_Properties#testPropertyAddToCopyMonth AssertionFailedError
  org.joda.time.TestLocalDateTime_Properties#testPropertyAddToCopySecond AssertionFailedError
  org.joda.time.TestLocalDateTime_Properties#testPropertyAddToCopyYear AssertionFailedError
  org.joda.time.TestLocalDateTime_Properties#testPropertyAddWrapFieldToCopyDay AssertionFailedError
  org.joda.time.TestLocalDateTime_Properties#testPropertyAddWrapFieldToCopyHour AssertionFailedError
  org.joda.time.TestLocalDateTime_Properties#testPropertyAddWrapFieldToCopyMilli AssertionFailedError
  org.joda.time.TestLocalDateTime_Properties#testPropertyAddWrapFieldToCopyMinute AssertionFailedError
  org.joda.time.TestLocalDateTime_Properties#testPropertyAddWrapFieldToCopyMonth AssertionFailedError
  org.joda.time.TestLocalDateTime_Properties#testPropertyAddWrapFieldToCopySecond AssertionFailedError
  org.joda.time.TestLocalDateTime_Properties#testPropertyAddWrapFieldToCopyYear AssertionFailedError
  org.joda.time.TestLocalDateTime_Properties#testPropertyGetMilli AssertionFailedError
  org.joda.time.TestLocalDateTime_Properties#testPropertyGetSecond AssertionFailedError
  org.joda.time.TestLocalDateTime_Properties#testPropertySetCopyDay AssertionFailedError
  org.joda.time.TestLocalDateTime_Properties#testPropertySetCopyMonth AssertionFailedError
  org.joda.time.TestLocalDateTime_Properties#testPropertySetCopyTextDay AssertionFailedError
  org.joda.time.TestLocalDateTime_Properties#testPropertySetCopyTextMonth AssertionFailedError
  org.joda.time.TestLocalDateTime_Properties#testPropertySetCopyTextYear AssertionFailedError
  org.joda.time.TestLocalDateTime_Properties#testPropertySetCopyYear AssertionFailedError
  org.joda.time.TestLocalDateTime_Properties#testPropertySetHour AssertionFailedError
  org.joda.time.TestLocalDateTime_Properties#testPropertySetMilli AssertionFailedError
  org.joda.time.TestLocalDateTime_Properties#testPropertySetMinute AssertionFailedError
  org.joda.time.TestLocalDateTime_Properties#testPropertySetSecond AssertionFailedError
  org.joda.time.TestLocalDateTime_Properties#testPropertySetTextHour AssertionFailedError
  org.joda.time.TestLocalDateTime_Properties#testPropertySetTextMilli AssertionFailedError
  org.joda.time.TestLocalDateTime_Properties#testPropertySetTextMinute AssertionFailedError
  org.joda.time.TestLocalDateTime_Properties#testPropertySetTextSecond AssertionFailedError
  org.joda.time.TestLocalDateTime_Properties#testPropertyWithMaxMinValueHour AssertionFailedError
  org.joda.time.TestLocalDateTime_Properties#testPropertyWithMaxMinValueMilli AssertionFailedError
  org.joda.time.TestLocalDateTime_Properties#testPropertyWithMaxMinValueMinute AssertionFailedError
  org.joda.time.TestLocalDateTime_Properties#testPropertyWithMaxMinValueSecond AssertionFailedError
  org.joda.time.TestLocalDateTime_Properties#testPropertyWithMaximumValueDayOfMonth AssertionFailedError
  org.joda.time.TestLocalDateTime_Properties#testPropertyWithMaximumValueHour AssertionFailedError
  org.joda.time.TestLocalDateTime_Properties#testPropertyWithMinimumValueDayOfMonth AssertionFailedError
  org.joda.time.TestLocalDateTime_Properties#testPropertyWithMinimumValueHour AssertionFailedError
  org.joda.time.TestLocalDate_Basics#testToLocalDateTime_LocalTime AssertionFailedError
  org.joda.time.TestLocalTime_Constructors#testConstructor_DateTimeZone AssertionFailedError
  org.joda.time.TestLocalTime_Constructors#testConstructor_long_DateTimeZone_2 AssertionFailedError
  org.joda.time.TestLocalTime_Constructors#testConstructor_nullDateTimeZone AssertionFailedError
  org.joda.time.TestMutableDateTime_Adds#testAddDays_int1 ComparisonFailure expe...
  org.joda.time.TestMutableDateTime_Adds#testAddHours_int1 ComparisonFailure exp...
  org.joda.time.TestMutableDateTime_Adds#testAddMillis_int1 ComparisonFailure ex...
  org.joda.time.TestMutableDateTime_Adds#testAddMinutes_int1 ComparisonFailure e...
  org.joda.time.TestMutableDateTime_Adds#testAddMonths_int1 ComparisonFailure ex...
  org.joda.time.TestMutableDateTime_Adds#testAddSeconds_int1 ComparisonFailure e...
  org.joda.time.TestMutableDateTime_Adds#testAddWeeks_int1 ComparisonFailure exp...
  org.joda.time.TestMutableDateTime_Adds#testAddWeekyears_int1 ComparisonFailure
  org.joda.time.TestMutableDateTime_Adds#testAddYears_int1 ComparisonFailure exp...
  org.joda.time.TestMutableDateTime_Adds#testAdd_RP1 ComparisonFailure expected:...
  org.joda.time.TestMutableDateTime_Basics#testRounding6 ComparisonFailure expec...
  org.joda.time.TestMutableDateTime_Properties#testPropertyGetMillisOfDay AssertionFailedError
  org.joda.time.TestMutableDateTime_Properties#testPropertyGetMillisOfSecond AssertionFailedError
  org.joda.time.TestMutableDateTime_Properties#testPropertyGetSecondOfDay AssertionFailedError
  org.joda.time.TestMutableDateTime_Properties#testPropertyGetSecondOfMinute AssertionFailedError
  org.joda.time.TestMutableDateTime_Properties#testPropertyRoundHalfCeilingHourOfDay ComparisonFailure
  org.joda.time.TestMutableDateTime_Properties#testPropertyRoundHalfEvenHourOfDay ComparisonFailure
  org.joda.time.TestMutableDateTime_Properties#testPropertyRoundHalfFloorHourOfDay ComparisonFailure
  org.joda.time.TestMutableDateTime_Properties#testPropertyToIntervalMillisOfSecond AssertionFailedError
  org.joda.time.TestMutableDateTime_Properties#testPropertyToIntervalSecondOfMinute AssertionFailedError
  org.joda.time.TestMutableDateTime_Sets#testSetDateTime_int_int_int_int_int_int_int1 AssertionFailedError
  org.joda.time.TestMutableDateTime_Sets#testSetDate_RI1 AssertionFailedError ex...
  org.joda.time.TestMutableDateTime_Sets#testSetDate_RI2 AssertionFailedError ex...
  org.joda.time.TestMutableDateTime_Sets#testSetDate_RI_different1 AssertionFailedError
  org.joda.time.TestMutableDateTime_Sets#testSetDate_RI_different2 AssertionFailedError
  org.joda.time.TestMutableDateTime_Sets#testSetDate_RI_same AssertionFailedError
  org.joda.time.TestMutableDateTime_Sets#testSetDate_int_int_int1 AssertionFailedError
  org.joda.time.TestMutableDateTime_Sets#testSetDate_long1 AssertionFailedError ...
  org.joda.time.TestMutableDateTime_Sets#testSetDayOfMonth_int1 ComparisonFailure
  org.joda.time.TestMutableDateTime_Sets#testSetDayOfMonth_int2 ComparisonFailure
  org.joda.time.TestMutableDateTime_Sets#testSetDayOfWeek_int1 ComparisonFailure
  org.joda.time.TestMutableDateTime_Sets#testSetDayOfWeek_int2 ComparisonFailure
  org.joda.time.TestMutableDateTime_Sets#testSetDayOfYear_int1 ComparisonFailure
  org.joda.time.TestMutableDateTime_Sets#testSetDayOfYear_int2 ComparisonFailure
  org.joda.time.TestMutableDateTime_Sets#testSetHourOfDay_int1 ComparisonFailure
  org.joda.time.TestMutableDateTime_Sets#testSetHourOfDay_int2 ComparisonFailure
  org.joda.time.TestMutableDateTime_Sets#testSetMilliOfDay_int2 ComparisonFailure
  org.joda.time.TestMutableDateTime_Sets#testSetMilliOfSecond_int1 ComparisonFailure
  org.joda.time.TestMutableDateTime_Sets#testSetMilliOfSecond_int2 ComparisonFailure
  org.joda.time.TestMutableDateTime_Sets#testSetMinuteOfDay_int1 ComparisonFailure
  org.joda.time.TestMutableDateTime_Sets#testSetMinuteOfDay_int2 ComparisonFailure
  org.joda.time.TestMutableDateTime_Sets#testSetMinuteOfHour_int1 ComparisonFailure
  org.joda.time.TestMutableDateTime_Sets#testSetMinuteOfHour_int2 ComparisonFailure
  org.joda.time.TestMutableDateTime_Sets#testSetMonthOfYear_int1 ComparisonFailure
  org.joda.time.TestMutableDateTime_Sets#testSetMonthOfYear_int2 ComparisonFailure
  org.joda.time.TestMutableDateTime_Sets#testSetSecondOfDay_int1 ComparisonFailure
  org.joda.time.TestMutableDateTime_Sets#testSetSecondOfDay_int2 ComparisonFailure
  org.joda.time.TestMutableDateTime_Sets#testSetSecondOfMinute_int1 ComparisonFailure
  org.joda.time.TestMutableDateTime_Sets#testSetSecondOfMinute_int2 ComparisonFailure
  org.joda.time.TestMutableDateTime_Sets#testSetTime_Object3 AssertionFailedError
  org.joda.time.TestMutableDateTime_Sets#testSetTime_RI1 AssertionFailedError ex...
  org.joda.time.TestMutableDateTime_Sets#testSetTime_long1 AssertionFailedError ...
  org.joda.time.TestMutableDateTime_Sets#testSetWeekOfWeekyear_int1 ComparisonFailure
  org.joda.time.TestMutableDateTime_Sets#testSetWeekOfWeekyear_int2 ComparisonFailure
  org.joda.time.TestMutableDateTime_Sets#testSetWeekyear_int1 ComparisonFailure ...
  org.joda.time.TestMutableDateTime_Sets#testSetYear_int1 ComparisonFailure expe...
  org.joda.time.TestMutableInterval_Basics#testToString ComparisonFailure expect...
  org.joda.time.TestMutablePeriod_Constructors#testConstructor_RI_RD1 AssertionFailedError
  org.joda.time.TestMutablePeriod_Constructors#testConstructor_RI_RD_PeriodType1 AssertionFailedError
  org.joda.time.TestMutablePeriod_Constructors#testConstructor_RI_RI1 AssertionFailedError
  org.joda.time.TestMutablePeriod_Constructors#testConstructor_RI_RI2 AssertionFailedError
  org.joda.time.TestMutablePeriod_Constructors#testConstructor_RI_RI3 AssertionFailedError
  org.joda.time.TestMutablePeriod_Constructors#testConstructor_RI_RI4 AssertionFailedError
  org.joda.time.TestMutablePeriod_Constructors#testConstructor_RI_RI_PeriodType1 AssertionFailedError
  org.joda.time.TestMutablePeriod_Constructors#testConstructor_RI_RI_PeriodType2 AssertionFailedError
  org.joda.time.TestMutablePeriod_Constructors#testConstructor_RI_RI_PeriodType3 AssertionFailedError
  org.joda.time.TestMutablePeriod_Constructors#testConstructor_RI_RI_PeriodType4 AssertionFailedError
  org.joda.time.TestMutablePeriod_Constructors#testConstructor_long_long1 AssertionFailedError
  org.joda.time.TestMutablePeriod_Constructors#testConstructor_long_long2 AssertionFailedError
  org.joda.time.TestMutablePeriod_Constructors#testConstructor_long_long_Chronology1 AssertionFailedError
  org.joda.time.TestMutablePeriod_Constructors#testConstructor_long_long_Chronology2 AssertionFailedError
  org.joda.time.TestMutablePeriod_Constructors#testConstructor_long_long_PeriodType1 AssertionFailedError
  org.joda.time.TestMutablePeriod_Constructors#testConstructor_long_long_PeriodType2 AssertionFailedError
  org.joda.time.TestMutablePeriod_Constructors#testConstructor_long_long_PeriodType3 AssertionFailedError
  org.joda.time.TestMutablePeriod_Constructors#testConstructor_long_long_PeriodType_Chronology1 AssertionFailedError
  org.joda.time.TestMutablePeriod_Constructors#testConstructor_long_long_PeriodType_Chronology2 AssertionFailedError
  org.joda.time.TestMutablePeriod_Updates#testAdd_RInterval2 AssertionFailedError
  org.joda.time.TestMutablePeriod_Updates#testAdd_RInterval4 AssertionFailedError
  org.joda.time.TestMutablePeriod_Updates#testSetPeriod_RI_RI1 AssertionFailedError
  org.joda.time.TestMutablePeriod_Updates#testSetPeriod_RI_RI2 AssertionFailedError
  org.joda.time.TestMutablePeriod_Updates#testSetPeriod_RInterval1 AssertionFailedError
  org.joda.time.TestMutablePeriod_Updates#testSetPeriod_long_long1 AssertionFailedError
  org.joda.time.TestMutablePeriod_Updates#testSetPeriod_long_long2 AssertionFailedError
  org.joda.time.TestMutablePeriod_Updates#testSetPeriod_long_long_NoDays AssertionFailedError
  org.joda.time.TestMutablePeriod_Updates#testSetPeriod_long_long_NoHours AssertionFailedError
  org.joda.time.TestMutablePeriod_Updates#testSetPeriod_long_long_NoMillis AssertionFailedError
  org.joda.time.TestMutablePeriod_Updates#testSetPeriod_long_long_NoMinutes AssertionFailedError
  org.joda.time.TestMutablePeriod_Updates#testSetPeriod_long_long_NoMonths AssertionFailedError
  org.joda.time.TestMutablePeriod_Updates#testSetPeriod_long_long_NoSeconds AssertionFailedError
  org.joda.time.TestMutablePeriod_Updates#testSetPeriod_long_long_NoWeeks AssertionFailedError
  org.joda.time.TestMutablePeriod_Updates#testSetPeriod_long_long_NoYears AssertionFailedError
  org.joda.time.TestPeriod_Constructors#testConstructor_RD_RI1 AssertionFailedError
  org.joda.time.TestPeriod_Constructors#testConstructor_RD_RI_PeriodType1 AssertionFailedError
  org.joda.time.TestPeriod_Constructors#testConstructor_RI_RD1 AssertionFailedError
  org.joda.time.TestPeriod_Constructors#testConstructor_RI_RD_PeriodType1 AssertionFailedError
  org.joda.time.TestPeriod_Constructors#testConstructor_RI_RI1 AssertionFailedError
  org.joda.time.TestPeriod_Constructors#testConstructor_RI_RI2 AssertionFailedError
  org.joda.time.TestPeriod_Constructors#testConstructor_RI_RI3 AssertionFailedError
  org.joda.time.TestPeriod_Constructors#testConstructor_RI_RI4 AssertionFailedError
  org.joda.time.TestPeriod_Constructors#testConstructor_RI_RI_PeriodType1 AssertionFailedError
  org.joda.time.TestPeriod_Constructors#testConstructor_RI_RI_PeriodType2 AssertionFailedError
  org.joda.time.TestPeriod_Constructors#testConstructor_RI_RI_PeriodType3 AssertionFailedError
  org.joda.time.TestPeriod_Constructors#testConstructor_RI_RI_PeriodType4 AssertionFailedError
  org.joda.time.TestPeriod_Constructors#testConstructor_long_long1 AssertionFailedError
  org.joda.time.TestPeriod_Constructors#testConstructor_long_long2 AssertionFailedError
  org.joda.time.TestPeriod_Constructors#testConstructor_long_long_Chronology1 AssertionFailedError
  org.joda.time.TestPeriod_Constructors#testConstructor_long_long_Chronology2 AssertionFailedError
  org.joda.time.TestPeriod_Constructors#testConstructor_long_long_PeriodType1 AssertionFailedError
  org.joda.time.TestPeriod_Constructors#testConstructor_long_long_PeriodType2 AssertionFailedError
  org.joda.time.TestPeriod_Constructors#testConstructor_long_long_PeriodType3 AssertionFailedError
  org.joda.time.TestPeriod_Constructors#testConstructor_long_long_PeriodType_Chronology1 AssertionFailedError
  org.joda.time.TestPeriod_Constructors#testConstructor_long_long_PeriodType_Chronology2 AssertionFailedError
  org.joda.time.TestPeriod_Constructors#testToPeriod_PeriodType3 AssertionFailedError
  org.joda.time.TestStringConvert#testDateTime ComparisonFailure expected:<2010-...
  org.joda.time.TestStringConvert#testMutableDateTime ComparisonFailure expected...
  org.joda.time.TestTimeOfDay_Constructors#testConstructor_DateTimeZone AssertionFailedError
  org.joda.time.TestTimeOfDay_Constructors#testConstructor_nullDateTimeZone AssertionFailedError
  org.joda.time.TestYearMonthDay_Basics#testToDateTime_TOD AssertionFailedError ...
  org.joda.time.TestYearMonthDay_Basics#testToDateTime_TOD_Zone AssertionFailedError
  org.joda.time.TestYearMonthDay_Basics#testToDateTime_TOD_nullZone AssertionFailedError
  org.joda.time.chrono.TestGJChronology#testParseEquivalence AssertionFailedError
  org.joda.time.chrono.TestISOChronology#testMaxYear AssertionFailedError expect...
  org.joda.time.chrono.TestISOChronology#testMinYear AssertionFailedError expect...
  org.joda.time.convert.TestStringConverter#testGetInstantMillis_Object AssertionFailedError
  org.joda.time.convert.TestStringConverter#testGetInstantMillis_Object_Chronology AssertionFailedError
  org.joda.time.convert.TestStringConverter#testGetInstantMillis_Object_Zone AssertionFailedError
  org.joda.time.format.TestDateTimeFormat#testFormat_fractionOfSecond ComparisonFailure
  org.joda.time.format.TestDateTimeFormat#testFormat_fractionOfSecondLong ComparisonFailure
  org.joda.time.format.TestDateTimeFormat#testFormat_samples ComparisonFailure e...
  org.joda.time.format.TestDateTimeFormat#testFormat_second ComparisonFailure 20...
  org.joda.time.format.TestDateTimeFormatter#testPrint_appendableMethods ComparisonFailure
  org.joda.time.format.TestDateTimeFormatter#testPrint_bufferMethods ComparisonFailure
  org.joda.time.format.TestDateTimeFormatter#testPrint_chrono ComparisonFailure ...
  org.joda.time.format.TestDateTimeFormatter#testPrint_chrono_and_zone ComparisonFailure
  org.joda.time.format.TestDateTimeFormatter#testPrint_locale ComparisonFailure ...
  org.joda.time.format.TestDateTimeFormatter#testPrint_simple ComparisonFailure ...
  org.joda.time.format.TestDateTimeFormatter#testPrint_writerMethods ComparisonFailure
  org.joda.time.format.TestDateTimeFormatter#testPrint_zone ComparisonFailure ex...
  org.joda.time.format.TestDateTimeFormatter#testZoneNameNearTransition ComparisonFailure
  org.joda.time.format.TestDateTimeFormatter#testZoneShortNameNearTransition ComparisonFailure
  org.joda.time.format.TestISODateTimeFormat#testFormat_basicDateTime ComparisonFailure
  org.joda.time.format.TestISODateTimeFormat#testFormat_basicDateTimeNoMillis ComparisonFailure
  org.joda.time.format.TestISODateTimeFormat#testFormat_basicOrdinalDateTime ComparisonFailure
  org.joda.time.format.TestISODateTimeFormat#testFormat_basicOrdinalDateTimeNoMillis ComparisonFailure
  org.joda.time.format.TestISODateTimeFormat#testFormat_basicTTime ComparisonFailure
  org.joda.time.format.TestISODateTimeFormat#testFormat_basicTTimeNoMillis ComparisonFailure
  org.joda.time.format.TestISODateTimeFormat#testFormat_basicTime ComparisonFailure
  org.joda.time.format.TestISODateTimeFormat#testFormat_basicTimeNoMillis ComparisonFailure
  org.joda.time.format.TestISODateTimeFormat#testFormat_basicWeekDateTime ComparisonFailure
  org.joda.time.format.TestISODateTimeFormat#testFormat_basicWeekDateTimeNoMillis ComparisonFailure
  org.joda.time.format.TestISODateTimeFormat#testFormat_dateHourMinuteSecond ComparisonFailure
  org.joda.time.format.TestISODateTimeFormat#testFormat_dateHourMinuteSecondFraction ComparisonFailure
  org.joda.time.format.TestISODateTimeFormat#testFormat_dateHourMinuteSecondMillis ComparisonFailure
  org.joda.time.format.TestISODateTimeFormat#testFormat_dateTime ComparisonFailure
  org.joda.time.format.TestISODateTimeFormat#testFormat_dateTimeNoMillis ComparisonFailure
  org.joda.time.format.TestISODateTimeFormat#testFormat_hourMinuteSecond ComparisonFailure
  org.joda.time.format.TestISODateTimeFormat#testFormat_hourMinuteSecondFraction ComparisonFailure
  org.joda.time.format.TestISODateTimeFormat#testFormat_hourMinuteSecondMillis ComparisonFailure
  org.joda.time.format.TestISODateTimeFormat#testFormat_ordinalDateTime ComparisonFailure
  org.joda.time.format.TestISODateTimeFormat#testFormat_ordinalDateTimeNoMillis ComparisonFailure
  org.joda.time.format.TestISODateTimeFormat#testFormat_tTime ComparisonFailure ...
  org.joda.time.format.TestISODateTimeFormat#testFormat_tTimeNoMillis ComparisonFailure
  org.joda.time.format.TestISODateTimeFormat#testFormat_time ComparisonFailure e...
  org.joda.time.format.TestISODateTimeFormat#testFormat_timeNoMillis ComparisonFailure
  org.joda.time.format.TestISODateTimeFormat#testFormat_weekDateTime ComparisonFailure
  org.joda.time.format.TestISODateTimeFormat#testFormat_weekDateTimeNoMillis ComparisonFailure
  org.joda.time.format.TestISODateTimeFormatParsing#test_basicDateTime AssertionFailedError
  org.joda.time.format.TestISODateTimeFormatParsing#test_basicOrdinalDateTime AssertionFailedError
  org.joda.time.format.TestISODateTimeFormatParsing#test_basicTTime AssertionFailedError
  org.joda.time.format.TestISODateTimeFormatParsing#test_basicTime AssertionFailedError
  org.joda.time.format.TestISODateTimeFormatParsing#test_basicWeekDateTime AssertionFailedError
  org.joda.time.format.TestISODateTimeFormatParsing#test_dateTime AssertionFailedError
  org.joda.time.format.TestISODateTimeFormatParsing#test_hourMinuteSecondFraction AssertionFailedError
  org.joda.time.format.TestISODateTimeFormatParsing#test_hourMinuteSecondMillis AssertionFailedError
  org.joda.time.format.TestISODateTimeFormatParsing#test_ordinalDateTime AssertionFailedError
  org.joda.time.format.TestISODateTimeFormatParsing#test_tTime AssertionFailedError
  org.joda.time.format.TestISODateTimeFormatParsing#test_time AssertionFailedError
  org.joda.time.format.TestISODateTimeFormatParsing#test_timeParser AssertionFailedError
  org.joda.time.format.TestISODateTimeFormatParsing#test_weekDateTime AssertionFailedError

Tests run: 4157, Failures: 264, Errors: 0, Skipped: 0

[INFO] ------------------------------------------------------------------------
[INFO] BUILD FAILURE
[INFO] ------------------------------------------------------------------------
[INFO] Total time: 16.065s
[INFO] Finished at: Wed Aug 05 22:15:01 BST 2015
[INFO] Final Memory: 9M/214M
[INFO] ------------------------------------------------------------------------
[ERROR] Failed to execute goal org.apache.maven.plugins:maven-surefire-plugin:2.18.1:test (default-test) on project joda-time: There are test failures.
[ERROR] 
[ERROR] Please refer to /home/perham/Study/LittleDarwin/Cases/joda-time-2.8.1/target/surefire-reports for the individual test results.
[ERROR] -> [Help 1]
[ERROR] 
[ERROR] To see the full stack trace of the errors, re-run Maven with the -e switch.
[ERROR] Re-run Maven using the -X switch to enable full debug logging.
[ERROR] 
[ERROR] For more information about the errors and possible solutions, please read the following articles:
[ERROR] [Help 1] http://cwiki.apache.org/confluence/display/MAVEN/MojoFailureException
