[INFO] Scanning for projects...
[INFO]                                                                         
[INFO] ------------------------------------------------------------------------
[INFO] Building Joda-Time 2.8.1
[INFO] ------------------------------------------------------------------------
[INFO] 
[INFO] --- maven-resources-plugin:2.7:resources (default-resources) @ joda-time ---
[INFO] Using 'UTF-8' encoding to copy filtered resources.
[INFO] Copying 2 resources to META-INF
[INFO] Copying 10 resources
[INFO] 
[INFO] --- maven-compiler-plugin:3.3:compile (default-compile) @ joda-time ---
[INFO] Changes detected - recompiling the module!
[INFO] Compiling 166 source files to /home/perham/Study/LittleDarwin/Cases/joda-time-2.8.1/target/classes
[INFO] 
[INFO] --- exec-maven-plugin:1.4.0:java (compile-tzdb) @ joda-time ---
Writing zoneinfo files
Writing ZoneInfoMap
[INFO] 
[INFO] --- maven-resources-plugin:2.7:testResources (default-testResources) @ joda-time ---
[INFO] Using 'UTF-8' encoding to copy filtered resources.
[INFO] Copying 34 resources
[INFO] 
[INFO] --- maven-compiler-plugin:3.3:testCompile (default-testCompile) @ joda-time ---
[INFO] Nothing to compile - all classes are up to date
[INFO] 
[INFO] --- maven-surefire-plugin:2.18.1:test (default-test) @ joda-time ---
[INFO] Surefire report directory: /home/perham/Study/LittleDarwin/Cases/joda-time-2.8.1/target/surefire-reports

-------------------------------------------------------
 T E S T S
-------------------------------------------------------
Running org.joda.time.TestAllPackages

TestBuddhistChronology.testCalendar

TestCopticChronology.testCalendar

TestEthiopicChronology.testCalendar

TestIslamicChronology.testCalendar

Testing Gregorian chronology over 1000 iterations
Failure on weekyear.set
org.joda.time.chrono.gj.TestGJWeekyearField
	vs. org.joda.time.chrono.BasicWeekyearDateTimeField
Datetime: Sat 1960-03-26T03:29:34.468Z / 1960-W11-6
Millis from 1970: -308262625532
Sat -0049-03-24T03:29:34.468Z / -49-W12-6 != Sat -0049-03-17T03:29:34.468Z / -49-W11-6
-63706422625532 != -63707027425532
Original value as reported by first field: 1960
Original value as reported by second field: 1960
First new value as reported by first field: -49
First new value as reported by second field: -49
Second new value as reported by first field: -49
Second new value as reported by second field: -49
Value to set for first field: -49
Value to set for second field: -49
Failure index: 0
Test millis: -308262625532
Test value: -49
Test millis2: -46922557997542

Testing Julian chronology over 1000 iterations
Failure on weekyear.set
org.joda.time.chrono.gj.TestJulianWeekyearField
	vs. org.joda.time.field.SkipDateTimeField
Datetime: Sat 1960-03-13T03:29:34.468Z / 1960-W11-6
Millis from 1970: -308262625532
Sat -0049-03-17T03:29:34.468Z / -49-W9-6 != Sat -0049-03-31T03:29:34.468Z / -49-W11-6
-63675577825532 != -63674368225532
Original value as reported by first field: 1960
Original value as reported by second field: 1960
First new value as reported by first field: -49
First new value as reported by second field: -49
Second new value as reported by first field: -49
Second new value as reported by second field: -49
Value to set for first field: -49
Value to set for second field: -49
Failure index: 0
Test millis: -308262625532
Test value: -49
Test millis2: -46922557997542
Writing zoneinfo files
Writing ZoneInfoMap
Tests run: 4157, Failures: 25, Errors: 2, Skipped: 0, Time elapsed: 5.814 sec <<< FAILURE! - in org.joda.time.TestAllPackages
testWithers(org.joda.time.TestDateTime_Basics)  Time elapsed: 0.005 sec  <<< FAILURE!
junit.framework.AssertionFailedError: expected:<15> but was:<29>
	at junit.framework.Assert.fail(Assert.java:47)
	at junit.framework.Assert.failNotEquals(Assert.java:280)
	at junit.framework.Assert.assertEquals(Assert.java:64)
	at junit.framework.Assert.assertEquals(Assert.java:198)
	at junit.framework.Assert.assertEquals(Assert.java:204)
	at org.joda.time.TestDateTime_Basics.check(TestDateTime_Basics.java:1286)
	at org.joda.time.TestDateTime_Basics.testWithers(TestDateTime_Basics.java:260)

testPropertyGetMaxMinValuesWeekOfWeekyear(org.joda.time.TestDateTime_Properties)  Time elapsed: 0.001 sec  <<< FAILURE!
junit.framework.AssertionFailedError: expected:<53> but was:<54>
	at junit.framework.Assert.fail(Assert.java:47)
	at junit.framework.Assert.failNotEquals(Assert.java:280)
	at junit.framework.Assert.assertEquals(Assert.java:64)
	at junit.framework.Assert.assertEquals(Assert.java:198)
	at junit.framework.Assert.assertEquals(Assert.java:204)
	at org.joda.time.TestDateTime_Properties.testPropertyGetMaxMinValuesWeekOfWeekyear(TestDateTime_Properties.java:864)

testPropertyAddWrapFieldWeekOfWeekyear(org.joda.time.TestDateTime_Properties)  Time elapsed: 0.004 sec  <<< FAILURE!
junit.framework.ComparisonFailure: expected:<200[3-12-29]T00:00:00.000Z> but was:<200[5-01-03]T00:00:00.000Z>
	at junit.framework.Assert.assertEquals(Assert.java:81)
	at junit.framework.Assert.assertEquals(Assert.java:87)
	at org.joda.time.TestDateTime_Properties.testPropertyAddWrapFieldWeekOfWeekyear(TestDateTime_Properties.java:900)

testPropertySetWeekOfWeekyear(org.joda.time.TestDateTime_Properties)  Time elapsed: 0 sec  <<< FAILURE!
junit.framework.AssertionFailedError
	at junit.framework.Assert.fail(Assert.java:47)
	at junit.framework.Assert.fail(Assert.java:53)
	at org.joda.time.TestDateTime_Properties.testPropertySetWeekOfWeekyear(TestDateTime_Properties.java:914)

testPropertyAddWrapFieldWeekOfWeekyear(org.joda.time.TestMutableDateTime_Properties)  Time elapsed: 0.001 sec  <<< FAILURE!
junit.framework.ComparisonFailure: expected:<200[3-12-29]T00:00:00.000Z> but was:<200[5-01-03]T00:00:00.000Z>
	at junit.framework.Assert.assertEquals(Assert.java:81)
	at junit.framework.Assert.assertEquals(Assert.java:87)
	at org.joda.time.TestMutableDateTime_Properties.testPropertyAddWrapFieldWeekOfWeekyear(TestMutableDateTime_Properties.java:426)

testWithers(org.joda.time.TestDateMidnight_Basics)  Time elapsed: 0 sec  <<< FAILURE!
junit.framework.AssertionFailedError: expected:<15> but was:<29>
	at junit.framework.Assert.fail(Assert.java:47)
	at junit.framework.Assert.failNotEquals(Assert.java:280)
	at junit.framework.Assert.assertEquals(Assert.java:64)
	at junit.framework.Assert.assertEquals(Assert.java:198)
	at junit.framework.Assert.assertEquals(Assert.java:204)
	at org.joda.time.TestDateMidnight_Basics.check(TestDateMidnight_Basics.java:1019)
	at org.joda.time.TestDateMidnight_Basics.testWithers(TestDateMidnight_Basics.java:248)

testWithers(org.joda.time.TestLocalDateTime_Basics)  Time elapsed: 0.001 sec  <<< FAILURE!
junit.framework.AssertionFailedError: expected:<15> but was:<29>
	at junit.framework.Assert.fail(Assert.java:47)
	at junit.framework.Assert.failNotEquals(Assert.java:280)
	at junit.framework.Assert.assertEquals(Assert.java:64)
	at junit.framework.Assert.assertEquals(Assert.java:198)
	at junit.framework.Assert.assertEquals(Assert.java:204)
	at org.joda.time.TestLocalDateTime_Basics.check(TestLocalDateTime_Basics.java:1103)
	at org.joda.time.TestLocalDateTime_Basics.testWithers(TestLocalDateTime_Basics.java:745)

testWithers(org.joda.time.TestLocalDate_Basics)  Time elapsed: 0 sec  <<< FAILURE!
junit.framework.AssertionFailedError: expected:<15> but was:<29>
	at junit.framework.Assert.fail(Assert.java:47)
	at junit.framework.Assert.failNotEquals(Assert.java:280)
	at junit.framework.Assert.assertEquals(Assert.java:64)
	at junit.framework.Assert.assertEquals(Assert.java:198)
	at junit.framework.Assert.assertEquals(Assert.java:204)
	at org.joda.time.TestLocalDate_Basics.check(TestLocalDate_Basics.java:1157)
	at org.joda.time.TestLocalDate_Basics.testWithers(TestLocalDate_Basics.java:647)

testWOW(org.joda.time.TestDateTimeComparator)  Time elapsed: 0.001 sec  <<< FAILURE!
junit.framework.AssertionFailedError: WOWM1a expected:<-1> but was:<0>
	at junit.framework.Assert.fail(Assert.java:47)
	at junit.framework.Assert.failNotEquals(Assert.java:280)
	at junit.framework.Assert.assertEquals(Assert.java:64)
	at junit.framework.Assert.assertEquals(Assert.java:198)
	at org.joda.time.TestDateTimeComparator.testWOW(TestDateTimeComparator.java:525)

testWOYY(org.joda.time.TestDateTimeComparator)  Time elapsed: 0.001 sec  <<< FAILURE!
junit.framework.AssertionFailedError: YOYYM1 expected:<-1> but was:<0>
	at junit.framework.Assert.fail(Assert.java:47)
	at junit.framework.Assert.failNotEquals(Assert.java:280)
	at junit.framework.Assert.assertEquals(Assert.java:64)
	at junit.framework.Assert.assertEquals(Assert.java:198)
	at org.joda.time.TestDateTimeComparator.testWOYY(TestDateTimeComparator.java:547)

testKeyYears(org.joda.time.chrono.TestBuddhistChronology)  Time elapsed: 0.001 sec  <<< FAILURE!
junit.framework.AssertionFailedError: expected:<2126> but was:<2125>
	at junit.framework.Assert.fail(Assert.java:47)
	at junit.framework.Assert.failNotEquals(Assert.java:280)
	at junit.framework.Assert.assertEquals(Assert.java:64)
	at junit.framework.Assert.assertEquals(Assert.java:198)
	at junit.framework.Assert.assertEquals(Assert.java:204)
	at org.joda.time.chrono.TestBuddhistChronology.testKeyYears(TestBuddhistChronology.java:322)

testCutoverAddWeekyears(org.joda.time.chrono.TestGJChronology)  Time elapsed: 0.001 sec  <<< ERROR!
org.joda.time.IllegalFieldValueException: Cannot parse "1582-W01-1": Value 1582 for weekyear is not supported
	at org.joda.time.chrono.GJChronology$CutoverField.set(GJChronology.java:735)
	at org.joda.time.format.DateTimeParserBucket$SavedField.set(DateTimeParserBucket.java:568)
	at org.joda.time.format.DateTimeParserBucket.computeMillis(DateTimeParserBucket.java:447)
	at org.joda.time.format.DateTimeParserBucket.doParseMillis(DateTimeParserBucket.java:182)
	at org.joda.time.format.DateTimeFormatter.parseMillis(DateTimeFormatter.java:780)
	at org.joda.time.convert.StringConverter.getInstantMillis(StringConverter.java:65)
	at org.joda.time.base.BaseDateTime.<init>(BaseDateTime.java:175)
	at org.joda.time.DateTime.<init>(DateTime.java:302)
	at org.joda.time.chrono.TestGJChronology.testAdd(TestGJChronology.java:482)
	at org.joda.time.chrono.TestGJChronology.testCutoverAddWeekyears(TestGJChronology.java:401)

testCutoverAddWeeks(org.joda.time.chrono.TestGJChronology)  Time elapsed: 0.001 sec  <<< ERROR!
org.joda.time.IllegalFieldValueException: Cannot parse "1582-W01-1": Value 1582 for weekyear is not supported
	at org.joda.time.chrono.GJChronology$CutoverField.set(GJChronology.java:735)
	at org.joda.time.format.DateTimeParserBucket$SavedField.set(DateTimeParserBucket.java:568)
	at org.joda.time.format.DateTimeParserBucket.computeMillis(DateTimeParserBucket.java:447)
	at org.joda.time.format.DateTimeParserBucket.doParseMillis(DateTimeParserBucket.java:182)
	at org.joda.time.format.DateTimeFormatter.parseMillis(DateTimeFormatter.java:780)
	at org.joda.time.convert.StringConverter.getInstantMillis(StringConverter.java:65)
	at org.joda.time.base.BaseDateTime.<init>(BaseDateTime.java:175)
	at org.joda.time.DateTime.<init>(DateTime.java:302)
	at org.joda.time.chrono.TestGJChronology.testAdd(TestGJChronology.java:482)
	at org.joda.time.chrono.TestGJChronology.testCutoverAddWeeks(TestGJChronology.java:448)

test_plusWeekyears_positiveToZero_crossCutover(org.joda.time.chrono.TestGJDate)  Time elapsed: 0.001 sec  <<< FAILURE!
junit.framework.AssertionFailedError: expected:<-0001-06-28> but was:<-0001-06-21>
	at junit.framework.Assert.fail(Assert.java:47)
	at junit.framework.Assert.failNotEquals(Assert.java:280)
	at junit.framework.Assert.assertEquals(Assert.java:64)
	at junit.framework.Assert.assertEquals(Assert.java:71)
	at org.joda.time.chrono.TestGJDate.test_plusWeekyears_positiveToZero_crossCutover(TestGJDate.java:118)

testChronology(org.joda.time.chrono.gj.MainTest)  Time elapsed: 0.004 sec  <<< FAILURE!
junit.framework.AssertionFailedError
	at junit.framework.Assert.fail(Assert.java:47)
	at org.joda.time.chrono.gj.MainTest.testChronology(MainTest.java:158)

testChronology(org.joda.time.chrono.gj.MainTest)  Time elapsed: 0.006 sec  <<< FAILURE!
junit.framework.AssertionFailedError
	at junit.framework.Assert.fail(Assert.java:47)
	at org.joda.time.chrono.gj.MainTest.testChronology(MainTest.java:158)

testParseLocalDate_weekyear_month_week_2010(org.joda.time.format.TestDateTimeFormatter)  Time elapsed: 0.001 sec  <<< FAILURE!
junit.framework.AssertionFailedError: expected:<2010-01-04> but was:<2009-01-05>
	at junit.framework.Assert.fail(Assert.java:47)
	at junit.framework.Assert.failNotEquals(Assert.java:280)
	at junit.framework.Assert.assertEquals(Assert.java:64)
	at junit.framework.Assert.assertEquals(Assert.java:71)
	at org.joda.time.format.TestDateTimeFormatter.testParseLocalDate_weekyear_month_week_2010(TestDateTimeFormatter.java:428)

testParseLocalDate_weekyear_month_week_2011(org.joda.time.format.TestDateTimeFormatter)  Time elapsed: 0 sec  <<< FAILURE!
junit.framework.AssertionFailedError: expected:<2011-01-03> but was:<2011-01-17>
	at junit.framework.Assert.fail(Assert.java:47)
	at junit.framework.Assert.failNotEquals(Assert.java:280)
	at junit.framework.Assert.assertEquals(Assert.java:64)
	at junit.framework.Assert.assertEquals(Assert.java:71)
	at org.joda.time.format.TestDateTimeFormatter.testParseLocalDate_weekyear_month_week_2011(TestDateTimeFormatter.java:434)

testParseLocalDate_weekyear_month_week_2012(org.joda.time.format.TestDateTimeFormatter)  Time elapsed: 0 sec  <<< FAILURE!
junit.framework.AssertionFailedError: expected:<2012-01-02> but was:<2012-01-16>
	at junit.framework.Assert.fail(Assert.java:47)
	at junit.framework.Assert.failNotEquals(Assert.java:280)
	at junit.framework.Assert.assertEquals(Assert.java:64)
	at junit.framework.Assert.assertEquals(Assert.java:71)
	at org.joda.time.format.TestDateTimeFormatter.testParseLocalDate_weekyear_month_week_2012(TestDateTimeFormatter.java:440)

testParseLocalDate_year_month_week_2010(org.joda.time.format.TestDateTimeFormatter)  Time elapsed: 0 sec  <<< FAILURE!
junit.framework.AssertionFailedError: expected:<2010-01-04> but was:<2010-01-11>
	at junit.framework.Assert.fail(Assert.java:47)
	at junit.framework.Assert.failNotEquals(Assert.java:280)
	at junit.framework.Assert.assertEquals(Assert.java:64)
	at junit.framework.Assert.assertEquals(Assert.java:71)
	at org.joda.time.format.TestDateTimeFormatter.testParseLocalDate_year_month_week_2010(TestDateTimeFormatter.java:454)

testParseLocalDate_year_month_week_2011(org.joda.time.format.TestDateTimeFormatter)  Time elapsed: 0.005 sec  <<< FAILURE!
junit.framework.AssertionFailedError: expected:<2011-01-03> but was:<2010-01-11>
	at junit.framework.Assert.fail(Assert.java:47)
	at junit.framework.Assert.failNotEquals(Assert.java:280)
	at junit.framework.Assert.assertEquals(Assert.java:64)
	at junit.framework.Assert.assertEquals(Assert.java:71)
	at org.joda.time.format.TestDateTimeFormatter.testParseLocalDate_year_month_week_2011(TestDateTimeFormatter.java:460)

testParseLocalDate_year_month_week_2012(org.joda.time.format.TestDateTimeFormatter)  Time elapsed: 0 sec  <<< FAILURE!
junit.framework.AssertionFailedError: expected:<2012-01-02> but was:<2011-01-10>
	at junit.framework.Assert.fail(Assert.java:47)
	at junit.framework.Assert.failNotEquals(Assert.java:280)
	at junit.framework.Assert.assertEquals(Assert.java:64)
	at junit.framework.Assert.assertEquals(Assert.java:71)
	at org.joda.time.format.TestDateTimeFormatter.testParseLocalDate_year_month_week_2012(TestDateTimeFormatter.java:466)

testParseLocalDate_year_month_week_2016(org.joda.time.format.TestDateTimeFormatter)  Time elapsed: 0 sec  <<< FAILURE!
junit.framework.AssertionFailedError: expected:<2016-01-04> but was:<2016-01-11>
	at junit.framework.Assert.fail(Assert.java:47)
	at junit.framework.Assert.failNotEquals(Assert.java:280)
	at junit.framework.Assert.assertEquals(Assert.java:64)
	at junit.framework.Assert.assertEquals(Assert.java:71)
	at org.joda.time.format.TestDateTimeFormatter.testParseLocalDate_year_month_week_2016(TestDateTimeFormatter.java:490)

testFormat_weekyearOfEra_twoDigit(org.joda.time.format.TestDateTimeFormat)  Time elapsed: 0.001 sec  <<< FAILURE!
junit.framework.AssertionFailedError: expected:<1922-01-02T00:00:00.000Z> but was:<1921-01-17T00:00:00.000Z>
	at junit.framework.Assert.fail(Assert.java:47)
	at junit.framework.Assert.failNotEquals(Assert.java:280)
	at junit.framework.Assert.assertEquals(Assert.java:64)
	at junit.framework.Assert.assertEquals(Assert.java:71)
	at org.joda.time.format.TestDateTimeFormat.testFormat_weekyearOfEra_twoDigit(TestDateTimeFormat.java:395)

test_weekDate(org.joda.time.format.TestISODateTimeFormatParsing)  Time elapsed: 0.001 sec  <<< FAILURE!
junit.framework.AssertionFailedError: expected:<2006-01-25T00:00:00.000Z> but was:<2005-01-26T00:00:00.000Z>
	at junit.framework.Assert.fail(Assert.java:47)
	at junit.framework.Assert.failNotEquals(Assert.java:280)
	at junit.framework.Assert.assertEquals(Assert.java:64)
	at junit.framework.Assert.assertEquals(Assert.java:71)
	at org.joda.time.format.TestISODateTimeFormatParsing.assertParse(TestISODateTimeFormatParsing.java:841)
	at org.joda.time.format.TestISODateTimeFormatParsing.test_weekDate(TestISODateTimeFormatParsing.java:521)

test_weekDateTime(org.joda.time.format.TestISODateTimeFormatParsing)  Time elapsed: 0.002 sec  <<< FAILURE!
junit.framework.AssertionFailedError: expected:<2006-01-25T10:20:30.400Z> but was:<2005-01-26T10:20:30.400Z>
	at junit.framework.Assert.fail(Assert.java:47)
	at junit.framework.Assert.failNotEquals(Assert.java:280)
	at junit.framework.Assert.assertEquals(Assert.java:64)
	at junit.framework.Assert.assertEquals(Assert.java:71)
	at org.joda.time.format.TestISODateTimeFormatParsing.assertParse(TestISODateTimeFormatParsing.java:841)
	at org.joda.time.format.TestISODateTimeFormatParsing.test_weekDateTime(TestISODateTimeFormatParsing.java:537)

test_weekDateTimeNoMillis(org.joda.time.format.TestISODateTimeFormatParsing)  Time elapsed: 0 sec  <<< FAILURE!
junit.framework.AssertionFailedError: expected:<2006-01-25T10:20:30.000Z> but was:<2005-01-26T10:20:30.000Z>
	at junit.framework.Assert.fail(Assert.java:47)
	at junit.framework.Assert.failNotEquals(Assert.java:280)
	at junit.framework.Assert.assertEquals(Assert.java:64)
	at junit.framework.Assert.assertEquals(Assert.java:71)
	at org.joda.time.format.TestISODateTimeFormatParsing.assertParse(TestISODateTimeFormatParsing.java:841)
	at org.joda.time.format.TestISODateTimeFormatParsing.test_weekDateTimeNoMillis(TestISODateTimeFormatParsing.java:554)


Results :

Failed tests: 
  org.joda.time.TestDateMidnight_Basics#testWithers AssertionFailedError expecte...
  org.joda.time.TestDateTimeComparator#testWOW AssertionFailedError WOWM1a expec...
  org.joda.time.TestDateTimeComparator#testWOYY AssertionFailedError YOYYM1 expe...
  org.joda.time.TestDateTime_Basics#testWithers AssertionFailedError expected:<1...
  org.joda.time.TestDateTime_Properties#testPropertyAddWrapFieldWeekOfWeekyear ComparisonFailure
  org.joda.time.TestDateTime_Properties#testPropertyGetMaxMinValuesWeekOfWeekyear AssertionFailedError
  org.joda.time.TestDateTime_Properties#testPropertySetWeekOfWeekyear AssertionFailedError
  org.joda.time.TestLocalDateTime_Basics#testWithers AssertionFailedError expect...
  org.joda.time.TestLocalDate_Basics#testWithers AssertionFailedError expected:<...
  org.joda.time.TestMutableDateTime_Properties#testPropertyAddWrapFieldWeekOfWeekyear ComparisonFailure
  org.joda.time.chrono.TestBuddhistChronology#testKeyYears AssertionFailedError ...
  org.joda.time.chrono.TestGJDate#test_plusWeekyears_positiveToZero_crossCutover AssertionFailedError
org.joda.time.chrono.gj.MainTest.testChronology(org.joda.time.chrono.gj.MainTest)
  Run 1: org.joda.time.chrono.gj.MainTest#testChronology AssertionFailedError
  Run 2: org.joda.time.chrono.gj.MainTest#testChronology AssertionFailedError

  org.joda.time.format.TestDateTimeFormat#testFormat_weekyearOfEra_twoDigit AssertionFailedError
  org.joda.time.format.TestDateTimeFormatter#testParseLocalDate_weekyear_month_week_2010 AssertionFailedError
  org.joda.time.format.TestDateTimeFormatter#testParseLocalDate_weekyear_month_week_2011 AssertionFailedError
  org.joda.time.format.TestDateTimeFormatter#testParseLocalDate_weekyear_month_week_2012 AssertionFailedError
  org.joda.time.format.TestDateTimeFormatter#testParseLocalDate_year_month_week_2010 AssertionFailedError
  org.joda.time.format.TestDateTimeFormatter#testParseLocalDate_year_month_week_2011 AssertionFailedError
  org.joda.time.format.TestDateTimeFormatter#testParseLocalDate_year_month_week_2012 AssertionFailedError
  org.joda.time.format.TestDateTimeFormatter#testParseLocalDate_year_month_week_2016 AssertionFailedError
  org.joda.time.format.TestISODateTimeFormatParsing#test_weekDate AssertionFailedError
  org.joda.time.format.TestISODateTimeFormatParsing#test_weekDateTime AssertionFailedError
  org.joda.time.format.TestISODateTimeFormatParsing#test_weekDateTimeNoMillis AssertionFailedError
Tests in error: 
  org.joda.time.chrono.TestGJChronology#testCutoverAddWeeks IllegalFieldValueException
  org.joda.time.chrono.TestGJChronology#testCutoverAddWeekyears IllegalFieldValueException

Tests run: 4156, Failures: 24, Errors: 2, Skipped: 0

[INFO] ------------------------------------------------------------------------
[INFO] BUILD FAILURE
[INFO] ------------------------------------------------------------------------
[INFO] Total time: 15.944s
[INFO] Finished at: Wed Aug 05 22:09:55 BST 2015
[INFO] Final Memory: 9M/213M
[INFO] ------------------------------------------------------------------------
[ERROR] Failed to execute goal org.apache.maven.plugins:maven-surefire-plugin:2.18.1:test (default-test) on project joda-time: There are test failures.
[ERROR] 
[ERROR] Please refer to /home/perham/Study/LittleDarwin/Cases/joda-time-2.8.1/target/surefire-reports for the individual test results.
[ERROR] -> [Help 1]
[ERROR] 
[ERROR] To see the full stack trace of the errors, re-run Maven with the -e switch.
[ERROR] Re-run Maven using the -X switch to enable full debug logging.
[ERROR] 
[ERROR] For more information about the errors and possible solutions, please read the following articles:
[ERROR] [Help 1] http://cwiki.apache.org/confluence/display/MAVEN/MojoFailureException
